jclouds-notifications mailing list archives

Site index · List index
Message view « Date » · « Thread »
Top « Date » · « Thread »
From jenkins-no-re...@cloudbees.com
Subject Build failed in Jenkins: jclouds-cli #1180
Date Thu, 13 Oct 2016 18:28:26 GMT
See <https://jclouds.ci.cloudbees.com/job/jclouds-cli/1180/>

------------------------------------------
[...truncated 5099 lines...]
[INFO] --- maven-surefire-plugin:2.17:test (integration) @ jclouds-cli-assembly ---
[JENKINS] Recording test results
[INFO] 
[INFO] --- duplicate-finder-maven-plugin:1.1.1:check (default) @ jclouds-cli-assembly ---
[INFO] Skipping duplicate-finder execution!
[INFO] 
[INFO] --- maven-checkstyle-plugin:2.15:check (default) @ jclouds-cli-assembly ---
[INFO] 
[INFO] --- modernizer-maven-plugin:1.4.0:modernizer (modernizer) @ jclouds-cli-assembly ---
[INFO] 
[INFO] --- maven-install-plugin:2.4:install (default-install) @ jclouds-cli-assembly ---
[INFO] Installing <https://jclouds.ci.cloudbees.com/job/jclouds-cli/ws/assembly/target/jclouds-cli-assembly-2.0.0-SNAPSHOT.jar>
to /home/jenkins/.m2/repository/org/apache/jclouds/cli/jclouds-cli-assembly/2.0.0-SNAPSHOT/jclouds-cli-assembly-2.0.0-SNAPSHOT.jar
[INFO] Installing <https://jclouds.ci.cloudbees.com/job/jclouds-cli/ws/assembly/pom.xml>
to /home/jenkins/.m2/repository/org/apache/jclouds/cli/jclouds-cli-assembly/2.0.0-SNAPSHOT/jclouds-cli-assembly-2.0.0-SNAPSHOT.pom
[INFO] Installing <https://jclouds.ci.cloudbees.com/job/jclouds-cli/ws/assembly/target/jclouds-cli-assembly-2.0.0-SNAPSHOT-tests.jar>
to /home/jenkins/.m2/repository/org/apache/jclouds/cli/jclouds-cli-assembly/2.0.0-SNAPSHOT/jclouds-cli-assembly-2.0.0-SNAPSHOT-tests.jar
[INFO] Installing <https://jclouds.ci.cloudbees.com/job/jclouds-cli/ws/assembly/target/jclouds-cli-assembly-2.0.0-SNAPSHOT-sources.jar>
to /home/jenkins/.m2/repository/org/apache/jclouds/cli/jclouds-cli-assembly/2.0.0-SNAPSHOT/jclouds-cli-assembly-2.0.0-SNAPSHOT-sources.jar
[INFO] Installing <https://jclouds.ci.cloudbees.com/job/jclouds-cli/ws/assembly/target/jclouds-cli-2.0.0-SNAPSHOT.tar.gz>
to /home/jenkins/.m2/repository/org/apache/jclouds/cli/jclouds-cli-assembly/2.0.0-SNAPSHOT/jclouds-cli-assembly-2.0.0-SNAPSHOT.tar.gz
[INFO] Installing <https://jclouds.ci.cloudbees.com/job/jclouds-cli/ws/assembly/target/jclouds-cli-2.0.0-SNAPSHOT.zip>
to /home/jenkins/.m2/repository/org/apache/jclouds/cli/jclouds-cli-assembly/2.0.0-SNAPSHOT/jclouds-cli-assembly-2.0.0-SNAPSHOT.zip
[INFO] 
[INFO] --- maven-deploy-plugin:2.7:deploy (default-deploy) @ jclouds-cli-assembly ---
Downloading: https://repository.apache.org/content/repositories/snapshots/org/apache/jclouds/cli/jclouds-cli-assembly/2.0.0-SNAPSHOT/maven-metadata.xml
Downloaded: https://repository.apache.org/content/repositories/snapshots/org/apache/jclouds/cli/jclouds-cli-assembly/2.0.0-SNAPSHOT/maven-metadata.xml
(2 KB at 30.9 KB/sec)
Uploading: https://repository.apache.org/content/repositories/snapshots/org/apache/jclouds/cli/jclouds-cli-assembly/2.0.0-SNAPSHOT/jclouds-cli-assembly-2.0.0-20161013.182807-948.jar
Uploaded: https://repository.apache.org/content/repositories/snapshots/org/apache/jclouds/cli/jclouds-cli-assembly/2.0.0-SNAPSHOT/jclouds-cli-assembly-2.0.0-20161013.182807-948.jar
(28 KB at 273.6 KB/sec)
Uploading: https://repository.apache.org/content/repositories/snapshots/org/apache/jclouds/cli/jclouds-cli-assembly/2.0.0-SNAPSHOT/jclouds-cli-assembly-2.0.0-20161013.182807-948.pom
Uploaded: https://repository.apache.org/content/repositories/snapshots/org/apache/jclouds/cli/jclouds-cli-assembly/2.0.0-SNAPSHOT/jclouds-cli-assembly-2.0.0-20161013.182807-948.pom
(12 KB at 131.5 KB/sec)
Downloading: https://repository.apache.org/content/repositories/snapshots/org/apache/jclouds/cli/jclouds-cli-assembly/maven-metadata.xml
Downloaded: https://repository.apache.org/content/repositories/snapshots/org/apache/jclouds/cli/jclouds-cli-assembly/maven-metadata.xml
(603 B at 14.4 KB/sec)
Uploading: https://repository.apache.org/content/repositories/snapshots/org/apache/jclouds/cli/jclouds-cli-assembly/2.0.0-SNAPSHOT/maven-metadata.xml
Uploaded: https://repository.apache.org/content/repositories/snapshots/org/apache/jclouds/cli/jclouds-cli-assembly/2.0.0-SNAPSHOT/maven-metadata.xml
(2 KB at 21.1 KB/sec)
Uploading: https://repository.apache.org/content/repositories/snapshots/org/apache/jclouds/cli/jclouds-cli-assembly/maven-metadata.xml
Uploaded: https://repository.apache.org/content/repositories/snapshots/org/apache/jclouds/cli/jclouds-cli-assembly/maven-metadata.xml
(603 B at 7.7 KB/sec)
Uploading: https://repository.apache.org/content/repositories/snapshots/org/apache/jclouds/cli/jclouds-cli-assembly/2.0.0-SNAPSHOT/jclouds-cli-assembly-2.0.0-20161013.182807-948-tests.jar
Uploaded: https://repository.apache.org/content/repositories/snapshots/org/apache/jclouds/cli/jclouds-cli-assembly/2.0.0-SNAPSHOT/jclouds-cli-assembly-2.0.0-20161013.182807-948-tests.jar
(12 KB at 128.5 KB/sec)
Uploading: https://repository.apache.org/content/repositories/snapshots/org/apache/jclouds/cli/jclouds-cli-assembly/2.0.0-SNAPSHOT/maven-metadata.xml
Uploaded: https://repository.apache.org/content/repositories/snapshots/org/apache/jclouds/cli/jclouds-cli-assembly/2.0.0-SNAPSHOT/maven-metadata.xml
(2 KB at 19.5 KB/sec)
Uploading: https://repository.apache.org/content/repositories/snapshots/org/apache/jclouds/cli/jclouds-cli-assembly/2.0.0-SNAPSHOT/jclouds-cli-assembly-2.0.0-20161013.182807-948-sources.jar
Uploaded: https://repository.apache.org/content/repositories/snapshots/org/apache/jclouds/cli/jclouds-cli-assembly/2.0.0-SNAPSHOT/jclouds-cli-assembly-2.0.0-20161013.182807-948-sources.jar
(25 KB at 274.0 KB/sec)
Uploading: https://repository.apache.org/content/repositories/snapshots/org/apache/jclouds/cli/jclouds-cli-assembly/2.0.0-SNAPSHOT/maven-metadata.xml
Uploaded: https://repository.apache.org/content/repositories/snapshots/org/apache/jclouds/cli/jclouds-cli-assembly/2.0.0-SNAPSHOT/maven-metadata.xml
(2 KB at 20.1 KB/sec)
Uploading: https://repository.apache.org/content/repositories/snapshots/org/apache/jclouds/cli/jclouds-cli-assembly/2.0.0-SNAPSHOT/jclouds-cli-assembly-2.0.0-20161013.182807-948.tar.gz
Uploaded: https://repository.apache.org/content/repositories/snapshots/org/apache/jclouds/cli/jclouds-cli-assembly/2.0.0-SNAPSHOT/jclouds-cli-assembly-2.0.0-20161013.182807-948.tar.gz
(27271 KB at 15167.1 KB/sec)
Uploading: https://repository.apache.org/content/repositories/snapshots/org/apache/jclouds/cli/jclouds-cli-assembly/2.0.0-SNAPSHOT/maven-metadata.xml
Uploaded: https://repository.apache.org/content/repositories/snapshots/org/apache/jclouds/cli/jclouds-cli-assembly/2.0.0-SNAPSHOT/maven-metadata.xml
(2 KB at 20.6 KB/sec)
Uploading: https://repository.apache.org/content/repositories/snapshots/org/apache/jclouds/cli/jclouds-cli-assembly/2.0.0-SNAPSHOT/jclouds-cli-assembly-2.0.0-20161013.182807-948.zip
Uploaded: https://repository.apache.org/content/repositories/snapshots/org/apache/jclouds/cli/jclouds-cli-assembly/2.0.0-SNAPSHOT/jclouds-cli-assembly-2.0.0-20161013.182807-948.zip
(27595 KB at 17654.9 KB/sec)
Uploading: https://repository.apache.org/content/repositories/snapshots/org/apache/jclouds/cli/jclouds-cli-assembly/2.0.0-SNAPSHOT/maven-metadata.xml
Uploaded: https://repository.apache.org/content/repositories/snapshots/org/apache/jclouds/cli/jclouds-cli-assembly/2.0.0-SNAPSHOT/maven-metadata.xml
(2 KB at 18.6 KB/sec)
Started calculate disk usage of build
Finished Calculation of disk usage of build in 0 seconds
Started calculate disk usage of workspace
Finished Calculation of disk usage of workspace in 0 seconds
[INFO]                                                                         
[INFO] ------------------------------------------------------------------------
[INFO] Building Apache jclouds :: cli 2.0.0-SNAPSHOT
[INFO] ------------------------------------------------------------------------
[INFO] 
[INFO] --- maven-clean-plugin:2.5:clean (default-clean) @ jclouds-cli ---
[INFO] 
[INFO] --- maven-enforcer-plugin:1.1.1:enforce (enforce-banned-dependencies) @ jclouds-cli
---
[INFO] 
[INFO] --- maven-enforcer-plugin:1.1.1:enforce (enforce-java) @ jclouds-cli ---
[INFO] 
[INFO] --- maven-remote-resources-plugin:1.5:process (default) @ jclouds-cli ---
[INFO] 
[INFO] --- maven-bundle-plugin:2.3.7:manifest (bundle-manifest) @ jclouds-cli ---
[WARNING] Ignoring project type pom - supportedProjectTypes = [jar, war, bundle]
[INFO] 
[INFO] --- animal-sniffer-maven-plugin:1.11:check (default) @ jclouds-cli ---
[INFO] Checking unresolved references to org.codehaus.mojo.signature:java16:1.1
[INFO] 
[INFO] --- maven-site-plugin:3.3:attach-descriptor (attach-descriptor) @ jclouds-cli ---
[INFO] 
[INFO] --- apache-rat-plugin:0.10:check (default) @ jclouds-cli ---
[INFO] 55 implicit excludes (use -debug for more details).
[INFO] Exclude: **/LICENSE.txt
[INFO] Exclude: **/header.txt
[INFO] Exclude: **/NOTICE.txt
[INFO] Exclude: **/DISCLAIMER
[INFO] Exclude: **/BUILD.txt
[INFO] Exclude: **/CHANGES.txt
[INFO] Exclude: **/README.md
[INFO] Exclude: **/README.txt
[INFO] Exclude: **/DEPENDENCIES
[INFO] Exclude: **/CONTRIBUTING.md
[INFO] Exclude: .git/**
[INFO] Exclude: **/.gitignore
[INFO] Exclude: **/*.json
[INFO] Exclude: **/*.log*
[INFO] Exclude: **/TODO
[INFO] Exclude: .mailmap
[INFO] Exclude: .idea/**
[INFO] Exclude: **/*.iml
[INFO] Exclude: **/.project
[INFO] Exclude: **/.classpath
[INFO] Exclude: **/.settings/**
[INFO] Exclude: **/.checkstyle
[INFO] Exclude: **/target/**
[INFO] Exclude: .repository/**
[INFO] 1 resources included (use -debug for more details)
Warning:  org.apache.xerces.jaxp.SAXParserImpl$JAXPSAXParser: Property 'http://www.oracle.com/xml/jaxp/properties/entityExpansionLimit'
is not recognized.
Compiler warnings:
  WARNING:  'org.apache.xerces.jaxp.SAXParserImpl: Property 'http://javax.xml.XMLConstants/property/accessExternalDTD'
is not recognized.'
Warning:  org.apache.xerces.parsers.SAXParser: Feature 'http://javax.xml.XMLConstants/feature/secure-processing'
is not recognized.
Warning:  org.apache.xerces.parsers.SAXParser: Property 'http://javax.xml.XMLConstants/property/accessExternalDTD'
is not recognized.
Warning:  org.apache.xerces.parsers.SAXParser: Property 'http://www.oracle.com/xml/jaxp/properties/entityExpansionLimit'
is not recognized.
[INFO] Rat check: Summary of files. Unapproved: 0 unknown: 0 generated: 0 approved: 1 licence.
[INFO] 
[INFO] --- maven-jar-plugin:2.4:test-jar (default) @ jclouds-cli ---
[WARNING] JAR will be empty - no content was marked for inclusion!
[INFO] Building jar: <https://jclouds.ci.cloudbees.com/job/jclouds-cli/ws/target/jclouds-cli-2.0.0-SNAPSHOT-tests.jar>
[INFO] 
[INFO] --- maven-javadoc-plugin:2.9:jar (javadoc) @ jclouds-cli ---
[INFO] Not executing Javadoc as the project is not a Java classpath-capable package
[INFO] 
[INFO] --- maven-source-plugin:2.2:jar-no-fork (attach-sources) @ jclouds-cli ---
[INFO] 
[INFO] --- maven-surefire-plugin:2.17:test (integration) @ jclouds-cli ---
[INFO] No tests to run.
[JENKINS] Recording test results
[INFO] 
[INFO] --- duplicate-finder-maven-plugin:1.1.1:check (default) @ jclouds-cli ---
[INFO] Skipping duplicate-finder execution!
[INFO] 
[INFO] --- maven-checkstyle-plugin:2.15:check (default) @ jclouds-cli ---
[INFO] 
[INFO] --- modernizer-maven-plugin:1.4.0:modernizer (modernizer) @ jclouds-cli ---
[INFO] 
[INFO] --- maven-install-plugin:2.4:install (default-install) @ jclouds-cli ---
[INFO] Installing <https://jclouds.ci.cloudbees.com/job/jclouds-cli/ws/pom.xml> to /home/jenkins/.m2/repository/org/apache/jclouds/cli/jclouds-cli/2.0.0-SNAPSHOT/jclouds-cli-2.0.0-SNAPSHOT.pom
[INFO] Installing <https://jclouds.ci.cloudbees.com/job/jclouds-cli/ws/target/jclouds-cli-2.0.0-SNAPSHOT-tests.jar>
to /home/jenkins/.m2/repository/org/apache/jclouds/cli/jclouds-cli/2.0.0-SNAPSHOT/jclouds-cli-2.0.0-SNAPSHOT-tests.jar
[INFO] 
[INFO] --- maven-deploy-plugin:2.7:deploy (default-deploy) @ jclouds-cli ---
Downloading: https://repository.apache.org/content/repositories/snapshots/org/apache/jclouds/cli/jclouds-cli/2.0.0-SNAPSHOT/maven-metadata.xml
Downloaded: https://repository.apache.org/content/repositories/snapshots/org/apache/jclouds/cli/jclouds-cli/2.0.0-SNAPSHOT/maven-metadata.xml
(828 B at 19.3 KB/sec)
Uploading: https://repository.apache.org/content/repositories/snapshots/org/apache/jclouds/cli/jclouds-cli/2.0.0-SNAPSHOT/jclouds-cli-2.0.0-20161013.182814-923.pom
Uploaded: https://repository.apache.org/content/repositories/snapshots/org/apache/jclouds/cli/jclouds-cli/2.0.0-SNAPSHOT/jclouds-cli-2.0.0-20161013.182814-923.pom
(4 KB at 40.9 KB/sec)
Downloading: https://repository.apache.org/content/repositories/snapshots/org/apache/jclouds/cli/jclouds-cli/maven-metadata.xml
Downloaded: https://repository.apache.org/content/repositories/snapshots/org/apache/jclouds/cli/jclouds-cli/maven-metadata.xml
(634 B at 15.9 KB/sec)
Uploading: https://repository.apache.org/content/repositories/snapshots/org/apache/jclouds/cli/jclouds-cli/2.0.0-SNAPSHOT/maven-metadata.xml
Uploaded: https://repository.apache.org/content/repositories/snapshots/org/apache/jclouds/cli/jclouds-cli/2.0.0-SNAPSHOT/maven-metadata.xml
(828 B at 10.9 KB/sec)
Uploading: https://repository.apache.org/content/repositories/snapshots/org/apache/jclouds/cli/jclouds-cli/maven-metadata.xml
Uploaded: https://repository.apache.org/content/repositories/snapshots/org/apache/jclouds/cli/jclouds-cli/maven-metadata.xml
(634 B at 6.9 KB/sec)
Uploading: https://repository.apache.org/content/repositories/snapshots/org/apache/jclouds/cli/jclouds-cli/2.0.0-SNAPSHOT/jclouds-cli-2.0.0-20161013.182814-923-tests.jar
Uploaded: https://repository.apache.org/content/repositories/snapshots/org/apache/jclouds/cli/jclouds-cli/2.0.0-SNAPSHOT/jclouds-cli-2.0.0-20161013.182814-923-tests.jar
(3 KB at 32.4 KB/sec)
Uploading: https://repository.apache.org/content/repositories/snapshots/org/apache/jclouds/cli/jclouds-cli/2.0.0-SNAPSHOT/maven-metadata.xml
Uploaded: https://repository.apache.org/content/repositories/snapshots/org/apache/jclouds/cli/jclouds-cli/2.0.0-SNAPSHOT/maven-metadata.xml
(828 B at 9.3 KB/sec)
Started calculate disk usage of build
Finished Calculation of disk usage of build in 0 seconds
Started calculate disk usage of workspace
Finished Calculation of disk usage of workspace in 0 seconds
[INFO] ------------------------------------------------------------------------
[INFO] Reactor Summary:
[INFO] 
[INFO] Apache jclouds :: cli ............................. SUCCESS [25.964s]
[INFO] jclouds :: cli :: branding ........................ SUCCESS [5.162s]
[INFO] jclouds :: cli :: runner .......................... SUCCESS [11.928s]
[INFO] jclouds :: cli :: assembly ........................ SUCCESS [1:44.109s]
[INFO] Apache jclouds :: cli ............................. SUCCESS [2.398s]
[INFO] ------------------------------------------------------------------------
[INFO] BUILD SUCCESS
[INFO] ------------------------------------------------------------------------
[INFO] Total time: 2:38.173s
[INFO] Finished at: Thu Oct 13 14:28:15 EDT 2016
[INFO] Final Memory: 49M/245M
[INFO] ------------------------------------------------------------------------
Waiting for Jenkins to finish collecting data
[JENKINS] Archiving <https://jclouds.ci.cloudbees.com/job/jclouds-cli/ws/branding/pom.xml>
to org.apache.jclouds.cli/jclouds-cli-branding/2.0.0-SNAPSHOT/jclouds-cli-branding-2.0.0-SNAPSHOT.pom
[JENKINS] Archiving <https://jclouds.ci.cloudbees.com/job/jclouds-cli/ws/branding/target/jclouds-cli-branding-2.0.0-SNAPSHOT.jar>
to org.apache.jclouds.cli/jclouds-cli-branding/2.0.0-20161013.182613-993/jclouds-cli-branding-2.0.0-20161013.182613-993.jar
[JENKINS] Archiving <https://jclouds.ci.cloudbees.com/job/jclouds-cli/ws/branding/target/jclouds-cli-branding-2.0.0-SNAPSHOT-tests.jar>
to org.apache.jclouds.cli/jclouds-cli-branding/2.0.0-20161013.182613-993/jclouds-cli-branding-2.0.0-20161013.182613-993-tests.jar
[JENKINS] Archiving <https://jclouds.ci.cloudbees.com/job/jclouds-cli/ws/branding/target/jclouds-cli-branding-2.0.0-SNAPSHOT-sources.jar>
to org.apache.jclouds.cli/jclouds-cli-branding/2.0.0-20161013.182613-993/jclouds-cli-branding-2.0.0-20161013.182613-993-sources.jar
[JENKINS] Archiving <https://jclouds.ci.cloudbees.com/job/jclouds-cli/ws/assembly/pom.xml>
to org.apache.jclouds.cli/jclouds-cli-assembly/2.0.0-SNAPSHOT/jclouds-cli-assembly-2.0.0-SNAPSHOT.pom
[JENKINS] Archiving <https://jclouds.ci.cloudbees.com/job/jclouds-cli/ws/assembly/target/jclouds-cli-assembly-2.0.0-SNAPSHOT.jar>
to org.apache.jclouds.cli/jclouds-cli-assembly/2.0.0-20161013.182807-948/jclouds-cli-assembly-2.0.0-20161013.182807-948.jar
[JENKINS] Archiving <https://jclouds.ci.cloudbees.com/job/jclouds-cli/ws/assembly/target/jclouds-cli-assembly-2.0.0-SNAPSHOT-tests.jar>
to org.apache.jclouds.cli/jclouds-cli-assembly/2.0.0-20161013.182807-948/jclouds-cli-assembly-2.0.0-20161013.182807-948-tests.jar
[JENKINS] Archiving <https://jclouds.ci.cloudbees.com/job/jclouds-cli/ws/assembly/target/jclouds-cli-assembly-2.0.0-SNAPSHOT-sources.jar>
to org.apache.jclouds.cli/jclouds-cli-assembly/2.0.0-20161013.182807-948/jclouds-cli-assembly-2.0.0-20161013.182807-948-sources.jar
[JENKINS] Archiving <https://jclouds.ci.cloudbees.com/job/jclouds-cli/ws/assembly/target/jclouds-cli-2.0.0-SNAPSHOT.tar.gz>
to org.apache.jclouds.cli/jclouds-cli-assembly/2.0.0-20161013.182807-948/jclouds-cli-assembly-2.0.0-20161013.182807-948.tar.gz
[JENKINS] Archiving <https://jclouds.ci.cloudbees.com/job/jclouds-cli/ws/assembly/target/jclouds-cli-2.0.0-SNAPSHOT.zip>
to org.apache.jclouds.cli/jclouds-cli-assembly/2.0.0-20161013.182807-948/jclouds-cli-assembly-2.0.0-20161013.182807-948.zip
Build timed out (after 3 minutes). Marking the build as aborted.
ERROR: Failed to parse POMs
java.io.IOException: java.io.IOException: Failed to extract <https://jclouds.ci.cloudbees.com/job/jclouds-cli/ws/assembly/transfer>
of 6 files
	at hudson.FilePath.readFromTar(FilePath.java:2300)
	at hudson.FilePath.copyRecursiveTo(FilePath.java:2209)
	at jenkins.model.StandardArtifactManager.archive(StandardArtifactManager.java:61)
	at hudson.maven.MavenBuild$ProxyImpl.performArchiving(MavenBuild.java:483)
	at hudson.maven.MavenModuleSetBuild$MavenModuleSetBuildExecution.doRun(MavenModuleSetBuild.java:851)
	at hudson.model.AbstractBuild$AbstractBuildExecution.run(AbstractBuild.java:544)
	at hudson.model.Run.execute(Run.java:1738)
	at hudson.maven.MavenModuleSetBuild.run(MavenModuleSetBuild.java:531)
	at hudson.model.ResourceController.execute(ResourceController.java:98)
	at hudson.model.Executor.run(Executor.java:410)
Caused by: java.io.IOException: java.lang.InterruptedException
	at hudson.remoting.FastPipedInputStream.read(FastPipedInputStream.java:177)
	at hudson.util.HeadBufferingStream.read(HeadBufferingStream.java:61)
	at com.jcraft.jzlib.InflaterInputStream.fill(InflaterInputStream.java:175)
	at com.jcraft.jzlib.InflaterInputStream.read(InflaterInputStream.java:106)
	at org.apache.commons.compress.archivers.tar.TarArchiveInputStream.read(TarArchiveInputStream.java:614)
	at java.io.InputStream.read(InputStream.java:101)
	at org.apache.commons.io.IOUtils.copyLarge(IOUtils.java:1792)
	at org.apache.commons.io.IOUtils.copyLarge(IOUtils.java:1769)
	at org.apache.commons.io.IOUtils.copy(IOUtils.java:1744)
	at hudson.util.IOUtils.copy(IOUtils.java:40)
	at hudson.FilePath.readFromTar(FilePath.java:2290)
	... 9 more
Caused by: java.lang.InterruptedException
	at java.lang.Object.wait(Native Method)
	at hudson.remoting.FastPipedInputStream.read(FastPipedInputStream.java:175)
	... 19 more

	at hudson.FilePath.copyRecursiveTo(FilePath.java:2216)
	at jenkins.model.StandardArtifactManager.archive(StandardArtifactManager.java:61)
	at hudson.maven.MavenBuild$ProxyImpl.performArchiving(MavenBuild.java:483)
	at hudson.maven.MavenModuleSetBuild$MavenModuleSetBuildExecution.doRun(MavenModuleSetBuild.java:851)
	at hudson.model.AbstractBuild$AbstractBuildExecution.run(AbstractBuild.java:544)
	at hudson.model.Run.execute(Run.java:1738)
	at hudson.maven.MavenModuleSetBuild.run(MavenModuleSetBuild.java:531)
	at hudson.model.ResourceController.execute(ResourceController.java:98)
	at hudson.model.Executor.run(Executor.java:410)
Caused by: java.util.concurrent.ExecutionException: java.io.IOException: This archives contains
unclosed entries.
	at hudson.remoting.Channel$2.adapt(Channel.java:813)
	at hudson.remoting.Channel$2.adapt(Channel.java:808)
	at hudson.remoting.FutureAdapter.get(FutureAdapter.java:59)
	at hudson.FilePath.copyRecursiveTo(FilePath.java:2212)
	... 8 more
Caused by: java.io.IOException: This archives contains unclosed entries.
	at org.apache.commons.compress.archivers.tar.TarArchiveOutputStream.finish(TarArchiveOutputStream.java:225)
	at org.apache.commons.compress.archivers.tar.TarArchiveOutputStream.close(TarArchiveOutputStream.java:241)
	at hudson.util.io.TarArchiver.close(TarArchiver.java:111)
	at hudson.FilePath.writeToTar(FilePath.java:2263)
	at hudson.FilePath.access$2100(FilePath.java:190)
	at hudson.FilePath$45.invoke(FilePath.java:2202)
	at hudson.FilePath$45.invoke(FilePath.java:2198)
	at hudson.FilePath$FileCallableWrapper.call(FilePath.java:2719)
	at hudson.remoting.UserRequest.perform(UserRequest.java:120)
	at hudson.remoting.UserRequest.perform(UserRequest.java:48)
	at hudson.remoting.Request$2.run(Request.java:332)
	at hudson.remoting.InterceptingExecutorService$1.call(InterceptingExecutorService.java:68)
	at java.util.concurrent.FutureTask.run(FutureTask.java:262)
	at java.util.concurrent.ThreadPoolExecutor.runWorker(ThreadPoolExecutor.java:1145)
	at java.util.concurrent.ThreadPoolExecutor$Worker.run(ThreadPoolExecutor.java:615)
	at java.lang.Thread.run(Thread.java:745)
	at ......remote call to ee84a3ed(Native Method)
	at hudson.remoting.Channel.attachCallSiteStackTrace(Channel.java:1416)
	at hudson.remoting.UserResponse.retrieve(UserRequest.java:220)
	at hudson.remoting.Channel$2.adapt(Channel.java:811)
	... 11 more
channel stopped
Started calculate disk usage of build
Finished Calculation of disk usage of build in 0 seconds
Started calculate disk usage of workspace
Finished Calculation of disk usage of workspace in 0 seconds

Mime
View raw message