jclouds-notifications mailing list archives

Site index · List index
Message view « Date » · « Thread »
Top « Date » · « Thread »
From jenkins-no-re...@cloudbees.com
Subject Build failed in Jenkins: jclouds-labs-1.7.x-branch #81
Date Wed, 18 Jan 2017 07:13:02 GMT
https://jclouds.ci.cloudbees.com/job/jclouds-labs-1.7.x-branch/81/------------------------------------------
[...truncated 9557 lines...]
[WARNING] <https://jclouds.ci.cloudbees.com/job/jclouds-labs-1.7.x-branch/ws/virtualbox/src/main/java/org/jclouds/virtualbox/domain/NetworkAdapter.java>:81:
warning - @return tag has no arguments.
[WARNING] <https://jclouds.ci.cloudbees.com/job/jclouds-labs-1.7.x-branch/ws/virtualbox/src/main/java/org/jclouds/virtualbox/domain/NetworkAdapter.java>:95:
warning - @return tag has no arguments.
[WARNING] <https://jclouds.ci.cloudbees.com/job/jclouds-labs-1.7.x-branch/ws/virtualbox/src/main/java/org/jclouds/virtualbox/domain/NetworkAdapter.java>:111:
warning - @return tag has no arguments.
[WARNING] <https://jclouds.ci.cloudbees.com/job/jclouds-labs-1.7.x-branch/ws/virtualbox/src/main/java/org/jclouds/virtualbox/domain/RedirectRule.java>:44:
warning - @return tag has no arguments.
[WARNING] <https://jclouds.ci.cloudbees.com/job/jclouds-labs-1.7.x-branch/ws/virtualbox/src/main/java/org/jclouds/virtualbox/domain/RedirectRule.java>:44:
warning - Tag @return cannot be used in constructor documentation.  It can only be used in
the following types of documentation: method.
[WARNING] <https://jclouds.ci.cloudbees.com/job/jclouds-labs-1.7.x-branch/ws/virtualbox/src/main/java/org/jclouds/virtualbox/functions/BridgedIfStringToBridgedIf.java>:77:
warning - @return tag has no arguments.
[WARNING] <https://jclouds.ci.cloudbees.com/job/jclouds-labs-1.7.x-branch/ws/virtualbox/src/main/java/org/jclouds/virtualbox/functions/IpAddressesLoadingCache.java>:47:
warning - Tag @link: reference not found: LoadingCache
[WARNING] <https://jclouds.ci.cloudbees.com/job/jclouds-labs-1.7.x-branch/ws/virtualbox/src/main/java/org/jclouds/virtualbox/functions/MastersLoadingCache.java>:100:
warning - Tag @link: reference not found: LoadingCache
[WARNING] <https://jclouds.ci.cloudbees.com/job/jclouds-labs-1.7.x-branch/ws/virtualbox/src/main/java/org/jclouds/virtualbox/VirtualBoxApiMetadata.java>:43:
warning - Tag @link: reference not found: ApiMetadata
[WARNING] <https://jclouds.ci.cloudbees.com/job/jclouds-labs-1.7.x-branch/ws/virtualbox/src/main/java/org/jclouds/virtualbox/functions/IpAddressesLoadingCache.java>:47:
warning - Tag @link: reference not found: LoadingCache
[WARNING] <https://jclouds.ci.cloudbees.com/job/jclouds-labs-1.7.x-branch/ws/virtualbox/src/main/java/org/jclouds/virtualbox/functions/MastersLoadingCache.java>:100:
warning - Tag @link: reference not found: LoadingCache
[WARNING] <https://jclouds.ci.cloudbees.com/job/jclouds-labs-1.7.x-branch/ws/virtualbox/src/main/java/org/jclouds/virtualbox/VirtualBoxApiMetadata.java>:43:
warning - Tag @link: reference not found: ApiMetadata
[WARNING] <https://jclouds.ci.cloudbees.com/job/jclouds-labs-1.7.x-branch/ws/virtualbox/src/main/java/org/jclouds/virtualbox/functions/IpAddressesLoadingCache.java>:47:
warning - Tag @link: reference not found: LoadingCache
[WARNING] <https://jclouds.ci.cloudbees.com/job/jclouds-labs-1.7.x-branch/ws/virtualbox/src/main/java/org/jclouds/virtualbox/functions/IpAddressesLoadingCache.java>:47:
warning - Tag @link: reference not found: LoadingCache
[WARNING] <https://jclouds.ci.cloudbees.com/job/jclouds-labs-1.7.x-branch/ws/virtualbox/src/main/java/org/jclouds/virtualbox/functions/MastersLoadingCache.java>:100:
warning - Tag @link: reference not found: LoadingCache
[WARNING] <https://jclouds.ci.cloudbees.com/job/jclouds-labs-1.7.x-branch/ws/virtualbox/src/main/java/org/jclouds/virtualbox/VirtualBoxApiMetadata.java>:43:
warning - Tag @link: reference not found: ApiMetadata
[INFO] Building jar: <https://jclouds.ci.cloudbees.com/job/jclouds-labs-1.7.x-branch/ws/virtualbox/target/virtualbox-1.7.4-SNAPSHOT-javadoc.jar>
[INFO] 
[INFO] --- maven-source-plugin:2.2:jar-no-fork (attach-sources) @ virtualbox ---
[INFO] Building jar: <https://jclouds.ci.cloudbees.com/job/jclouds-labs-1.7.x-branch/ws/virtualbox/target/virtualbox-1.7.4-SNAPSHOT-sources.jar>
[INFO] 
[INFO] --- maven-surefire-plugin:2.12.4:test (integration) @ virtualbox ---
[JENKINS] Recording test results
[INFO] 
[INFO] --- maven-duplicate-finder-plugin:1.0.5:check (default) @ virtualbox ---
[INFO] Checking compile classpath
[INFO] Checking runtime classpath
[INFO] Checking test classpath
[INFO] 
[INFO] --- maven-install-plugin:2.4:install (default-install) @ virtualbox ---
[INFO] Installing <https://jclouds.ci.cloudbees.com/job/jclouds-labs-1.7.x-branch/ws/virtualbox/target/virtualbox-1.7.4-SNAPSHOT.jar>
to <https://jclouds.ci.cloudbees.com/job/jclouds-labs-1.7.x-branch/ws/.repository/org/apache/jclouds/labs/virtualbox/1.7.4-SNAPSHOT/virtualbox-1.7.4-SNAPSHOT.jar>
[INFO] Installing <https://jclouds.ci.cloudbees.com/job/jclouds-labs-1.7.x-branch/ws/virtualbox/pom.xml>
to <https://jclouds.ci.cloudbees.com/job/jclouds-labs-1.7.x-branch/ws/.repository/org/apache/jclouds/labs/virtualbox/1.7.4-SNAPSHOT/virtualbox-1.7.4-SNAPSHOT.pom>
[INFO] Installing <https://jclouds.ci.cloudbees.com/job/jclouds-labs-1.7.x-branch/ws/virtualbox/target/virtualbox-1.7.4-SNAPSHOT-tests.jar>
to <https://jclouds.ci.cloudbees.com/job/jclouds-labs-1.7.x-branch/ws/.repository/org/apache/jclouds/labs/virtualbox/1.7.4-SNAPSHOT/virtualbox-1.7.4-SNAPSHOT-tests.jar>
[INFO] Installing <https://jclouds.ci.cloudbees.com/job/jclouds-labs-1.7.x-branch/ws/virtualbox/target/virtualbox-1.7.4-SNAPSHOT-javadoc.jar>
to <https://jclouds.ci.cloudbees.com/job/jclouds-labs-1.7.x-branch/ws/.repository/org/apache/jclouds/labs/virtualbox/1.7.4-SNAPSHOT/virtualbox-1.7.4-SNAPSHOT-javadoc.jar>
[INFO] Installing <https://jclouds.ci.cloudbees.com/job/jclouds-labs-1.7.x-branch/ws/virtualbox/target/virtualbox-1.7.4-SNAPSHOT-sources.jar>
to <https://jclouds.ci.cloudbees.com/job/jclouds-labs-1.7.x-branch/ws/.repository/org/apache/jclouds/labs/virtualbox/1.7.4-SNAPSHOT/virtualbox-1.7.4-SNAPSHOT-sources.jar>
[INFO] 
[INFO] --- maven-bundle-plugin:2.3.7:install (default-install) @ virtualbox ---
[INFO] Local OBR update disabled (enable with -DobrRepository)
[INFO] 
[INFO] --- maven-deploy-plugin:2.7:deploy (default-deploy) @ virtualbox ---
Downloading: https://repository.apache.org/content/repositories/snapshots/org/apache/jclouds/labs/virtualbox/1.7.4-SNAPSHOT/maven-metadata.xml
Downloaded: https://repository.apache.org/content/repositories/snapshots/org/apache/jclouds/labs/virtualbox/1.7.4-SNAPSHOT/maven-metadata.xml
(2 KB at 28.4 KB/sec)
Uploading: https://repository.apache.org/content/repositories/snapshots/org/apache/jclouds/labs/virtualbox/1.7.4-SNAPSHOT/virtualbox-1.7.4-20170118.071246-10.jar
Uploaded: https://repository.apache.org/content/repositories/snapshots/org/apache/jclouds/labs/virtualbox/1.7.4-SNAPSHOT/virtualbox-1.7.4-20170118.071246-10.jar
(256 KB at 1549.5 KB/sec)
Uploading: https://repository.apache.org/content/repositories/snapshots/org/apache/jclouds/labs/virtualbox/1.7.4-SNAPSHOT/virtualbox-1.7.4-20170118.071246-10.pom
Uploaded: https://repository.apache.org/content/repositories/snapshots/org/apache/jclouds/labs/virtualbox/1.7.4-SNAPSHOT/virtualbox-1.7.4-20170118.071246-10.pom
(6 KB at 74.0 KB/sec)
Downloading: https://repository.apache.org/content/repositories/snapshots/org/apache/jclouds/labs/virtualbox/maven-metadata.xml
Downloaded: https://repository.apache.org/content/repositories/snapshots/org/apache/jclouds/labs/virtualbox/maven-metadata.xml
(594 B at 12.1 KB/sec)
Uploading: https://repository.apache.org/content/repositories/snapshots/org/apache/jclouds/labs/virtualbox/1.7.4-SNAPSHOT/maven-metadata.xml
Uploaded: https://repository.apache.org/content/repositories/snapshots/org/apache/jclouds/labs/virtualbox/1.7.4-SNAPSHOT/maven-metadata.xml
(2 KB at 17.0 KB/sec)
Uploading: https://repository.apache.org/content/repositories/snapshots/org/apache/jclouds/labs/virtualbox/maven-metadata.xml
Uploaded: https://repository.apache.org/content/repositories/snapshots/org/apache/jclouds/labs/virtualbox/maven-metadata.xml
(594 B at 7.5 KB/sec)
Uploading: https://repository.apache.org/content/repositories/snapshots/org/apache/jclouds/labs/virtualbox/1.7.4-SNAPSHOT/virtualbox-1.7.4-20170118.071246-10-tests.jar
Uploaded: https://repository.apache.org/content/repositories/snapshots/org/apache/jclouds/labs/virtualbox/1.7.4-SNAPSHOT/virtualbox-1.7.4-20170118.071246-10-tests.jar
(128 KB at 1201.2 KB/sec)
Uploading: https://repository.apache.org/content/repositories/snapshots/org/apache/jclouds/labs/virtualbox/1.7.4-SNAPSHOT/maven-metadata.xml
Uploaded: https://repository.apache.org/content/repositories/snapshots/org/apache/jclouds/labs/virtualbox/1.7.4-SNAPSHOT/maven-metadata.xml
(2 KB at 20.2 KB/sec)
Uploading: https://repository.apache.org/content/repositories/snapshots/org/apache/jclouds/labs/virtualbox/1.7.4-SNAPSHOT/virtualbox-1.7.4-20170118.071246-10-javadoc.jar
Uploaded: https://repository.apache.org/content/repositories/snapshots/org/apache/jclouds/labs/virtualbox/1.7.4-SNAPSHOT/virtualbox-1.7.4-20170118.071246-10-javadoc.jar
(652 KB at 2254.9 KB/sec)
Uploading: https://repository.apache.org/content/repositories/snapshots/org/apache/jclouds/labs/virtualbox/1.7.4-SNAPSHOT/maven-metadata.xml
Uploaded: https://repository.apache.org/content/repositories/snapshots/org/apache/jclouds/labs/virtualbox/1.7.4-SNAPSHOT/maven-metadata.xml
(2 KB at 17.7 KB/sec)
Uploading: https://repository.apache.org/content/repositories/snapshots/org/apache/jclouds/labs/virtualbox/1.7.4-SNAPSHOT/virtualbox-1.7.4-20170118.071246-10-sources.jar
Uploaded: https://repository.apache.org/content/repositories/snapshots/org/apache/jclouds/labs/virtualbox/1.7.4-SNAPSHOT/virtualbox-1.7.4-20170118.071246-10-sources.jar
(151 KB at 1475.3 KB/sec)
Uploading: https://repository.apache.org/content/repositories/snapshots/org/apache/jclouds/labs/virtualbox/1.7.4-SNAPSHOT/maven-metadata.xml
Uploaded: https://repository.apache.org/content/repositories/snapshots/org/apache/jclouds/labs/virtualbox/1.7.4-SNAPSHOT/maven-metadata.xml
(2 KB at 18.6 KB/sec)
[INFO] 
[INFO] --- maven-bundle-plugin:2.3.7:deploy (default-deploy) @ virtualbox ---
[INFO] Remote OBR update disabled (enable with -DremoteOBR)
Started calculate disk usage of build
Finished Calculation of disk usage of build in 0 seconds
Started calculate disk usage of workspace
Finished Calculation of disk usage of workspace in 0 seconds
[INFO]                                                                         
[INFO] ------------------------------------------------------------------------
[INFO] Building jclouds dmtf domain objects 1.7.4-SNAPSHOT
[INFO] ------------------------------------------------------------------------
Downloading: https://repository-jclouds.forge.cloudbees.com/release/com/google/guava/guava/maven-metadata.xml
Downloading: https://repo.cloudbees.com/content/repositories/central/com/google/guava/guava/maven-metadata.xml
Downloading: https://repository-jclouds.forge.cloudbees.com/snapshot/com/google/guava/guava/maven-metadata.xml
Downloading: https://repository.apache.org/content/repositories/snapshots/com/google/guava/guava/maven-metadata.xml
Downloading: https://oss.sonatype.org/content/repositories/snapshots/com/google/guava/guava/maven-metadata.xml
Downloading: http://repository.apache.org/snapshots/com/google/guava/guava/maven-metadata.xml
Downloaded: https://repo.cloudbees.com/content/repositories/central/com/google/guava/guava/maven-metadata.xml
(2 KB at 106.6 KB/sec)
Downloaded: https://oss.sonatype.org/content/repositories/snapshots/com/google/guava/guava/maven-metadata.xml
(360 B at 7.2 KB/sec)
[INFO] 
[INFO] --- maven-clean-plugin:2.5:clean (default-clean) @ dmtf ---
[INFO] 
[INFO] --- maven-enforcer-plugin:1.1.1:enforce (enforce-banned-dependencies) @ dmtf ---
[INFO] 
[INFO] --- maven-enforcer-plugin:1.1.1:enforce (enforce-java) @ dmtf ---
[INFO] 
[INFO] --- maven-remote-resources-plugin:1.4:process (default) @ dmtf ---
[INFO] artifact com.google.guava:guava: checking for updates from central
[WARNING] *** CHECKSUM FAILED - Checksum failed on download: local = '501992a9334fa9a4f1dac06b611f8f4b12f86e72';
remote = 'b18357a657eb66528de95cbc4122cc072ec4821e' - RETRYING
[WARNING] *** CHECKSUM FAILED - Checksum failed on download: local = '501992a9334fa9a4f1dac06b611f8f4b12f86e72';
remote = 'b18357a657eb66528de95cbc4122cc072ec4821e' - IGNORING
[INFO] artifact com.google.guava:guava: checking for updates from cloudbees-private-release-repository
[INFO] 
[INFO] --- maven-resources-plugin:2.6:resources (default-resources) @ dmtf ---
[INFO] Using 'UTF-8' encoding to copy filtered resources.
[INFO] skip non existing resourceDirectory <https://jclouds.ci.cloudbees.com/job/jclouds-labs-1.7.x-branch/ws/dmtf/src/main/clojure>
[INFO] skip non existing resourceDirectory <https://jclouds.ci.cloudbees.com/job/jclouds-labs-1.7.x-branch/ws/dmtf/src/main/resources>
[INFO] Copying 3 resources
[INFO] 
[INFO] --- maven-compiler-plugin:3.1:compile (default-compile) @ dmtf ---
[INFO] Changes detected - recompiling the module!
[INFO] Compiling 47 source files to <https://jclouds.ci.cloudbees.com/job/jclouds-labs-1.7.x-branch/ws/dmtf/target/classes>
[INFO] -------------------------------------------------------------
[ERROR] COMPILATION ERROR : 
[INFO] -------------------------------------------------------------
[ERROR] bad path element "": no such file or directory
<https://jclouds.ci.cloudbees.com/job/jclouds-labs-1.7.x-branch/ws/dmtf/src/main/java/org/jclouds/dmtf/cim/functions/HardwareBuilderFromResourceAllocations.java>:[19,-1]
cannot access com.google.common.collect.Iterables
bad class file: com/google/common/collect/Iterables.class(com/google/common/collect:Iterables.class)
class file has wrong version 52.0, should be 50.0
[INFO] 1 error
[INFO] -------------------------------------------------------------
Started calculate disk usage of build
Finished Calculation of disk usage of build in 0 seconds
Started calculate disk usage of workspace
Finished Calculation of disk usage of workspace in 0 seconds
[INFO] ------------------------------------------------------------------------
[INFO] Reactor Summary:
[INFO] 
[INFO] Apache jclouds labs ............................... SUCCESS [1:33.818s]
[INFO] jclouds virtualbox api ............................ SUCCESS [31.826s]
[INFO] jclouds dmtf domain objects ....................... FAILURE [2.716s]
[INFO] jclouds vcloud-director api ....................... SKIPPED
[INFO] jclouds cdmi api .................................. SKIPPED
[INFO] jclouds CloudSigma v2 API ......................... SKIPPED
[INFO] jclouds CloudSigma v2 Las Vegas Provider .......... SKIPPED
[INFO] jclouds CloudSigma v2 Washington DC Provider ...... SKIPPED
[INFO] jclouds CloudSigma v2 Zurich Provider ............. SKIPPED
[INFO] jclouds DigitalOcean Provider ..................... SKIPPED
[INFO] jclouds joyent-cloudapi api ....................... SKIPPED
[INFO] jclouds joyentcloud provider ...................... SKIPPED
[INFO] jclouds Fujitsu Global Cloud Platform ............. SKIPPED
[INFO] jclouds Fujitsu Global Cloud Platform AU provider . SKIPPED
[INFO] jclouds Fujitsu Global Cloud Platform DE provider . SKIPPED
[INFO] jclouds Abiquo api ................................ SKIPPED
[INFO] jclouds :: represetations ......................... SKIPPED
[INFO] jclouds :: representations :: core ................ SKIPPED
[INFO] jclouds :: representations :: codec ............... SKIPPED
[INFO] jclouds :: management ............................. SKIPPED
[INFO] jclouds :: management :: core ..................... SKIPPED
[INFO] jclouds :: management :: compute .................. SKIPPED
[INFO] jclouds :: management :: blobstore ................ SKIPPED
[INFO] ------------------------------------------------------------------------
[INFO] BUILD FAILURE
[INFO] ------------------------------------------------------------------------
[INFO] Total time: 2:16.974s
[INFO] Finished at: Wed Jan 18 02:12:51 EST 2017
[INFO] Final Memory: 43M/213M
[INFO] ------------------------------------------------------------------------
Waiting for Jenkins to finish collecting data
[ERROR] Failed to execute goal org.apache.maven.plugins:maven-compiler-plugin:3.1:compile
(default-compile) on project dmtf: Compilation failure
[ERROR] bad path element "": no such file or directory
[ERROR] <https://jclouds.ci.cloudbees.com/job/jclouds-labs-1.7.x-branch/ws/dmtf/src/main/java/org/jclouds/dmtf/cim/functions/HardwareBuilderFromResourceAllocations.java>:[19,-1]
cannot access com.google.common.collect.Iterables
[ERROR] bad class file: com/google/common/collect/Iterables.class(com/google/common/collect:Iterables.class)
[ERROR] class file has wrong version 52.0, should be 50.0
[ERROR] -> [Help 1]
org.apache.maven.lifecycle.LifecycleExecutionException: Failed to execute goal org.apache.maven.plugins:maven-compiler-plugin:3.1:compile
(default-compile) on project dmtf: Compilation failure
bad path element "": no such file or directory
<https://jclouds.ci.cloudbees.com/job/jclouds-labs-1.7.x-branch/ws/dmtf/src/main/java/org/jclouds/dmtf/cim/functions/HardwareBuilderFromResourceAllocations.java>:[19,-1]
cannot access com.google.common.collect.Iterables
bad class file: com/google/common/collect/Iterables.class(com/google/common/collect:Iterables.class)
class file has wrong version 52.0, should be 50.0

	at org.apache.maven.lifecycle.internal.MojoExecutor.execute(MojoExecutor.java:213)
	at org.apache.maven.lifecycle.internal.MojoExecutor.execute(MojoExecutor.java:153)
	at org.apache.maven.lifecycle.internal.MojoExecutor.execute(MojoExecutor.java:145)
	at org.apache.maven.lifecycle.internal.LifecycleModuleBuilder.buildProject(LifecycleModuleBuilder.java:84)
	at org.apache.maven.lifecycle.internal.LifecycleModuleBuilder.buildProject(LifecycleModuleBuilder.java:59)
	at org.apache.maven.lifecycle.internal.LifecycleStarter.singleThreadedBuild(LifecycleStarter.java:183)
	at org.apache.maven.lifecycle.internal.LifecycleStarter.execute(LifecycleStarter.java:161)
	at org.apache.maven.DefaultMaven.doExecute(DefaultMaven.java:319)
	at org.apache.maven.DefaultMaven.execute(DefaultMaven.java:156)
	at org.jvnet.hudson.maven3.launcher.Maven3Launcher.main(Maven3Launcher.java:117)
	at sun.reflect.NativeMethodAccessorImpl.invoke0(Native Method)
	at sun.reflect.NativeMethodAccessorImpl.invoke(NativeMethodAccessorImpl.java:57)
	at sun.reflect.DelegatingMethodAccessorImpl.invoke(DelegatingMethodAccessorImpl.java:43)
	at java.lang.reflect.Method.invoke(Method.java:606)
	at org.codehaus.plexus.classworlds.launcher.Launcher.launchStandard(Launcher.java:329)
	at org.codehaus.plexus.classworlds.launcher.Launcher.launch(Launcher.java:239)
	at org.jvnet.hudson.maven3.agent.Maven3Main.launch(Maven3Main.java:178)
	at sun.reflect.NativeMethodAccessorImpl.invoke0(Native Method)
	at sun.reflect.NativeMethodAccessorImpl.invoke(NativeMethodAccessorImpl.java:57)
	at sun.reflect.DelegatingMethodAccessorImpl.invoke(DelegatingMethodAccessorImpl.java:43)
	at java.lang.reflect.Method.invoke(Method.java:606)
	at hudson.maven.Maven3Builder.call(Maven3Builder.java:136)
	at hudson.maven.Maven3Builder.call(Maven3Builder.java:71)
	at hudson.remoting.UserRequest.perform(UserRequest.java:153)
	at hudson.remoting.UserRequest.perform(UserRequest.java:50)
	at hudson.remoting.Request$2.run(Request.java:332)
	at hudson.remoting.InterceptingExecutorService$1.call(InterceptingExecutorService.java:68)
	at java.util.concurrent.FutureTask.run(FutureTask.java:262)
	at java.util.concurrent.ThreadPoolExecutor.runWorker(ThreadPoolExecutor.java:1145)
	at java.util.concurrent.ThreadPoolExecutor$Worker.run(ThreadPoolExecutor.java:615)
	at java.lang.Thread.run(Thread.java:745)
Caused by: org.apache.maven.plugin.compiler.CompilationFailureException: Compilation failure
bad path element "": no such file or directory
<https://jclouds.ci.cloudbees.com/job/jclouds-labs-1.7.x-branch/ws/dmtf/src/main/java/org/jclouds/dmtf/cim/functions/HardwareBuilderFromResourceAllocations.java>:[19,-1]
cannot access com.google.common.collect.Iterables
bad class file: com/google/common/collect/Iterables.class(com/google/common/collect:Iterables.class)
class file has wrong version 52.0, should be 50.0

	at org.apache.maven.plugin.compiler.AbstractCompilerMojo.execute(AbstractCompilerMojo.java:858)
	at org.apache.maven.plugin.compiler.CompilerMojo.execute(CompilerMojo.java:129)
	at org.apache.maven.plugin.DefaultBuildPluginManager.executeMojo(DefaultBuildPluginManager.java:101)
	at org.apache.maven.lifecycle.internal.MojoExecutor.execute(MojoExecutor.java:209)
	... 30 more
[ERROR] 
[ERROR] Re-run Maven using the -X switch to enable full debug logging.
[ERROR] 
[ERROR] For more information about the errors and possible solutions, please read the following
articles:
[ERROR] [Help 1] http://cwiki.apache.org/confluence/display/MAVEN/MojoFailureException
[ERROR] 
[ERROR] After correcting the problems, you can resume the build with the command
[ERROR]   mvn <goals> -rf :dmtf
[JENKINS] Archiving <https://jclouds.ci.cloudbees.com/job/jclouds-labs-1.7.x-branch/ws/joyentcloud/pom.xml>
to org.apache.jclouds.labs/joyentcloud/1.7.4-SNAPSHOT/joyentcloud-1.7.4-SNAPSHOT.pom
[JENKINS] Archiving <https://jclouds.ci.cloudbees.com/job/jclouds-labs-1.7.x-branch/ws/joyent-cloudapi/pom.xml>
to org.apache.jclouds.labs/joyent-cloudapi/1.7.4-SNAPSHOT/joyent-cloudapi-1.7.4-SNAPSHOT.pom
[JENKINS] Archiving <https://jclouds.ci.cloudbees.com/job/jclouds-labs-1.7.x-branch/ws/fgcp/pom.xml>
to org.apache.jclouds.labs/fgcp/1.7.4-SNAPSHOT/fgcp-1.7.4-SNAPSHOT.pom
[JENKINS] Archiving <https://jclouds.ci.cloudbees.com/job/jclouds-labs-1.7.x-branch/ws/jclouds-representations/representations-core/pom.xml>
to org.apache.jclouds.labs.representations/representations-core/1.7.4-SNAPSHOT/representations-core-1.7.4-SNAPSHOT.pom
[JENKINS] Archiving <https://jclouds.ci.cloudbees.com/job/jclouds-labs-1.7.x-branch/ws/vcloud-director/pom.xml>
to org.apache.jclouds.labs/vcloud-director/1.7.4-SNAPSHOT/vcloud-director-1.7.4-SNAPSHOT.pom
[JENKINS] Archiving <https://jclouds.ci.cloudbees.com/job/jclouds-labs-1.7.x-branch/ws/cloudsigma2-wdc/pom.xml>
to org.apache.jclouds.labs/cloudsigma2-wdc/1.7.4-SNAPSHOT/cloudsigma2-wdc-1.7.4-SNAPSHOT.pom
[JENKINS] Archiving <https://jclouds.ci.cloudbees.com/job/jclouds-labs-1.7.x-branch/ws/jclouds-management/pom.xml>
to org.apache.jclouds.labs/jclouds-management/1.7.4-SNAPSHOT/jclouds-management-1.7.4-SNAPSHOT.pom
[JENKINS] Archiving <https://jclouds.ci.cloudbees.com/job/jclouds-labs-1.7.x-branch/ws/cloudsigma2/pom.xml>
to org.apache.jclouds.labs/cloudsigma2/1.7.4-SNAPSHOT/cloudsigma2-1.7.4-SNAPSHOT.pom
[JENKINS] Archiving <https://jclouds.ci.cloudbees.com/job/jclouds-labs-1.7.x-branch/ws/cloudsigma2-zrh/pom.xml>
to org.apache.jclouds.labs/cloudsigma2-zrh/1.7.4-SNAPSHOT/cloudsigma2-zrh-1.7.4-SNAPSHOT.pom
[JENKINS] Archiving <https://jclouds.ci.cloudbees.com/job/jclouds-labs-1.7.x-branch/ws/virtualbox/pom.xml>
to org.apache.jclouds.labs/virtualbox/1.7.4-SNAPSHOT/virtualbox-1.7.4-SNAPSHOT.pom
[JENKINS] Archiving <https://jclouds.ci.cloudbees.com/job/jclouds-labs-1.7.x-branch/ws/virtualbox/target/virtualbox-1.7.4-SNAPSHOT.jar>
to org.apache.jclouds.labs/virtualbox/1.7.4-20170118.071246-10/virtualbox-1.7.4-20170118.071246-10.jar
[JENKINS] Archiving <https://jclouds.ci.cloudbees.com/job/jclouds-labs-1.7.x-branch/ws/virtualbox/target/virtualbox-1.7.4-SNAPSHOT-tests.jar>
to org.apache.jclouds.labs/virtualbox/1.7.4-20170118.071246-10/virtualbox-1.7.4-20170118.071246-10-tests.jar
[JENKINS] Archiving <https://jclouds.ci.cloudbees.com/job/jclouds-labs-1.7.x-branch/ws/virtualbox/target/virtualbox-1.7.4-SNAPSHOT-javadoc.jar>
to org.apache.jclouds.labs/virtualbox/1.7.4-20170118.071246-10/virtualbox-1.7.4-20170118.071246-10-javadoc.jar
[JENKINS] Archiving <https://jclouds.ci.cloudbees.com/job/jclouds-labs-1.7.x-branch/ws/virtualbox/target/virtualbox-1.7.4-SNAPSHOT-sources.jar>
to org.apache.jclouds.labs/virtualbox/1.7.4-20170118.071246-10/virtualbox-1.7.4-20170118.071246-10-sources.jar
[JENKINS] Archiving <https://jclouds.ci.cloudbees.com/job/jclouds-labs-1.7.x-branch/ws/digitalocean/pom.xml>
to org.apache.jclouds.labs/digitalocean/1.7.4-SNAPSHOT/digitalocean-1.7.4-SNAPSHOT.pom
[JENKINS] Archiving <https://jclouds.ci.cloudbees.com/job/jclouds-labs-1.7.x-branch/ws/jclouds-management/management-core/pom.xml>
to org.apache.jclouds.labs.management/management-core/1.7.4-SNAPSHOT/management-core-1.7.4-SNAPSHOT.pom
[JENKINS] Archiving <https://jclouds.ci.cloudbees.com/job/jclouds-labs-1.7.x-branch/ws/pom.xml>
to org.apache.jclouds.labs/jclouds-labs/1.7.4-SNAPSHOT/jclouds-labs-1.7.4-SNAPSHOT.pom
[JENKINS] Archiving <https://jclouds.ci.cloudbees.com/job/jclouds-labs-1.7.x-branch/ws/target/jclouds-labs-1.7.4-SNAPSHOT-tests.jar>
to org.apache.jclouds.labs/jclouds-labs/1.7.4-20170118.071212-10/jclouds-labs-1.7.4-20170118.071212-10-tests.jar
[JENKINS] Archiving <https://jclouds.ci.cloudbees.com/job/jclouds-labs-1.7.x-branch/ws/target/jclouds-labs-1.7.4-SNAPSHOT-javadoc.jar>
to org.apache.jclouds.labs/jclouds-labs/1.7.4-20170118.071212-10/jclouds-labs-1.7.4-20170118.071212-10-javadoc.jar
[JENKINS] Archiving <https://jclouds.ci.cloudbees.com/job/jclouds-labs-1.7.x-branch/ws/fgcp-au/pom.xml>
to org.apache.jclouds.labs/fgcp-au/1.7.4-SNAPSHOT/fgcp-au-1.7.4-SNAPSHOT.pom
[JENKINS] Archiving <https://jclouds.ci.cloudbees.com/job/jclouds-labs-1.7.x-branch/ws/jclouds-representations/representations-codec/pom.xml>
to org.apache.jclouds.labs.representations/representations-codec/1.7.4-SNAPSHOT/representations-codec-1.7.4-SNAPSHOT.pom
[JENKINS] Archiving <https://jclouds.ci.cloudbees.com/job/jclouds-labs-1.7.x-branch/ws/dmtf/pom.xml>
to org.apache.jclouds.labs/dmtf/1.7.4-SNAPSHOT/dmtf-1.7.4-SNAPSHOT.pom
[JENKINS] Archiving <https://jclouds.ci.cloudbees.com/job/jclouds-labs-1.7.x-branch/ws/cdmi/pom.xml>
to org.apache.jclouds.labs/cdmi/1.7.4-SNAPSHOT/cdmi-1.7.4-SNAPSHOT.pom
[JENKINS] Archiving <https://jclouds.ci.cloudbees.com/job/jclouds-labs-1.7.x-branch/ws/cloudsigma2-lvs/pom.xml>
to org.apache.jclouds.labs/cloudsigma2-lvs/1.7.4-SNAPSHOT/cloudsigma2-lvs-1.7.4-SNAPSHOT.pom
[JENKINS] Archiving <https://jclouds.ci.cloudbees.com/job/jclouds-labs-1.7.x-branch/ws/jclouds-management/management-compute/pom.xml>
to org.apache.jclouds.labs.management/management-compute/1.7.4-SNAPSHOT/management-compute-1.7.4-SNAPSHOT.pom
[JENKINS] Archiving <https://jclouds.ci.cloudbees.com/job/jclouds-labs-1.7.x-branch/ws/jclouds-representations/pom.xml>
to org.apache.jclouds.labs/jclouds-represetations/1.7.4-SNAPSHOT/jclouds-represetations-1.7.4-SNAPSHOT.pom
[JENKINS] Archiving <https://jclouds.ci.cloudbees.com/job/jclouds-labs-1.7.x-branch/ws/abiquo/pom.xml>
to org.apache.jclouds.labs/abiquo/1.7.4-SNAPSHOT/abiquo-1.7.4-SNAPSHOT.pom
[JENKINS] Archiving <https://jclouds.ci.cloudbees.com/job/jclouds-labs-1.7.x-branch/ws/fgcp-de/pom.xml>
to org.apache.jclouds.labs/fgcp-de/1.7.4-SNAPSHOT/fgcp-de-1.7.4-SNAPSHOT.pom
[JENKINS] Archiving <https://jclouds.ci.cloudbees.com/job/jclouds-labs-1.7.x-branch/ws/jclouds-management/management-blobstore/pom.xml>
to org.apache.jclouds.labs.management/management-blobstore/1.7.4-SNAPSHOT/management-blobstore-1.7.4-SNAPSHOT.pom
Sending e-mails to: notifications@jclouds.apache.org
channel stopped
Started calculate disk usage of build
Finished Calculation of disk usage of build in 0 seconds
Started calculate disk usage of workspace
Finished Calculation of disk usage of workspace in  1 second

Mime
View raw message