jclouds-notifications mailing list archives

Site index · List index
Message view « Date » · « Thread »
Top « Date » · « Thread »
From jenkins-no-re...@cloudbees.com
Subject Build failed in Jenkins: jclouds-labs-aws-1.7.x-branch #68
Date Wed, 18 Jan 2017 00:08:50 GMT
https://jclouds.ci.cloudbees.com/job/jclouds-labs-aws-1.7.x-branch/68/------------------------------------------
[...truncated 2011 lines...]
Downloading: https://repository-jclouds.forge.cloudbees.com/snapshot/org/apache/jclouds/provider/aws-ec2/1.7.4-SNAPSHOT/maven-metadata.xml
Downloading: https://repository.apache.org/content/repositories/snapshots/org/apache/jclouds/provider/aws-ec2/1.7.4-SNAPSHOT/maven-metadata.xml
Downloading: https://oss.sonatype.org/content/repositories/snapshots/org/apache/jclouds/provider/aws-ec2/1.7.4-SNAPSHOT/maven-metadata.xml
Downloading: http://repository.apache.org/snapshots/org/apache/jclouds/provider/aws-ec2/1.7.4-SNAPSHOT/maven-metadata.xml
Downloaded: https://repository.apache.org/content/repositories/snapshots/org/apache/jclouds/provider/aws-ec2/1.7.4-SNAPSHOT/maven-metadata.xml
(2 KB at 38.8 KB/sec)
Downloaded: http://repository.apache.org/snapshots/org/apache/jclouds/provider/aws-ec2/1.7.4-SNAPSHOT/maven-metadata.xml
(2 KB at 39.9 KB/sec)
Downloading: https://repository-jclouds.forge.cloudbees.com/snapshot/org/apache/jclouds/provider/aws-ec2/1.7.4-SNAPSHOT/aws-ec2-1.7.4-20170118.000542-30.pom
Downloading: https://repository.apache.org/content/repositories/snapshots/org/apache/jclouds/provider/aws-ec2/1.7.4-SNAPSHOT/aws-ec2-1.7.4-20170118.000542-30.pom
Downloaded: https://repository.apache.org/content/repositories/snapshots/org/apache/jclouds/provider/aws-ec2/1.7.4-SNAPSHOT/aws-ec2-1.7.4-20170118.000542-30.pom
(7 KB at 180.8 KB/sec)
Downloading: https://repository-jclouds.forge.cloudbees.com/snapshot/org/apache/jclouds/api/ec2/1.7.4-SNAPSHOT/maven-metadata.xml
Downloading: http://repository.apache.org/snapshots/org/apache/jclouds/api/ec2/1.7.4-SNAPSHOT/maven-metadata.xml
Downloading: https://oss.sonatype.org/content/repositories/snapshots/org/apache/jclouds/api/ec2/1.7.4-SNAPSHOT/maven-metadata.xml
Downloading: https://repository.apache.org/content/repositories/snapshots/org/apache/jclouds/api/ec2/1.7.4-SNAPSHOT/maven-metadata.xml
Downloaded: http://repository.apache.org/snapshots/org/apache/jclouds/api/ec2/1.7.4-SNAPSHOT/maven-metadata.xml
(2 KB at 42.1 KB/sec)
Downloaded: https://repository.apache.org/content/repositories/snapshots/org/apache/jclouds/api/ec2/1.7.4-SNAPSHOT/maven-metadata.xml
(2 KB at 40.8 KB/sec)
Downloading: https://repository-jclouds.forge.cloudbees.com/snapshot/org/apache/jclouds/api/ec2/1.7.4-SNAPSHOT/ec2-1.7.4-20170117.235438-31.pom
Downloading: https://repository.apache.org/content/repositories/snapshots/org/apache/jclouds/api/ec2/1.7.4-SNAPSHOT/ec2-1.7.4-20170117.235438-31.pom
Downloaded: https://repository.apache.org/content/repositories/snapshots/org/apache/jclouds/api/ec2/1.7.4-SNAPSHOT/ec2-1.7.4-20170117.235438-31.pom
(6 KB at 170.8 KB/sec)
Downloading: https://repository-jclouds.forge.cloudbees.com/snapshot/org/apache/jclouds/api/sts/1.7.4-SNAPSHOT/sts-1.7.4-SNAPSHOT.pom
Downloading: https://repository.apache.org/content/repositories/snapshots/org/apache/jclouds/api/sts/1.7.4-SNAPSHOT/sts-1.7.4-SNAPSHOT.pom
Downloading: https://oss.sonatype.org/content/repositories/snapshots/org/apache/jclouds/api/sts/1.7.4-SNAPSHOT/sts-1.7.4-SNAPSHOT.pom
Downloading: http://repository.apache.org/snapshots/org/apache/jclouds/api/sts/1.7.4-SNAPSHOT/sts-1.7.4-SNAPSHOT.pom
[WARNING] The POM for org.apache.jclouds.api:sts:jar:1.7.4-SNAPSHOT is missing, no dependency
information available
Downloading: https://repository.apache.org/content/repositories/snapshots/org/apache/jclouds/driver/jclouds-sshj/1.7.4-SNAPSHOT/maven-metadata.xml
Downloading: https://repository-jclouds.forge.cloudbees.com/snapshot/org/apache/jclouds/driver/jclouds-sshj/1.7.4-SNAPSHOT/maven-metadata.xml
Downloading: https://oss.sonatype.org/content/repositories/snapshots/org/apache/jclouds/driver/jclouds-sshj/1.7.4-SNAPSHOT/maven-metadata.xml
Downloading: http://repository.apache.org/snapshots/org/apache/jclouds/driver/jclouds-sshj/1.7.4-SNAPSHOT/maven-metadata.xml
Downloaded: http://repository.apache.org/snapshots/org/apache/jclouds/driver/jclouds-sshj/1.7.4-SNAPSHOT/maven-metadata.xml
(2 KB at 41.2 KB/sec)
Downloaded: https://repository.apache.org/content/repositories/snapshots/org/apache/jclouds/driver/jclouds-sshj/1.7.4-SNAPSHOT/maven-metadata.xml
(2 KB at 36.8 KB/sec)
Downloading: https://repository-jclouds.forge.cloudbees.com/snapshot/org/apache/jclouds/driver/jclouds-sshj/1.7.4-SNAPSHOT/jclouds-sshj-1.7.4-20170117.235036-32.pom
Downloading: https://repository.apache.org/content/repositories/snapshots/org/apache/jclouds/driver/jclouds-sshj/1.7.4-SNAPSHOT/jclouds-sshj-1.7.4-20170117.235036-32.pom
Downloaded: https://repository.apache.org/content/repositories/snapshots/org/apache/jclouds/driver/jclouds-sshj/1.7.4-SNAPSHOT/jclouds-sshj-1.7.4-20170117.235036-32.pom
(6 KB at 156.7 KB/sec)
Downloading: https://repository-jclouds.forge.cloudbees.com/snapshot/org/apache/jclouds/driver/jclouds-slf4j/1.7.4-SNAPSHOT/maven-metadata.xml
Downloading: http://repository.apache.org/snapshots/org/apache/jclouds/driver/jclouds-slf4j/1.7.4-SNAPSHOT/maven-metadata.xml
Downloading: https://repository.apache.org/content/repositories/snapshots/org/apache/jclouds/driver/jclouds-slf4j/1.7.4-SNAPSHOT/maven-metadata.xml
Downloading: https://oss.sonatype.org/content/repositories/snapshots/org/apache/jclouds/driver/jclouds-slf4j/1.7.4-SNAPSHOT/maven-metadata.xml
Downloading: https://oss.sonatype.org/content/repositories/snapshots/org/apache/jclouds/driver/jclouds-slf4j/1.7.4-SNAPSHOT/maven-metadata.xml
Downloaded: https://repository.apache.org/content/repositories/snapshots/org/apache/jclouds/driver/jclouds-slf4j/1.7.4-SNAPSHOT/maven-metadata.xml
(2 KB at 36.9 KB/sec)
Downloaded: http://repository.apache.org/snapshots/org/apache/jclouds/driver/jclouds-slf4j/1.7.4-SNAPSHOT/maven-metadata.xml
(2 KB at 33.3 KB/sec)
Downloading: https://repository-jclouds.forge.cloudbees.com/snapshot/org/apache/jclouds/driver/jclouds-slf4j/1.7.4-SNAPSHOT/jclouds-slf4j-1.7.4-20170117.235012-32.pom
Downloading: https://repository.apache.org/content/repositories/snapshots/org/apache/jclouds/driver/jclouds-slf4j/1.7.4-SNAPSHOT/jclouds-slf4j-1.7.4-20170117.235012-32.pom
Downloaded: https://repository.apache.org/content/repositories/snapshots/org/apache/jclouds/driver/jclouds-slf4j/1.7.4-SNAPSHOT/jclouds-slf4j-1.7.4-20170117.235012-32.pom
(3 KB at 59.0 KB/sec)
Downloading: https://repo.cloudbees.com/content/repositories/central/org/slf4j/slf4j-api/1.7.2/slf4j-api-1.7.2.pom
Downloaded: https://repo.cloudbees.com/content/repositories/central/org/slf4j/slf4j-api/1.7.2/slf4j-api-1.7.2.pom
(3 KB at 202.0 KB/sec)
Downloading: https://repo.cloudbees.com/content/repositories/central/org/slf4j/slf4j-parent/1.7.2/slf4j-parent-1.7.2.pom
Downloaded: https://repo.cloudbees.com/content/repositories/central/org/slf4j/slf4j-parent/1.7.2/slf4j-parent-1.7.2.pom
(12 KB at 640.4 KB/sec)
Downloading: https://oss.sonatype.org/content/repositories/snapshots/org/apache/jclouds/driver/jclouds-bouncycastle/1.7.4-SNAPSHOT/maven-metadata.xml
Downloading: https://repository.apache.org/content/repositories/snapshots/org/apache/jclouds/driver/jclouds-bouncycastle/1.7.4-SNAPSHOT/maven-metadata.xml
Downloading: https://repository-jclouds.forge.cloudbees.com/snapshot/org/apache/jclouds/driver/jclouds-bouncycastle/1.7.4-SNAPSHOT/maven-metadata.xml
Downloading: http://repository.apache.org/snapshots/org/apache/jclouds/driver/jclouds-bouncycastle/1.7.4-SNAPSHOT/maven-metadata.xml
Downloading: https://oss.sonatype.org/content/repositories/snapshots/org/apache/jclouds/driver/jclouds-bouncycastle/1.7.4-SNAPSHOT/maven-metadata.xml
Downloaded: http://repository.apache.org/snapshots/org/apache/jclouds/driver/jclouds-bouncycastle/1.7.4-SNAPSHOT/maven-metadata.xml
(2 KB at 40.2 KB/sec)
Downloaded: https://repository.apache.org/content/repositories/snapshots/org/apache/jclouds/driver/jclouds-bouncycastle/1.7.4-SNAPSHOT/maven-metadata.xml
(2 KB at 37.0 KB/sec)
Downloading: https://repository-jclouds.forge.cloudbees.com/snapshot/org/apache/jclouds/driver/jclouds-bouncycastle/1.7.4-SNAPSHOT/jclouds-bouncycastle-1.7.4-20170117.235023-32.pom
Downloading: https://repository.apache.org/content/repositories/snapshots/org/apache/jclouds/driver/jclouds-bouncycastle/1.7.4-SNAPSHOT/jclouds-bouncycastle-1.7.4-20170117.235023-32.pom
Downloaded: https://repository.apache.org/content/repositories/snapshots/org/apache/jclouds/driver/jclouds-bouncycastle/1.7.4-SNAPSHOT/jclouds-bouncycastle-1.7.4-20170117.235023-32.pom
(3 KB at 65.9 KB/sec)
Downloading: https://repo.cloudbees.com/content/repositories/central/org/bouncycastle/bcprov-ext-jdk15on/1.49/bcprov-ext-jdk15on-1.49.pom
Downloaded: https://repo.cloudbees.com/content/repositories/central/org/bouncycastle/bcprov-ext-jdk15on/1.49/bcprov-ext-jdk15on-1.49.pom
(2 KB at 89.9 KB/sec)
Downloading: https://repo.cloudbees.com/content/repositories/central/net/schmizz/sshj/0.8.1/sshj-0.8.1.pom
Downloaded: https://repo.cloudbees.com/content/repositories/central/net/schmizz/sshj/0.8.1/sshj-0.8.1.pom
(10 KB at 701.2 KB/sec)
Downloading: https://repo.cloudbees.com/content/repositories/central/org/slf4j/slf4j-api/1.6.1/slf4j-api-1.6.1.pom
Downloaded: https://repo.cloudbees.com/content/repositories/central/org/slf4j/slf4j-api/1.6.1/slf4j-api-1.6.1.pom
(3 KB at 243.7 KB/sec)
Downloading: https://repo.cloudbees.com/content/repositories/central/org/slf4j/slf4j-parent/1.6.1/slf4j-parent-1.6.1.pom
Downloaded: https://repo.cloudbees.com/content/repositories/central/org/slf4j/slf4j-parent/1.6.1/slf4j-parent-1.6.1.pom
(10 KB at 700.3 KB/sec)
Downloading: https://repo.cloudbees.com/content/repositories/central/org/bouncycastle/bcpkix-jdk15on/1.49/bcpkix-jdk15on-1.49.pom
Downloaded: https://repo.cloudbees.com/content/repositories/central/org/bouncycastle/bcpkix-jdk15on/1.49/bcpkix-jdk15on-1.49.pom
(2 KB at 110.4 KB/sec)
Downloading: https://repo.cloudbees.com/content/repositories/central/com/jcraft/jsch.agentproxy.sshj/0.0.7/jsch.agentproxy.sshj-0.0.7.pom
Downloaded: https://repo.cloudbees.com/content/repositories/central/com/jcraft/jsch.agentproxy.sshj/0.0.7/jsch.agentproxy.sshj-0.0.7.pom
(2 KB at 89.1 KB/sec)
Downloading: https://repo.cloudbees.com/content/repositories/central/com/jcraft/jsch.agentproxy/0.0.7/jsch.agentproxy-0.0.7.pom
Downloaded: https://repo.cloudbees.com/content/repositories/central/com/jcraft/jsch.agentproxy/0.0.7/jsch.agentproxy-0.0.7.pom
(5 KB at 303.2 KB/sec)
Downloading: https://repo.cloudbees.com/content/repositories/central/org/sonatype/oss/oss-parent/6/oss-parent-6.pom
Downloaded: https://repo.cloudbees.com/content/repositories/central/org/sonatype/oss/oss-parent/6/oss-parent-6.pom
(5 KB at 262.1 KB/sec)
Downloading: https://repository-jclouds.forge.cloudbees.com/release/net/schmizz/sshj/maven-metadata.xml
Downloading: https://repository-jclouds.forge.cloudbees.com/snapshot/net/schmizz/sshj/maven-metadata.xml
Downloading: https://repo.cloudbees.com/content/repositories/central/net/schmizz/sshj/maven-metadata.xml
Downloading: https://repository.apache.org/content/repositories/snapshots/net/schmizz/sshj/maven-metadata.xml
Downloading: https://oss.sonatype.org/content/repositories/snapshots/net/schmizz/sshj/maven-metadata.xml
Downloading: http://repository.apache.org/snapshots/net/schmizz/sshj/maven-metadata.xml
Downloading: https://oss.sonatype.org/content/repositories/snapshots/net/schmizz/sshj/maven-metadata.xml
Downloaded: https://repo.cloudbees.com/content/repositories/central/net/schmizz/sshj/maven-metadata.xml
(790 B at 40.6 KB/sec)
Downloaded: https://oss.sonatype.org/content/repositories/snapshots/net/schmizz/sshj/maven-metadata.xml
(398 B at 14.4 KB/sec)
Downloaded: https://oss.sonatype.org/content/repositories/snapshots/net/schmizz/sshj/maven-metadata.xml
(398 B at 13.4 KB/sec)
Downloading: https://repo.cloudbees.com/content/repositories/central/net/schmizz/sshj/0.9.0/sshj-0.9.0.pom
Downloaded: https://repo.cloudbees.com/content/repositories/central/net/schmizz/sshj/0.9.0/sshj-0.9.0.pom
(9 KB at 284.3 KB/sec)
Downloading: https://repo.cloudbees.com/content/repositories/central/org/slf4j/slf4j-api/1.7.5/slf4j-api-1.7.5.pom
Downloaded: https://repo.cloudbees.com/content/repositories/central/org/slf4j/slf4j-api/1.7.5/slf4j-api-1.7.5.pom
(3 KB at 93.8 KB/sec)
Downloading: https://repo.cloudbees.com/content/repositories/central/org/slf4j/slf4j-parent/1.7.5/slf4j-parent-1.7.5.pom
Downloaded: https://repo.cloudbees.com/content/repositories/central/org/slf4j/slf4j-parent/1.7.5/slf4j-parent-1.7.5.pom
(12 KB at 311.5 KB/sec)
Downloading: https://repo.cloudbees.com/content/repositories/central/org/bouncycastle/bcprov-jdk15on/1.49/bcprov-jdk15on-1.49.pom
Downloaded: https://repo.cloudbees.com/content/repositories/central/org/bouncycastle/bcprov-jdk15on/1.49/bcprov-jdk15on-1.49.pom
(2 KB at 84.0 KB/sec)
Downloading: https://repository-jclouds.forge.cloudbees.com/snapshot/net/schmizz/sshj/0.9.1-SNAPSHOT/maven-metadata.xml
Downloading: https://repository.apache.org/content/repositories/snapshots/net/schmizz/sshj/0.9.1-SNAPSHOT/maven-metadata.xml
Downloading: http://repository.apache.org/snapshots/net/schmizz/sshj/0.9.1-SNAPSHOT/maven-metadata.xml
Downloading: https://oss.sonatype.org/content/repositories/snapshots/net/schmizz/sshj/0.9.1-SNAPSHOT/maven-metadata.xml
Downloading: https://oss.sonatype.org/content/repositories/snapshots/net/schmizz/sshj/0.9.1-SNAPSHOT/maven-metadata.xml
Downloaded: https://oss.sonatype.org/content/repositories/snapshots/net/schmizz/sshj/0.9.1-SNAPSHOT/maven-metadata.xml
(2 KB at 44.8 KB/sec)
Downloaded: https://oss.sonatype.org/content/repositories/snapshots/net/schmizz/sshj/0.9.1-SNAPSHOT/maven-metadata.xml
(2 KB at 32.4 KB/sec)
Downloading: https://repository-jclouds.forge.cloudbees.com/snapshot/net/schmizz/sshj/0.9.1-SNAPSHOT/sshj-0.9.1-20130812.023717-1.pom
Downloading: https://repository.apache.org/content/repositories/snapshots/net/schmizz/sshj/0.9.1-SNAPSHOT/sshj-0.9.1-20130812.023717-1.pom
Downloading: https://oss.sonatype.org/content/repositories/snapshots/net/schmizz/sshj/0.9.1-SNAPSHOT/sshj-0.9.1-20130812.023717-1.pom
Downloaded: https://oss.sonatype.org/content/repositories/snapshots/net/schmizz/sshj/0.9.1-SNAPSHOT/sshj-0.9.1-20130812.023717-1.pom
(9 KB at 304.1 KB/sec)
Downloading: https://repo.cloudbees.com/content/repositories/central/net/schmizz/sshj/0.10.0/sshj-0.10.0.pom
Downloaded: https://repo.cloudbees.com/content/repositories/central/net/schmizz/sshj/0.10.0/sshj-0.10.0.pom
(13 KB at 1144.9 KB/sec)
Downloading: https://repo.cloudbees.com/content/repositories/central/org/slf4j/slf4j-api/1.7.7/slf4j-api-1.7.7.pom
Downloaded: https://repo.cloudbees.com/content/repositories/central/org/slf4j/slf4j-api/1.7.7/slf4j-api-1.7.7.pom
(3 KB at 262.6 KB/sec)
Downloading: https://repo.cloudbees.com/content/repositories/central/org/slf4j/slf4j-parent/1.7.7/slf4j-parent-1.7.7.pom
Downloaded: https://repo.cloudbees.com/content/repositories/central/org/slf4j/slf4j-parent/1.7.7/slf4j-parent-1.7.7.pom
(12 KB at 969.0 KB/sec)
Downloading: https://repo.cloudbees.com/content/repositories/central/org/bouncycastle/bcpkix-jdk15on/1.50/bcpkix-jdk15on-1.50.pom
Downloaded: https://repo.cloudbees.com/content/repositories/central/org/bouncycastle/bcpkix-jdk15on/1.50/bcpkix-jdk15on-1.50.pom
(2 KB at 119.9 KB/sec)
Downloading: https://repo.cloudbees.com/content/repositories/central/org/bouncycastle/bcprov-jdk15on/1.50/bcprov-jdk15on-1.50.pom
Downloaded: https://repo.cloudbees.com/content/repositories/central/org/bouncycastle/bcprov-jdk15on/1.50/bcprov-jdk15on-1.50.pom
(2 KB at 93.9 KB/sec)
Downloading: https://repository-jclouds.forge.cloudbees.com/snapshot/net/schmizz/sshj/0.10.1-SNAPSHOT/maven-metadata.xml
Downloading: https://repository.apache.org/content/repositories/snapshots/net/schmizz/sshj/0.10.1-SNAPSHOT/maven-metadata.xml
Downloading: https://oss.sonatype.org/content/repositories/snapshots/net/schmizz/sshj/0.10.1-SNAPSHOT/maven-metadata.xml
Downloading: http://repository.apache.org/snapshots/net/schmizz/sshj/0.10.1-SNAPSHOT/maven-metadata.xml
Downloading: https://oss.sonatype.org/content/repositories/snapshots/net/schmizz/sshj/0.10.1-SNAPSHOT/maven-metadata.xml
Downloaded: https://oss.sonatype.org/content/repositories/snapshots/net/schmizz/sshj/0.10.1-SNAPSHOT/maven-metadata.xml
(2 KB at 47.6 KB/sec)
Downloaded: https://oss.sonatype.org/content/repositories/snapshots/net/schmizz/sshj/0.10.1-SNAPSHOT/maven-metadata.xml
(2 KB at 51.1 KB/sec)
Downloading: https://repository-jclouds.forge.cloudbees.com/snapshot/net/schmizz/sshj/0.10.1-SNAPSHOT/sshj-0.10.1-20140702.063459-1.pom
Downloading: https://repository.apache.org/content/repositories/snapshots/net/schmizz/sshj/0.10.1-SNAPSHOT/sshj-0.10.1-20140702.063459-1.pom
Downloading: https://oss.sonatype.org/content/repositories/snapshots/net/schmizz/sshj/0.10.1-SNAPSHOT/sshj-0.10.1-20140702.063459-1.pom
Downloaded: https://oss.sonatype.org/content/repositories/snapshots/net/schmizz/sshj/0.10.1-SNAPSHOT/sshj-0.10.1-20140702.063459-1.pom
(13 KB at 418.9 KB/sec)
Downloading: https://repo.cloudbees.com/content/repositories/central/com/jcraft/jsch.agentproxy.core/0.0.7/jsch.agentproxy.core-0.0.7.pom
Downloaded: https://repo.cloudbees.com/content/repositories/central/com/jcraft/jsch.agentproxy.core/0.0.7/jsch.agentproxy.core-0.0.7.pom
(804 B at 65.4 KB/sec)
Downloading: https://repo.cloudbees.com/content/repositories/central/com/jcraft/jsch.agentproxy.connector-factory/0.0.7/jsch.agentproxy.connector-factory-0.0.7.pom
Downloaded: https://repo.cloudbees.com/content/repositories/central/com/jcraft/jsch.agentproxy.connector-factory/0.0.7/jsch.agentproxy.connector-factory-0.0.7.pom
(2 KB at 124.9 KB/sec)
Downloading: https://repo.cloudbees.com/content/repositories/central/com/jcraft/jsch.agentproxy.usocket-jna/0.0.7/jsch.agentproxy.usocket-jna-0.0.7.pom
Downloaded: https://repo.cloudbees.com/content/repositories/central/com/jcraft/jsch.agentproxy.usocket-jna/0.0.7/jsch.agentproxy.usocket-jna-0.0.7.pom
(2 KB at 106.0 KB/sec)
Downloading: https://repo.cloudbees.com/content/repositories/central/net/java/dev/jna/jna/3.4.0/jna-3.4.0.pom
Downloaded: https://repo.cloudbees.com/content/repositories/central/net/java/dev/jna/jna/3.4.0/jna-3.4.0.pom
(3 KB at 162.6 KB/sec)
Downloading: https://repo.cloudbees.com/content/repositories/central/net/java/dev/jna/platform/3.4.0/platform-3.4.0.pom
Downloaded: https://repo.cloudbees.com/content/repositories/central/net/java/dev/jna/platform/3.4.0/platform-3.4.0.pom
(3 KB at 216.4 KB/sec)
Downloading: https://repo.cloudbees.com/content/repositories/central/com/jcraft/jsch.agentproxy.usocket-nc/0.0.7/jsch.agentproxy.usocket-nc-0.0.7.pom
Downloaded: https://repo.cloudbees.com/content/repositories/central/com/jcraft/jsch.agentproxy.usocket-nc/0.0.7/jsch.agentproxy.usocket-nc-0.0.7.pom
(996 B at 81.1 KB/sec)
Downloading: https://repo.cloudbees.com/content/repositories/central/com/jcraft/jsch.agentproxy.sshagent/0.0.7/jsch.agentproxy.sshagent-0.0.7.pom
Downloaded: https://repo.cloudbees.com/content/repositories/central/com/jcraft/jsch.agentproxy.sshagent/0.0.7/jsch.agentproxy.sshagent-0.0.7.pom
(971 B at 79.0 KB/sec)
Downloading: https://repo.cloudbees.com/content/repositories/central/com/jcraft/jsch.agentproxy.pageant/0.0.7/jsch.agentproxy.pageant-0.0.7.pom
Downloaded: https://repo.cloudbees.com/content/repositories/central/com/jcraft/jsch.agentproxy.pageant/0.0.7/jsch.agentproxy.pageant-0.0.7.pom
(2 KB at 104.7 KB/sec)
Downloading: https://repo.cloudbees.com/content/repositories/central/ch/qos/logback/logback-classic/1.0.9/logback-classic-1.0.9.pom
Downloaded: https://repo.cloudbees.com/content/repositories/central/ch/qos/logback/logback-classic/1.0.9/logback-classic-1.0.9.pom
(13 KB at 861.0 KB/sec)
Downloading: https://repo.cloudbees.com/content/repositories/central/ch/qos/logback/logback-parent/1.0.9/logback-parent-1.0.9.pom
Downloaded: https://repo.cloudbees.com/content/repositories/central/ch/qos/logback/logback-parent/1.0.9/logback-parent-1.0.9.pom
(16 KB at 1093.8 KB/sec)
Downloading: https://repo.cloudbees.com/content/repositories/central/ch/qos/logback/logback-core/1.0.9/logback-core-1.0.9.pom
Downloaded: https://repo.cloudbees.com/content/repositories/central/ch/qos/logback/logback-core/1.0.9/logback-core-1.0.9.pom
(6 KB at 442.1 KB/sec)
Downloading: https://repository.apache.org/content/repositories/snapshots/com/google/guava/guava/maven-metadata.xml
Downloading: http://repository.apache.org/snapshots/com/google/guava/guava/maven-metadata.xml
[WARNING] The following dependencies could not be resolved at this point of the build but
seem to be part of the reactor:
[WARNING] Try running the build up to the lifecycle phase "package"
Downloading: https://repository-jclouds.forge.cloudbees.com/snapshot/org/apache/jclouds/api/sts/1.7.4-SNAPSHOT/sts-1.7.4-SNAPSHOT.jar
Downloading: https://repository.apache.org/content/repositories/snapshots/org/apache/jclouds/api/sts/1.7.4-SNAPSHOT/sts-1.7.4-SNAPSHOT.jar
Downloading: https://oss.sonatype.org/content/repositories/snapshots/org/apache/jclouds/api/sts/1.7.4-SNAPSHOT/sts-1.7.4-SNAPSHOT.jar
Downloading: http://repository.apache.org/snapshots/org/apache/jclouds/api/sts/1.7.4-SNAPSHOT/sts-1.7.4-SNAPSHOT.jar
Started calculate disk usage of build
Finished Calculation of disk usage of build in 0 seconds
Started calculate disk usage of workspace
Finished Calculation of disk usage of workspace in 0 seconds
[INFO] ------------------------------------------------------------------------
[INFO] Reactor Summary:
[INFO] 
[INFO] Apache jclouds labs aws ........................... FAILURE [17:20.077s]
[INFO] jcloud elb api .................................... SKIPPED
[INFO] jcloud iam api .................................... SKIPPED
[INFO] jcloud rds api .................................... SKIPPED
[INFO] jclouds Amazon Elastic Load Balancer provider ..... SKIPPED
[INFO] jclouds Amazon Identity and Access Management (IAM) provider  SKIPPED
[INFO] jclouds Amazon Relational Database Service provider  SKIPPED
[INFO] ------------------------------------------------------------------------
[INFO] BUILD FAILURE
[INFO] ------------------------------------------------------------------------
[INFO] Total time: 17:26.412s
[INFO] Finished at: Tue Jan 17 19:08:47 EST 2017
[INFO] Final Memory: 24M/185M
[INFO] ------------------------------------------------------------------------
Waiting for Jenkins to finish collecting data
[ERROR] Failed to execute goal on project iam: Could not resolve dependencies for project
org.apache.jclouds.labs:iam:bundle:1.7.4-SNAPSHOT: Could not find artifact org.apache.jclouds.api:sts:jar:1.7.4-SNAPSHOT
in cloudbees-private-snapshot-repository (https://repository-jclouds.forge.cloudbees.com/snapshot)
-> [Help 1]
org.apache.maven.lifecycle.LifecycleExecutionException: Failed to execute goal on project
iam: Could not resolve dependencies for project org.apache.jclouds.labs:iam:bundle:1.7.4-SNAPSHOT:
Could not find artifact org.apache.jclouds.api:sts:jar:1.7.4-SNAPSHOT in cloudbees-private-snapshot-repository
(https://repository-jclouds.forge.cloudbees.com/snapshot)
	at org.apache.maven.lifecycle.internal.LifecycleDependencyResolver.getDependencies(LifecycleDependencyResolver.java:196)
	at org.apache.maven.lifecycle.internal.LifecycleDependencyResolver.resolveProjectDependencies(LifecycleDependencyResolver.java:108)
	at org.apache.maven.lifecycle.internal.MojoExecutor.ensureDependenciesAreResolved(MojoExecutor.java:275)
	at org.apache.maven.lifecycle.internal.MojoExecutor.execute(MojoExecutor.java:201)
	at org.apache.maven.lifecycle.internal.MojoExecutor.execute(MojoExecutor.java:153)
	at org.apache.maven.lifecycle.internal.MojoExecutor.execute(MojoExecutor.java:145)
	at org.apache.maven.lifecycle.internal.LifecycleModuleBuilder.buildProject(LifecycleModuleBuilder.java:84)
	at org.apache.maven.lifecycle.internal.LifecycleModuleBuilder.buildProject(LifecycleModuleBuilder.java:59)
	at org.apache.maven.lifecycle.internal.LifecycleStarter.singleThreadedBuild(LifecycleStarter.java:183)
	at org.apache.maven.lifecycle.internal.LifecycleStarter.execute(LifecycleStarter.java:161)
	at org.apache.maven.DefaultMaven.doExecute(DefaultMaven.java:319)
	at org.apache.maven.DefaultMaven.execute(DefaultMaven.java:156)
	at org.jvnet.hudson.maven3.launcher.Maven3Launcher.main(Maven3Launcher.java:117)
	at sun.reflect.NativeMethodAccessorImpl.invoke0(Native Method)
	at sun.reflect.NativeMethodAccessorImpl.invoke(NativeMethodAccessorImpl.java:57)
	at sun.reflect.DelegatingMethodAccessorImpl.invoke(DelegatingMethodAccessorImpl.java:43)
	at java.lang.reflect.Method.invoke(Method.java:606)
	at org.codehaus.plexus.classworlds.launcher.Launcher.launchStandard(Launcher.java:329)
	at org.codehaus.plexus.classworlds.launcher.Launcher.launch(Launcher.java:239)
	at org.jvnet.hudson.maven3.agent.Maven3Main.launch(Maven3Main.java:178)
	at sun.reflect.NativeMethodAccessorImpl.invoke0(Native Method)
	at sun.reflect.NativeMethodAccessorImpl.invoke(NativeMethodAccessorImpl.java:57)
	at sun.reflect.DelegatingMethodAccessorImpl.invoke(DelegatingMethodAccessorImpl.java:43)
	at java.lang.reflect.Method.invoke(Method.java:606)
	at hudson.maven.Maven3Builder.call(Maven3Builder.java:136)
	at hudson.maven.Maven3Builder.call(Maven3Builder.java:71)
	at hudson.remoting.UserRequest.perform(UserRequest.java:153)
	at hudson.remoting.UserRequest.perform(UserRequest.java:50)
	at hudson.remoting.Request$2.run(Request.java:332)
	at hudson.remoting.InterceptingExecutorService$1.call(InterceptingExecutorService.java:68)
	at java.util.concurrent.FutureTask.run(FutureTask.java:262)
	at java.util.concurrent.ThreadPoolExecutor.runWorker(ThreadPoolExecutor.java:1145)
	at java.util.concurrent.ThreadPoolExecutor$Worker.run(ThreadPoolExecutor.java:615)
	at java.lang.Thread.run(Thread.java:745)
Caused by: org.apache.maven.project.DependencyResolutionException: Could not resolve dependencies
for project org.apache.jclouds.labs:iam:bundle:1.7.4-SNAPSHOT: Could not find artifact org.apache.jclouds.api:sts:jar:1.7.4-SNAPSHOT
in cloudbees-private-snapshot-repository (https://repository-jclouds.forge.cloudbees.com/snapshot)
	at org.apache.maven.project.DefaultProjectDependenciesResolver.resolve(DefaultProjectDependenciesResolver.java:170)
	at org.apache.maven.lifecycle.internal.LifecycleDependencyResolver.getDependencies(LifecycleDependencyResolver.java:171)
	... 33 more
Caused by: org.sonatype.aether.resolution.DependencyResolutionException: Could not find artifact
org.apache.jclouds.api:sts:jar:1.7.4-SNAPSHOT in cloudbees-private-snapshot-repository (https://repository-jclouds.forge.cloudbees.com/snapshot)
	at org.sonatype.aether.impl.internal.DefaultRepositorySystem.resolveDependencies(DefaultRepositorySystem.java:412)
	at org.apache.maven.project.DefaultProjectDependenciesResolver.resolve(DefaultProjectDependenciesResolver.java:164)
	... 34 more
Caused by: org.sonatype.aether.resolution.ArtifactResolutionException: Could not find artifact
org.apache.jclouds.api:sts:jar:1.7.4-SNAPSHOT in cloudbees-private-snapshot-repository (https://repository-jclouds.forge.cloudbees.com/snapshot)
	at org.sonatype.aether.impl.internal.DefaultArtifactResolver.resolve(DefaultArtifactResolver.java:541)
	at org.sonatype.aether.impl.internal.DefaultArtifactResolver.resolveArtifacts(DefaultArtifactResolver.java:220)
	at org.sonatype.aether.impl.internal.DefaultRepositorySystem.resolveDependencies(DefaultRepositorySystem.java:395)
	... 35 more
Caused by: org.sonatype.aether.transfer.ArtifactNotFoundException: Could not find artifact
org.apache.jclouds.api:sts:jar:1.7.4-SNAPSHOT in cloudbees-private-snapshot-repository (https://repository-jclouds.forge.cloudbees.com/snapshot)
	at org.sonatype.aether.connector.wagon.WagonRepositoryConnector$4.wrap(WagonRepositoryConnector.java:945)
	at org.sonatype.aether.connector.wagon.WagonRepositoryConnector$4.wrap(WagonRepositoryConnector.java:940)
	at org.sonatype.aether.connector.wagon.WagonRepositoryConnector$GetTask.flush(WagonRepositoryConnector.java:695)
	at org.sonatype.aether.connector.wagon.WagonRepositoryConnector$GetTask.flush(WagonRepositoryConnector.java:689)
	at org.sonatype.aether.connector.wagon.WagonRepositoryConnector.get(WagonRepositoryConnector.java:445)
	at org.sonatype.aether.impl.internal.DefaultArtifactResolver.resolve(DefaultArtifactResolver.java:460)
	... 37 more
[ERROR] 
[ERROR] Re-run Maven using the -X switch to enable full debug logging.
[ERROR] 
[ERROR] For more information about the errors and possible solutions, please read the following
articles:
[ERROR] [Help 1] http://cwiki.apache.org/confluence/display/MAVEN/DependencyResolutionException
[ERROR] 
[ERROR] After correcting the problems, you can resume the build with the command
[ERROR]   mvn <goals> -rf :iam
[JENKINS] Archiving <https://jclouds.ci.cloudbees.com/job/jclouds-labs-aws-1.7.x-branch/ws/rds/pom.xml>
to org.apache.jclouds.labs/rds/1.7.4-SNAPSHOT/rds-1.7.4-SNAPSHOT.pom
[JENKINS] Archiving <https://jclouds.ci.cloudbees.com/job/jclouds-labs-aws-1.7.x-branch/ws/pom.xml>
to org.apache.jclouds.labs/jclouds-labs-aws/1.7.4-SNAPSHOT/jclouds-labs-aws-1.7.4-SNAPSHOT.pom
[JENKINS] Archiving <https://jclouds.ci.cloudbees.com/job/jclouds-labs-aws-1.7.x-branch/ws/target/jclouds-labs-aws-1.7.4-SNAPSHOT-tests.jar>
to org.apache.jclouds.labs/jclouds-labs-aws/1.7.4-SNAPSHOT/jclouds-labs-aws-1.7.4-SNAPSHOT-tests.jar
[JENKINS] Archiving <https://jclouds.ci.cloudbees.com/job/jclouds-labs-aws-1.7.x-branch/ws/elb/pom.xml>
to org.apache.jclouds.labs/elb/1.7.4-SNAPSHOT/elb-1.7.4-SNAPSHOT.pom
[JENKINS] Archiving <https://jclouds.ci.cloudbees.com/job/jclouds-labs-aws-1.7.x-branch/ws/aws-iam/pom.xml>
to org.apache.jclouds.labs/aws-iam/1.7.4-SNAPSHOT/aws-iam-1.7.4-SNAPSHOT.pom
[JENKINS] Archiving <https://jclouds.ci.cloudbees.com/job/jclouds-labs-aws-1.7.x-branch/ws/aws-rds/pom.xml>
to org.apache.jclouds.labs/aws-rds/1.7.4-SNAPSHOT/aws-rds-1.7.4-SNAPSHOT.pom
[JENKINS] Archiving <https://jclouds.ci.cloudbees.com/job/jclouds-labs-aws-1.7.x-branch/ws/iam/pom.xml>
to org.apache.jclouds.labs/iam/1.7.4-SNAPSHOT/iam-1.7.4-SNAPSHOT.pom
[JENKINS] Archiving <https://jclouds.ci.cloudbees.com/job/jclouds-labs-aws-1.7.x-branch/ws/aws-elb/pom.xml>
to org.apache.jclouds.labs/aws-elb/1.7.4-SNAPSHOT/aws-elb-1.7.4-SNAPSHOT.pom
Sending e-mails to: notifications@jclouds.apache.org
channel stopped

Mime
View raw message