jclouds-notifications mailing list archives

Site index · List index
Message view « Date » · « Thread »
Top « Date » · « Thread »
From jenkins-no-re...@cloudbees.com
Subject Build failed in Jenkins: jclouds-labs-aws-2.0.x-branch #12
Date Wed, 11 Jan 2017 11:20:13 GMT
https://jclouds.ci.cloudbees.com/job/jclouds-labs-aws-2.0.x-branch/12/------------------------------------------
Started by upstream project "jclouds-labs-2.0.x-branch" build number 11
originally caused by:
 Started by upstream project "jclouds-2.0.x-branch" build number 10
 originally caused by:
  Started by user Ignasi Barrera
Building remotely on c8985470 (standard m1.large lxc-fedora17 large) in workspace <https://jclouds.ci.cloudbees.com/job/jclouds-labs-aws-2.0.x-branch/ws/>
$ sudo /opt/jenkins/sbin/mount-webdav https://repository-jclouds.forge.cloudbees.com/private
jclouds alert
webdav mount try 1
Private webdav filestore is mounted
Cloning the remote Git repository
Cloning repository https://git-wip-us.apache.org/repos/asf/jclouds-labs-aws.git
 > git init <https://jclouds.ci.cloudbees.com/job/jclouds-labs-aws-2.0.x-branch/ws/>
# timeout=10
Fetching upstream changes from https://git-wip-us.apache.org/repos/asf/jclouds-labs-aws.git
 > git --version # timeout=10
 > git -c core.askpass=true fetch --tags --progress https://git-wip-us.apache.org/repos/asf/jclouds-labs-aws.git
+refs/heads/*:refs/remotes/origin/*
 > git config remote.origin.url https://git-wip-us.apache.org/repos/asf/jclouds-labs-aws.git
# timeout=10
 > git config --add remote.origin.fetch +refs/heads/*:refs/remotes/origin/* # timeout=10
 > git config remote.origin.url https://git-wip-us.apache.org/repos/asf/jclouds-labs-aws.git
# timeout=10
Fetching upstream changes from https://git-wip-us.apache.org/repos/asf/jclouds-labs-aws.git
 > git -c core.askpass=true fetch --tags --progress https://git-wip-us.apache.org/repos/asf/jclouds-labs-aws.git
+refs/heads/*:refs/remotes/origin/*
 > git rev-parse refs/remotes/origin/2.0.x^{commit} # timeout=10
 > git rev-parse refs/remotes/origin/origin/2.0.x^{commit} # timeout=10
Checking out Revision 0161ba1ba6d03cb0e2d4a7b38fb6d9111a8f952b (refs/remotes/origin/2.0.x)
 > git config core.sparsecheckout # timeout=10
 > git checkout -f 0161ba1ba6d03cb0e2d4a7b38fb6d9111a8f952b
 > git rev-list 0161ba1ba6d03cb0e2d4a7b38fb6d9111a8f952b # timeout=10
 > git tag -a -f -m Jenkins Build #12 jenkins-jclouds-labs-aws-2.0.x-branch-12 # timeout=10
Parsing POMs
Failed to transfer Could not find metadata org.apache.jclouds:jclouds-project:2.0.1-SNAPSHOT/maven-metadata.xml
in sonatype-nexus-snapshots (https://oss.sonatype.org/content/repositories/snapshots)
Failed to transfer Could not find metadata org.apache.jclouds:jclouds-project:2.0.1-SNAPSHOT/maven-metadata.xml
in cloudbees-private-snapshot-repository (https://repository-jclouds.forge.cloudbees.com/snapshot)
Failed to transfer Could not transfer metadata org.apache.jclouds:jclouds-project:2.0.1-SNAPSHOT/maven-metadata.xml
from/to apache-snapshots (https://repository.apache.org/content/repositories/snapshots): Connection
to https://repository.apache.org refused
Failed to transfer Could not find artifact org.apache.jclouds:jclouds-project:pom:2.0.1-SNAPSHOT
in cloudbees-private-snapshot-repository (https://repository-jclouds.forge.cloudbees.com/snapshot)
Failed to transfer Could not transfer artifact org.apache.jclouds:jclouds-project:pom:2.0.1-SNAPSHOT
from/to apache-snapshots (https://repository.apache.org/content/repositories/snapshots): Connection
to https://repository.apache.org refused
Failed to transfer Could not find artifact org.apache.jclouds:jclouds-project:pom:2.0.1-SNAPSHOT
in sonatype-nexus-snapshots (https://oss.sonatype.org/content/repositories/snapshots)
ERROR: Failed to parse POMs
java.io.IOException: remote file operation failed: <https://jclouds.ci.cloudbees.com/job/jclouds-labs-aws-2.0.x-branch/ws/>
at hudson.remoting.Channel@54712052:c8985470: hudson.remoting.ProxyException: hudson.maven.MavenModuleSetBuild$MavenExecutionException:
org.apache.maven.project.ProjectBuildingException: Some problems were encountered while processing
the POMs:
[FATAL] Non-resolvable parent POM: Could not transfer artifact org.apache.jclouds:jclouds-project:pom:2.0.1-SNAPSHOT
from/to apache-snapshots (https://repository.apache.org/content/repositories/snapshots): Connection
to https://repository.apache.org refused and 'parent.relativePath' points at wrong local POM
@ line 22, column 11

	at hudson.FilePath.act(FilePath.java:1014)
	at hudson.FilePath.act(FilePath.java:996)
	at hudson.maven.MavenModuleSetBuild$MavenModuleSetBuildExecution.parsePoms(MavenModuleSetBuild.java:959)
	at hudson.maven.MavenModuleSetBuild$MavenModuleSetBuildExecution.doRun(MavenModuleSetBuild.java:679)
	at hudson.model.AbstractBuild$AbstractBuildExecution.run(AbstractBuild.java:544)
	at hudson.model.Run.execute(Run.java:1741)
	at hudson.maven.MavenModuleSetBuild.run(MavenModuleSetBuild.java:531)
	at hudson.model.ResourceController.execute(ResourceController.java:98)
	at hudson.model.Executor.run(Executor.java:410)
Caused by: hudson.remoting.ProxyException: hudson.maven.MavenModuleSetBuild$MavenExecutionException:
org.apache.maven.project.ProjectBuildingException: Some problems were encountered while processing
the POMs:
[FATAL] Non-resolvable parent POM: Could not transfer artifact org.apache.jclouds:jclouds-project:pom:2.0.1-SNAPSHOT
from/to apache-snapshots (https://repository.apache.org/content/repositories/snapshots): Connection
to https://repository.apache.org refused and 'parent.relativePath' points at wrong local POM
@ line 22, column 11

	at hudson.maven.MavenModuleSetBuild$PomParser.invoke(MavenModuleSetBuild.java:1363)
	at hudson.maven.MavenModuleSetBuild$PomParser.invoke(MavenModuleSetBuild.java:1097)
	at hudson.FilePath$FileCallableWrapper.call(FilePath.java:2772)
	at hudson.remoting.UserRequest.perform(UserRequest.java:153)
	at hudson.remoting.UserRequest.perform(UserRequest.java:50)
	at hudson.remoting.Request$2.run(Request.java:332)
	at hudson.remoting.InterceptingExecutorService$1.call(InterceptingExecutorService.java:68)
	at java.util.concurrent.FutureTask.run(FutureTask.java:262)
	at java.util.concurrent.ThreadPoolExecutor.runWorker(ThreadPoolExecutor.java:1145)
	at java.util.concurrent.ThreadPoolExecutor$Worker.run(ThreadPoolExecutor.java:615)
	at java.lang.Thread.run(Thread.java:745)
	at ......remote call to c8985470(Native Method)
	at hudson.remoting.Channel.attachCallSiteStackTrace(Channel.java:1416)
	at hudson.remoting.UserResponse.retrieve(UserRequest.java:253)
	at hudson.remoting.Channel.call(Channel.java:781)
	at hudson.FilePath.act(FilePath.java:1007)
	... 8 more
Caused by: hudson.remoting.ProxyException: org.apache.maven.project.ProjectBuildingException:
Some problems were encountered while processing the POMs:
[FATAL] Non-resolvable parent POM: Could not transfer artifact org.apache.jclouds:jclouds-project:pom:2.0.1-SNAPSHOT
from/to apache-snapshots (https://repository.apache.org/content/repositories/snapshots): Connection
to https://repository.apache.org refused and 'parent.relativePath' points at wrong local POM
@ line 22, column 11

	at org.apache.maven.project.DefaultProjectBuilder.build(DefaultProjectBuilder.java:364)
	at hudson.maven.MavenEmbedder.buildProjects(MavenEmbedder.java:361)
	at hudson.maven.MavenEmbedder.readProjects(MavenEmbedder.java:331)
	at hudson.maven.MavenModuleSetBuild$PomParser.invoke(MavenModuleSetBuild.java:1300)
	at hudson.maven.MavenModuleSetBuild$PomParser.invoke(MavenModuleSetBuild.java:1097)
	at hudson.FilePath$FileCallableWrapper.call(FilePath.java:2772)
	at hudson.remoting.UserRequest.perform(UserRequest.java:153)
	at hudson.remoting.UserRequest.perform(UserRequest.java:50)
	at hudson.remoting.Request$2.run(Request.java:332)
	at hudson.remoting.InterceptingExecutorService$1.call(InterceptingExecutorService.java:68)
	at java.util.concurrent.FutureTask.run(FutureTask.java:262)
	at java.util.concurrent.ThreadPoolExecutor.runWorker(ThreadPoolExecutor.java:1145)
	at java.util.concurrent.ThreadPoolExecutor$Worker.run(ThreadPoolExecutor.java:615)
	at java.lang.Thread.run(Thread.java:745)
Started calculate disk usage of build
Finished Calculation of disk usage of build in 0 seconds
Started calculate disk usage of workspace
Finished Calculation of disk usage of workspace in 0 seconds

Mime
View raw message