jclouds-notifications mailing list archives

Site index · List index
Message view « Date » · « Thread »
Top « Date » · « Thread »
From jenkins-no-re...@cloudbees.com
Subject Build failed in Jenkins: jclouds-karaf-1.7.x-branch #154
Date Tue, 17 Jan 2017 23:57:33 GMT
https://jclouds.ci.cloudbees.com/job/jclouds-karaf-1.7.x-branch/154/------------------------------------------
[...truncated 167 lines...]
[INFO] Downloading: https://repository-jclouds.forge.cloudbees.com/release/org/apache/maven/doxia/doxia-core/1.0-alpha-7/doxia-core-1.0-alpha-7.pom
[INFO] Downloading: https://repo.cloudbees.com/content/repositories/central/org/apache/maven/reporting/maven-reporting-api/2.0.4/maven-reporting-api-2.0.4.pom
[INFO] Downloaded: https://repo.cloudbees.com/content/repositories/central/org/apache/maven/reporting/maven-reporting-api/2.0.4/maven-reporting-api-2.0.4.pom
(902 B at 58.7 KB/sec)
[INFO] Downloading: https://repository-jclouds.forge.cloudbees.com/release/org/apache/maven/reporting/maven-reporting-api/2.0.4/maven-reporting-api-2.0.4.pom
[INFO] Downloading: https://repo.cloudbees.com/content/repositories/central/org/apache/maven/doxia/doxia-site-renderer/1.0-alpha-7/doxia-site-renderer-1.0-alpha-7.pom
[INFO] Downloaded: https://repo.cloudbees.com/content/repositories/central/org/apache/maven/doxia/doxia-site-renderer/1.0-alpha-7/doxia-site-renderer-1.0-alpha-7.pom
(2 KB at 78.0 KB/sec)
[INFO] Downloading: https://repository-jclouds.forge.cloudbees.com/release/org/apache/maven/doxia/doxia-site-renderer/1.0-alpha-7/doxia-site-renderer-1.0-alpha-7.pom
[INFO] Downloading: https://repo.cloudbees.com/content/repositories/central/org/codehaus/plexus/plexus-velocity/1.1.2/plexus-velocity-1.1.2.pom
[INFO] Downloaded: https://repo.cloudbees.com/content/repositories/central/org/codehaus/plexus/plexus-velocity/1.1.2/plexus-velocity-1.1.2.pom
(8 KB at 412.1 KB/sec)
[INFO] Downloading: https://repository-jclouds.forge.cloudbees.com/release/org/codehaus/plexus/plexus-velocity/1.1.2/plexus-velocity-1.1.2.pom
[INFO] Downloading: https://repo.cloudbees.com/content/repositories/central/org/codehaus/plexus/plexus-container-default/1.0-alpha-7/plexus-container-default-1.0-alpha-7.pom
[INFO] Downloaded: https://repo.cloudbees.com/content/repositories/central/org/codehaus/plexus/plexus-container-default/1.0-alpha-7/plexus-container-default-1.0-alpha-7.pom
(2 KB at 78.7 KB/sec)
[INFO] Downloading: https://repository-jclouds.forge.cloudbees.com/release/org/codehaus/plexus/plexus-container-default/1.0-alpha-7/plexus-container-default-1.0-alpha-7.pom
[INFO] Downloading: https://repo.cloudbees.com/content/repositories/central/plexus/plexus-containers/1.0.2/plexus-containers-1.0.2.pom
[INFO] Downloaded: https://repo.cloudbees.com/content/repositories/central/plexus/plexus-containers/1.0.2/plexus-containers-1.0.2.pom
(471 B at 19.2 KB/sec)
[INFO] Downloading: https://repository-jclouds.forge.cloudbees.com/release/plexus/plexus-containers/1.0.2/plexus-containers-1.0.2.pom
[INFO] Downloading: https://repo.cloudbees.com/content/repositories/central/plexus/plexus-root/1.0.3/plexus-root-1.0.3.pom
[INFO] Downloaded: https://repo.cloudbees.com/content/repositories/central/plexus/plexus-root/1.0.3/plexus-root-1.0.3.pom
(6 KB at 345.8 KB/sec)
[INFO] Downloading: https://repository-jclouds.forge.cloudbees.com/release/plexus/plexus-root/1.0.3/plexus-root-1.0.3.pom
[INFO] Downloading: https://repo.cloudbees.com/content/repositories/central/plexus/plexus-utils/1.0.2/plexus-utils-1.0.2.pom
[INFO] Downloaded: https://repo.cloudbees.com/content/repositories/central/plexus/plexus-utils/1.0.2/plexus-utils-1.0.2.pom
(740 B at 48.2 KB/sec)
[INFO] Downloading: https://repository-jclouds.forge.cloudbees.com/release/plexus/plexus-utils/1.0.2/plexus-utils-1.0.2.pom
[INFO] Downloading: https://repo.cloudbees.com/content/repositories/central/commons-logging/commons-logging-api/1.0.4/commons-logging-api-1.0.4.pom
[INFO] Downloaded: https://repo.cloudbees.com/content/repositories/central/commons-logging/commons-logging-api/1.0.4/commons-logging-api-1.0.4.pom
(168 B at 10.9 KB/sec)
[INFO] Downloading: https://repository-jclouds.forge.cloudbees.com/release/commons-logging/commons-logging-api/1.0.4/commons-logging-api-1.0.4.pom
[INFO] Downloading: https://repo.cloudbees.com/content/repositories/central/org/apache/maven/doxia/doxia-decoration-model/1.0-alpha-7/doxia-decoration-model-1.0-alpha-7.pom
[INFO] Downloaded: https://repo.cloudbees.com/content/repositories/central/org/apache/maven/doxia/doxia-decoration-model/1.0-alpha-7/doxia-decoration-model-1.0-alpha-7.pom
(2 KB at 86.6 KB/sec)
[INFO] Downloading: https://repository-jclouds.forge.cloudbees.com/release/org/apache/maven/doxia/doxia-decoration-model/1.0-alpha-7/doxia-decoration-model-1.0-alpha-7.pom
[INFO] Downloading: https://repo.cloudbees.com/content/repositories/central/org/apache/rat/apache-rat-core/0.8/apache-rat-core-0.8.jar
[INFO] Downloading: https://repo.cloudbees.com/content/repositories/central/commons-collections/commons-collections/3.2/commons-collections-3.2.jar
[INFO] Downloading: https://repo.cloudbees.com/content/repositories/central/org/apache/commons/commons-compress/1.0/commons-compress-1.0.jar
[INFO] Downloading: https://repo.cloudbees.com/content/repositories/central/org/codehaus/plexus/plexus-utils/1.4/plexus-utils-1.4.jar
[INFO] Downloading: https://repo.cloudbees.com/content/repositories/central/org/apache/maven/doxia/doxia-site-renderer/1.0-alpha-8/doxia-site-renderer-1.0-alpha-8.jar
[INFO] Downloaded: https://repo.cloudbees.com/content/repositories/central/org/apache/rat/apache-rat-core/0.8/apache-rat-core-0.8.jar
(102 KB at 2752.7 KB/sec)
[INFO] Downloading: https://repo.cloudbees.com/content/repositories/central/org/apache/maven/doxia/doxia-core/1.0-alpha-8/doxia-core-1.0-alpha-8.jar
[INFO] Downloaded: https://repo.cloudbees.com/content/repositories/central/org/apache/maven/doxia/doxia-site-renderer/1.0-alpha-8/doxia-site-renderer-1.0-alpha-8.jar
(34 KB at 833.6 KB/sec)
[INFO] Downloading: https://repo.cloudbees.com/content/repositories/central/org/apache/maven/doxia/doxia-sink-api/1.0-alpha-8/doxia-sink-api-1.0-alpha-8.jar
[INFO] Downloaded: https://repo.cloudbees.com/content/repositories/central/org/codehaus/plexus/plexus-utils/1.4/plexus-utils-1.4.jar
(178 KB at 3953.3 KB/sec)
[INFO] Downloading: https://repo.cloudbees.com/content/repositories/central/org/codehaus/plexus/plexus-velocity/1.1.3/plexus-velocity-1.1.3.jar
[INFO] Downloaded: https://repo.cloudbees.com/content/repositories/central/org/apache/commons/commons-compress/1.0/commons-compress-1.0.jar
(141 KB at 3053.8 KB/sec)
[INFO] Downloading: https://repo.cloudbees.com/content/repositories/central/velocity/velocity/1.4/velocity-1.4.jar
[INFO] Downloaded: https://repo.cloudbees.com/content/repositories/central/org/apache/maven/doxia/doxia-sink-api/1.0-alpha-8/doxia-sink-api-1.0-alpha-8.jar
(7 KB at 242.5 KB/sec)
[INFO] Downloading: https://repo.cloudbees.com/content/repositories/central/velocity/velocity-dep/1.4/velocity-dep-1.4.jar
[INFO] Downloaded: https://repo.cloudbees.com/content/repositories/central/org/codehaus/plexus/plexus-velocity/1.1.3/plexus-velocity-1.1.3.jar
(8 KB at 286.2 KB/sec)
[INFO] Downloading: https://repo.cloudbees.com/content/repositories/central/org/apache/maven/doxia/doxia-decoration-model/1.0-alpha-8/doxia-decoration-model-1.0-alpha-8.jar
[INFO] Downloaded: https://repo.cloudbees.com/content/repositories/central/commons-collections/commons-collections/3.2/commons-collections-3.2.jar
(558 KB at 6721.3 KB/sec)
[INFO] Downloading: https://repo.cloudbees.com/content/repositories/central/org/apache/maven/reporting/maven-reporting-impl/2.0.4/maven-reporting-impl-2.0.4.jar
[INFO] Downloaded: https://repo.cloudbees.com/content/repositories/central/org/apache/maven/doxia/doxia-core/1.0-alpha-8/doxia-core-1.0-alpha-8.jar
(200 KB at 3988.4 KB/sec)
[INFO] Downloading: https://repo.cloudbees.com/content/repositories/central/commons-validator/commons-validator/1.2.0/commons-validator-1.2.0.jar
[INFO] Downloaded: https://repo.cloudbees.com/content/repositories/central/velocity/velocity/1.4/velocity-1.4.jar
(353 KB at 6654.9 KB/sec)
[INFO] Downloaded: https://repo.cloudbees.com/content/repositories/central/org/apache/maven/reporting/maven-reporting-impl/2.0.4/maven-reporting-impl-2.0.4.jar
(14 KB at 784.5 KB/sec)
[INFO] Downloading: https://repo.cloudbees.com/content/repositories/central/xml-apis/xml-apis/1.0.b2/xml-apis-1.0.b2.jar
[INFO] Downloading: https://repo.cloudbees.com/content/repositories/central/oro/oro/2.0.7/oro-2.0.7.jar
[INFO] Downloaded: https://repo.cloudbees.com/content/repositories/central/org/apache/maven/doxia/doxia-decoration-model/1.0-alpha-8/doxia-decoration-model-1.0-alpha-8.jar
(40 KB at 1036.4 KB/sec)
[INFO] Downloading: https://repo.cloudbees.com/content/repositories/central/org/apache/maven/reporting/maven-reporting-api/2.0.4/maven-reporting-api-2.0.4.jar
[INFO] Downloaded: https://repo.cloudbees.com/content/repositories/central/org/apache/maven/reporting/maven-reporting-api/2.0.4/maven-reporting-api-2.0.4.jar
(5 KB at 324.7 KB/sec)
[INFO] Downloaded: https://repo.cloudbees.com/content/repositories/central/commons-validator/commons-validator/1.2.0/commons-validator-1.2.0.jar
(89 KB at 1977.3 KB/sec)
[INFO] Downloaded: https://repo.cloudbees.com/content/repositories/central/xml-apis/xml-apis/1.0.b2/xml-apis-1.0.b2.jar
(107 KB at 2809.4 KB/sec)
[INFO] Downloaded: https://repo.cloudbees.com/content/repositories/central/oro/oro/2.0.7/oro-2.0.7.jar
(64 KB at 1521.2 KB/sec)
[INFO] Downloaded: https://repo.cloudbees.com/content/repositories/central/velocity/velocity-dep/1.4/velocity-dep-1.4.jar
(506 KB at 5745.7 KB/sec)
[INFO] Downloading: https://repository-jclouds.forge.cloudbees.com/release/org/apache/rat/apache-rat-core/0.8/apache-rat-core-0.8.jar
[INFO] Downloading: https://repository-jclouds.forge.cloudbees.com/release/commons-collections/commons-collections/3.2/commons-collections-3.2.jar
[INFO] Downloading: https://repository-jclouds.forge.cloudbees.com/release/org/apache/commons/commons-compress/1.0/commons-compress-1.0.jar
[INFO] Downloading: https://repository-jclouds.forge.cloudbees.com/release/org/codehaus/plexus/plexus-utils/1.4/plexus-utils-1.4.jar
[INFO] Downloading: https://repository-jclouds.forge.cloudbees.com/release/org/apache/maven/doxia/doxia-site-renderer/1.0-alpha-8/doxia-site-renderer-1.0-alpha-8.jar
[INFO] Downloading: https://repository-jclouds.forge.cloudbees.com/release/org/apache/maven/doxia/doxia-core/1.0-alpha-8/doxia-core-1.0-alpha-8.jar
[INFO] Downloading: https://repository-jclouds.forge.cloudbees.com/release/org/apache/maven/doxia/doxia-sink-api/1.0-alpha-8/doxia-sink-api-1.0-alpha-8.jar
[INFO] Downloading: https://repository-jclouds.forge.cloudbees.com/release/org/codehaus/plexus/plexus-velocity/1.1.3/plexus-velocity-1.1.3.jar
[INFO] Downloading: https://repository-jclouds.forge.cloudbees.com/release/velocity/velocity/1.4/velocity-1.4.jar
[INFO] Downloading: https://repository-jclouds.forge.cloudbees.com/release/velocity/velocity-dep/1.4/velocity-dep-1.4.jar
[INFO] Downloading: https://repository-jclouds.forge.cloudbees.com/release/org/apache/maven/doxia/doxia-decoration-model/1.0-alpha-8/doxia-decoration-model-1.0-alpha-8.jar
[INFO] Downloading: https://repository-jclouds.forge.cloudbees.com/release/org/apache/maven/reporting/maven-reporting-impl/2.0.4/maven-reporting-impl-2.0.4.jar
[INFO] Downloading: https://repository-jclouds.forge.cloudbees.com/release/commons-validator/commons-validator/1.2.0/commons-validator-1.2.0.jar
[INFO] Downloading: https://repository-jclouds.forge.cloudbees.com/release/xml-apis/xml-apis/1.0.b2/xml-apis-1.0.b2.jar
[INFO] Downloading: https://repository-jclouds.forge.cloudbees.com/release/oro/oro/2.0.7/oro-2.0.7.jar
[INFO] Downloading: https://repository-jclouds.forge.cloudbees.com/release/org/apache/maven/reporting/maven-reporting-api/2.0.4/maven-reporting-api-2.0.4.jar
[INFO] Exclude: **/LICENSE.txt
[INFO] Exclude: **/header.txt
[INFO] Exclude: **/NOTICE.txt
[INFO] Exclude: **/DISCLAIMER
[INFO] Exclude: **/BUILD.txt
[INFO] Exclude: **/CHANGES.txt
[INFO] Exclude: **/README.md
[INFO] Exclude: **/README.txt
[INFO] Exclude: **/DEPENDENCIES
[INFO] Exclude: .git/**
[INFO] Exclude: **/.gitignore
[INFO] Exclude: **/*.json
[INFO] Exclude: **/*.log*
[INFO] Exclude: **/TODO
[INFO] Exclude: .mailmap
[INFO] Exclude: .idea/**
[INFO] Exclude: **/*.iml
[INFO] Exclude: **/.project
[INFO] Exclude: **/.classpath
[INFO] Exclude: **/.settings/**
[INFO] Exclude: **/.checkstyle
[INFO] Exclude: **/target/**
[INFO] Exclude: .repository/**
[INFO] Exclude: **/src/main/resources/**/*.txt
[INFO] 
[INFO] --- maven-install-plugin:2.5.1:install (default-install) @ jclouds-karaf ---
[INFO] Installing <https://jclouds.ci.cloudbees.com/job/jclouds-karaf-1.7.x-branch/ws/pom.xml>
to /home/jenkins/.m2/repository/org/apache/jclouds/jclouds-karaf/1.7.4-SNAPSHOT/jclouds-karaf-1.7.4-SNAPSHOT.pom
[INFO] 
[INFO] --- maven-deploy-plugin:2.8.1:deploy (default-deploy) @ jclouds-karaf ---
[INFO] Downloading: https://repository.apache.org/content/repositories/snapshots/org/apache/jclouds/jclouds-karaf/1.7.4-SNAPSHOT/maven-metadata.xml
[WARNING] Could not transfer metadata org.apache.jclouds:jclouds-karaf:1.7.4-SNAPSHOT/maven-metadata.xml
from/to apache.snapshots.https (https://repository.apache.org/content/repositories/snapshots):
Connection to https://repository.apache.org refused
Started calculate disk usage of build
Finished Calculation of disk usage of build in 0 seconds
Started calculate disk usage of workspace
Finished Calculation of disk usage of workspace in 0 seconds
[INFO] ------------------------------------------------------------------------
[INFO] Reactor Summary:
[INFO] 
[INFO] Apache jclouds :: Karaf ........................... FAILURE [2:13.682s]
[INFO] jclouds :: Karaf :: Core .......................... SKIPPED
[INFO] jclouds :: Karaf :: Utils ......................... SKIPPED
[INFO] jclouds :: Karaf :: Recipe ........................ SKIPPED
[INFO] jclouds :: Karaf :: Cache ......................... SKIPPED
[INFO] jclouds :: Karaf :: Services ...................... SKIPPED
[INFO] jclouds :: Karaf :: Commands ...................... SKIPPED
[INFO] jclouds :: Karaf :: URL Handler ................... SKIPPED
[INFO] jclouds :: Karaf :: Chef .......................... SKIPPED
[INFO] jclouds :: Karaf :: Chef :: Core .................. SKIPPED
[INFO] jclouds :: Karaf :: Chef :: Services .............. SKIPPED
[INFO] jclouds :: Karaf :: Chef :: Commands .............. SKIPPED
[INFO] jclouds :: Karaf :: Chef :: Cache ................. SKIPPED
[INFO] jclouds :: Karaf :: Feature ....................... SKIPPED
[INFO] jclouds :: Karaf :: Integration Tests ............. SKIPPED
[INFO] ------------------------------------------------------------------------
[INFO] BUILD FAILURE
[INFO] ------------------------------------------------------------------------
[INFO] Total time: 2:17.265s
[INFO] Finished at: Tue Jan 17 18:57:29 EST 2017
[INFO] Final Memory: 26M/180M
[INFO] ------------------------------------------------------------------------
[WARNING] The requested profile "doc" could not be activated because it does not exist.
[WARNING] The requested profile "src" could not be activated because it does not exist.
[ERROR] Failed to execute goal org.apache.maven.plugins:maven-deploy-plugin:2.8.1:deploy (default-deploy)
on project jclouds-karaf: Failed to retrieve remote metadata org.apache.jclouds:jclouds-karaf:1.7.4-SNAPSHOT/maven-metadata.xml:
Could not transfer metadata org.apache.jclouds:jclouds-karaf:1.7.4-SNAPSHOT/maven-metadata.xml
from/to apache.snapshots.https (https://repository.apache.org/content/repositories/snapshots):
Connection to https://repository.apache.org refused: Connection timed out -> [Help 1]
org.apache.maven.lifecycle.LifecycleExecutionException: Failed to execute goal org.apache.maven.plugins:maven-deploy-plugin:2.8.1:deploy
(default-deploy) on project jclouds-karaf: Failed to retrieve remote metadata org.apache.jclouds:jclouds-karaf:1.7.4-SNAPSHOT/maven-metadata.xml:
Could not transfer metadata org.apache.jclouds:jclouds-karaf:1.7.4-SNAPSHOT/maven-metadata.xml
from/to apache.snapshots.https (https://repository.apache.org/content/repositories/snapshots):
Connection to https://repository.apache.org refused
	at org.apache.maven.lifecycle.internal.MojoExecutor.execute(MojoExecutor.java:216)
	at org.apache.maven.lifecycle.internal.MojoExecutor.execute(MojoExecutor.java:153)
	at org.apache.maven.lifecycle.internal.MojoExecutor.execute(MojoExecutor.java:145)
	at org.apache.maven.lifecycle.internal.LifecycleModuleBuilder.buildProject(LifecycleModuleBuilder.java:84)
	at org.apache.maven.lifecycle.internal.LifecycleModuleBuilder.buildProject(LifecycleModuleBuilder.java:59)
	at org.apache.maven.lifecycle.internal.LifecycleStarter.singleThreadedBuild(LifecycleStarter.java:183)
	at org.apache.maven.lifecycle.internal.LifecycleStarter.execute(LifecycleStarter.java:161)
	at org.apache.maven.DefaultMaven.doExecute(DefaultMaven.java:318)
	at org.apache.maven.DefaultMaven.execute(DefaultMaven.java:153)
	at org.jvnet.hudson.maven3.launcher.Maven31Launcher.main(Maven31Launcher.java:132)
	at sun.reflect.NativeMethodAccessorImpl.invoke0(Native Method)
	at sun.reflect.NativeMethodAccessorImpl.invoke(NativeMethodAccessorImpl.java:57)
	at sun.reflect.DelegatingMethodAccessorImpl.invoke(DelegatingMethodAccessorImpl.java:43)
	at java.lang.reflect.Method.invoke(Method.java:606)
	at org.codehaus.plexus.classworlds.launcher.Launcher.launchStandard(Launcher.java:331)
	at org.codehaus.plexus.classworlds.launcher.Launcher.launch(Launcher.java:239)
	at jenkins.maven3.agent.Maven31Main.launch(Maven31Main.java:181)
	at sun.reflect.NativeMethodAccessorImpl.invoke0(Native Method)
	at sun.reflect.NativeMethodAccessorImpl.invoke(NativeMethodAccessorImpl.java:57)
	at sun.reflect.DelegatingMethodAccessorImpl.invoke(DelegatingMethodAccessorImpl.java:43)
	at java.lang.reflect.Method.invoke(Method.java:606)
	at hudson.maven.Maven3Builder.call(Maven3Builder.java:136)
	at hudson.maven.Maven3Builder.call(Maven3Builder.java:71)
	at hudson.remoting.UserRequest.perform(UserRequest.java:153)
	at hudson.remoting.UserRequest.perform(UserRequest.java:50)
	at hudson.remoting.Request$2.run(Request.java:332)
	at hudson.remoting.InterceptingExecutorService$1.call(InterceptingExecutorService.java:68)
	at java.util.concurrent.FutureTask.run(FutureTask.java:262)
	at java.util.concurrent.ThreadPoolExecutor.runWorker(ThreadPoolExecutor.java:1145)
	at java.util.concurrent.ThreadPoolExecutor$Worker.run(ThreadPoolExecutor.java:615)
	at java.lang.Thread.run(Thread.java:745)
Caused by: org.apache.maven.plugin.MojoExecutionException: Failed to retrieve remote metadata
org.apache.jclouds:jclouds-karaf:1.7.4-SNAPSHOT/maven-metadata.xml: Could not transfer metadata
org.apache.jclouds:jclouds-karaf:1.7.4-SNAPSHOT/maven-metadata.xml from/to apache.snapshots.https
(https://repository.apache.org/content/repositories/snapshots): Connection to https://repository.apache.org
refused
	at org.apache.maven.plugin.deploy.DeployMojo.deployProject(DeployMojo.java:282)
	at org.apache.maven.plugin.deploy.DeployMojo.execute(DeployMojo.java:169)
	at org.apache.maven.plugin.DefaultBuildPluginManager.executeMojo(DefaultBuildPluginManager.java:106)
	at org.apache.maven.lifecycle.internal.MojoExecutor.execute(MojoExecutor.java:208)
	... 30 more
Caused by: org.apache.maven.artifact.deployer.ArtifactDeploymentException: Failed to retrieve
remote metadata org.apache.jclouds:jclouds-karaf:1.7.4-SNAPSHOT/maven-metadata.xml: Could
not transfer metadata org.apache.jclouds:jclouds-karaf:1.7.4-SNAPSHOT/maven-metadata.xml from/to
apache.snapshots.https (https://repository.apache.org/content/repositories/snapshots): Connection
to https://repository.apache.org refused
	at org.apache.maven.artifact.deployer.DefaultArtifactDeployer.deploy(DefaultArtifactDeployer.java:143)
	at org.apache.maven.plugin.deploy.AbstractDeployMojo.deploy(AbstractDeployMojo.java:171)
	at org.apache.maven.plugin.deploy.DeployMojo.deployProject(DeployMojo.java:240)
	... 33 more
Caused by: org.eclipse.aether.deployment.DeploymentException: Failed to retrieve remote metadata
org.apache.jclouds:jclouds-karaf:1.7.4-SNAPSHOT/maven-metadata.xml: Could not transfer metadata
org.apache.jclouds:jclouds-karaf:1.7.4-SNAPSHOT/maven-metadata.xml from/to apache.snapshots.https
(https://repository.apache.org/content/repositories/snapshots): Connection to https://repository.apache.org
refused
	at org.eclipse.aether.internal.impl.DefaultDeployer.upload(DefaultDeployer.java:463)
	at org.eclipse.aether.internal.impl.DefaultDeployer.deploy(DefaultDeployer.java:313)
	at org.eclipse.aether.internal.impl.DefaultDeployer.deploy(DefaultDeployer.java:268)
	at org.eclipse.aether.internal.impl.DefaultRepositorySystem.deploy(DefaultRepositorySystem.java:413)
	at org.apache.maven.artifact.deployer.DefaultArtifactDeployer.deploy(DefaultArtifactDeployer.java:139)
	... 35 more
Caused by: org.eclipse.aether.transfer.MetadataTransferException: Could not transfer metadata
org.apache.jclouds:jclouds-karaf:1.7.4-SNAPSHOT/maven-metadata.xml from/to apache.snapshots.https
(https://repository.apache.org/content/repositories/snapshots): Connection to https://repository.apache.org
refused
	at org.eclipse.aether.connector.wagon.WagonRepositoryConnector$5.wrap(WagonRepositoryConnector.java:995)
	at org.eclipse.aether.connector.wagon.WagonRepositoryConnector$5.wrap(WagonRepositoryConnector.java:983)
	at org.eclipse.aether.connector.wagon.WagonRepositoryConnector$GetTask.run(WagonRepositoryConnector.java:725)
	at org.eclipse.aether.util.concurrency.RunnableErrorForwarder$1.run(RunnableErrorForwarder.java:67)
	... 3 more
Caused by: org.apache.maven.wagon.TransferFailedException: Connection to https://repository.apache.org
refused
	at org.apache.maven.wagon.shared.http4.AbstractHttpClientWagon.fillInputData(AbstractHttpClientWagon.java:892)
	at org.apache.maven.wagon.StreamWagon.getInputStream(StreamWagon.java:116)
	at org.apache.maven.wagon.StreamWagon.getIfNewer(StreamWagon.java:88)
	at org.apache.maven.wagon.StreamWagon.get(StreamWagon.java:61)
	at org.eclipse.aether.connector.wagon.WagonRepositoryConnector$GetTask.run(WagonRepositoryConnector.java:660)
	... 4 more
Caused by: org.apache.maven.wagon.providers.http.httpclient.conn.HttpHostConnectException:
Connection to https://repository.apache.org refused
	at org.apache.maven.wagon.providers.http.httpclient.impl.conn.DefaultClientConnectionOperator.openConnection(DefaultClientConnectionOperator.java:190)
	at org.apache.maven.wagon.providers.http.httpclient.impl.conn.ManagedClientConnectionImpl.open(ManagedClientConnectionImpl.java:294)
	at org.apache.maven.wagon.providers.http.httpclient.impl.client.DefaultRequestDirector.tryConnect(DefaultRequestDirector.java:645)
	at org.apache.maven.wagon.providers.http.httpclient.impl.client.DefaultRequestDirector.execute(DefaultRequestDirector.java:480)
	at org.apache.maven.wagon.providers.http.httpclient.impl.client.AbstractHttpClient.execute(AbstractHttpClient.java:906)
	at org.apache.maven.wagon.providers.http.httpclient.impl.client.AbstractHttpClient.execute(AbstractHttpClient.java:805)
	at org.apache.maven.wagon.shared.http4.AbstractHttpClientWagon.execute(AbstractHttpClientWagon.java:746)
	at org.apache.maven.wagon.shared.http4.AbstractHttpClientWagon.fillInputData(AbstractHttpClientWagon.java:886)
	... 8 more
Caused by: java.net.ConnectException: Connection timed out
	at java.net.PlainSocketImpl.socketConnect(Native Method)
	at java.net.AbstractPlainSocketImpl.doConnect(AbstractPlainSocketImpl.java:339)
	at java.net.AbstractPlainSocketImpl.connectToAddress(AbstractPlainSocketImpl.java:200)
	at java.net.AbstractPlainSocketImpl.connect(AbstractPlainSocketImpl.java:182)
	at java.net.SocksSocketImpl.connect(SocksSocketImpl.java:392)
	at java.net.Socket.connect(Socket.java:579)
	at sun.security.ssl.SSLSocketImpl.connect(SSLSocketImpl.java:625)
	at org.apache.maven.wagon.providers.http.httpclient.conn.ssl.SSLSocketFactory.connectSocket(SSLSocketFactory.java:549)
	at org.apache.maven.wagon.shared.http4.ConfigurableSSLSocketFactoryDecorator.connectSocket(ConfigurableSSLSocketFactoryDecorator.java:64)
	at org.apache.maven.wagon.providers.http.httpclient.impl.conn.DefaultClientConnectionOperator.openConnection(DefaultClientConnectionOperator.java:180)
	... 15 more
[ERROR] 
[ERROR] Re-run Maven using the -X switch to enable full debug logging.
[ERROR] 
[ERROR] For more information about the errors and possible solutions, please read the following
articles:
[ERROR] [Help 1] http://cwiki.apache.org/confluence/display/MAVEN/MojoExecutionException
[JENKINS] Archiving <https://jclouds.ci.cloudbees.com/job/jclouds-karaf-1.7.x-branch/ws/chef/core/pom.xml>
to org.apache.jclouds.karaf.chef/core/1.7.4-SNAPSHOT/core-1.7.4-SNAPSHOT.pom
[JENKINS] Archiving <https://jclouds.ci.cloudbees.com/job/jclouds-karaf-1.7.x-branch/ws/utils/pom.xml>
to org.apache.jclouds.karaf/utils/1.7.4-SNAPSHOT/utils-1.7.4-SNAPSHOT.pom
[JENKINS] Archiving <https://jclouds.ci.cloudbees.com/job/jclouds-karaf-1.7.x-branch/ws/chef/commands/pom.xml>
to org.apache.jclouds.karaf.chef/commands/1.7.4-SNAPSHOT/commands-1.7.4-SNAPSHOT.pom
[JENKINS] Archiving <https://jclouds.ci.cloudbees.com/job/jclouds-karaf-1.7.x-branch/ws/services/pom.xml>
to org.apache.jclouds.karaf/services/1.7.4-SNAPSHOT/services-1.7.4-SNAPSHOT.pom
[JENKINS] Archiving <https://jclouds.ci.cloudbees.com/job/jclouds-karaf-1.7.x-branch/ws/feature/pom.xml>
to org.apache.jclouds.karaf/jclouds-karaf/1.7.4-SNAPSHOT/jclouds-karaf-1.7.4-SNAPSHOT.pom
[JENKINS] Archiving <https://jclouds.ci.cloudbees.com/job/jclouds-karaf-1.7.x-branch/ws/recipe/pom.xml>
to org.apache.jclouds.karaf/recipe/1.7.4-SNAPSHOT/recipe-1.7.4-SNAPSHOT.pom
[JENKINS] Archiving <https://jclouds.ci.cloudbees.com/job/jclouds-karaf-1.7.x-branch/ws/urlhandler/pom.xml>
to org.apache.jclouds.karaf/urlhandler/1.7.4-SNAPSHOT/urlhandler-1.7.4-SNAPSHOT.pom
[JENKINS] Archiving <https://jclouds.ci.cloudbees.com/job/jclouds-karaf-1.7.x-branch/ws/pom.xml>
to org.apache.jclouds/jclouds-karaf/1.7.4-SNAPSHOT/jclouds-karaf-1.7.4-SNAPSHOT.pom
[JENKINS] Archiving <https://jclouds.ci.cloudbees.com/job/jclouds-karaf-1.7.x-branch/ws/core/pom.xml>
to org.apache.jclouds.karaf/core/1.7.4-SNAPSHOT/core-1.7.4-SNAPSHOT.pom
[JENKINS] Archiving <https://jclouds.ci.cloudbees.com/job/jclouds-karaf-1.7.x-branch/ws/itests/pom.xml>
to org.apache.jclouds.karaf/itests/1.7.4-SNAPSHOT/itests-1.7.4-SNAPSHOT.pom
[JENKINS] Archiving <https://jclouds.ci.cloudbees.com/job/jclouds-karaf-1.7.x-branch/ws/cache/pom.xml>
to org.apache.jclouds.karaf/cache/1.7.4-SNAPSHOT/cache-1.7.4-SNAPSHOT.pom
[JENKINS] Archiving <https://jclouds.ci.cloudbees.com/job/jclouds-karaf-1.7.x-branch/ws/chef/services/pom.xml>
to org.apache.jclouds.karaf.chef/services/1.7.4-SNAPSHOT/services-1.7.4-SNAPSHOT.pom
[JENKINS] Archiving <https://jclouds.ci.cloudbees.com/job/jclouds-karaf-1.7.x-branch/ws/chef/pom.xml>
to org.apache.jclouds.karaf/chef/1.7.4-SNAPSHOT/chef-1.7.4-SNAPSHOT.pom
[JENKINS] Archiving <https://jclouds.ci.cloudbees.com/job/jclouds-karaf-1.7.x-branch/ws/chef/cache/pom.xml>
to org.apache.jclouds.karaf.chef/cache/1.7.4-SNAPSHOT/cache-1.7.4-SNAPSHOT.pom
[JENKINS] Archiving <https://jclouds.ci.cloudbees.com/job/jclouds-karaf-1.7.x-branch/ws/commands/pom.xml>
to org.apache.jclouds.karaf/commands/1.7.4-SNAPSHOT/commands-1.7.4-SNAPSHOT.pom
channel stopped
Started calculate disk usage of build
Finished Calculation of disk usage of build in 0 seconds
Started calculate disk usage of workspace
Finished Calculation of disk usage of workspace in 0 seconds

Mime
View raw message