jclouds-notifications mailing list archives

Site index · List index
Message view « Date » · « Thread »
Top « Date » · « Thread »
From jenkins-no-re...@cloudbees.com
Subject Build failed in Jenkins: jclouds-labs-2.0.x-branch #16
Date Wed, 25 Jan 2017 10:02:02 GMT
https://jclouds.ci.cloudbees.com/job/jclouds-labs-2.0.x-branch/16/Changes:

[Ignasi Barrera] JCLOUDS-1208 Implement the TemplateOptions.inboundPorts in ProfitBricks

[Ignasi Barrera] Add Vagrant provider

------------------------------------------
Started by an SCM change
Building remotely on d58c4375 (standard m1.large lxc-fedora17 large) in workspace <https://jclouds.ci.cloudbees.com/job/jclouds-labs-2.0.x-branch/ws/>
$ sudo /opt/jenkins/sbin/mount-webdav https://repository-jclouds.forge.cloudbees.com/private
jclouds alert
webdav mount try 1
Private webdav filestore is mounted
Cloning the remote Git repository
Cloning repository https://git-wip-us.apache.org/repos/asf/jclouds-labs.git
 > git init <https://jclouds.ci.cloudbees.com/job/jclouds-labs-2.0.x-branch/ws/>
# timeout=10
Fetching upstream changes from https://git-wip-us.apache.org/repos/asf/jclouds-labs.git
 > git --version # timeout=10
 > git -c core.askpass=true fetch --tags --progress https://git-wip-us.apache.org/repos/asf/jclouds-labs.git
+refs/heads/*:refs/remotes/origin/*
 > git config remote.origin.url https://git-wip-us.apache.org/repos/asf/jclouds-labs.git
# timeout=10
 > git config --add remote.origin.fetch +refs/heads/*:refs/remotes/origin/* # timeout=10
 > git config remote.origin.url https://git-wip-us.apache.org/repos/asf/jclouds-labs.git
# timeout=10
Fetching upstream changes from https://git-wip-us.apache.org/repos/asf/jclouds-labs.git
 > git -c core.askpass=true fetch --tags --progress https://git-wip-us.apache.org/repos/asf/jclouds-labs.git
+refs/heads/*:refs/remotes/origin/*
 > git rev-parse refs/remotes/origin/2.0.x^{commit} # timeout=10
 > git rev-parse refs/remotes/origin/origin/2.0.x^{commit} # timeout=10
Checking out Revision fadcd5d9f715f6661d550f613a83b0ab50dc718b (refs/remotes/origin/2.0.x)
 > git config core.sparsecheckout # timeout=10
 > git checkout -f fadcd5d9f715f6661d550f613a83b0ab50dc718b
 > git rev-list 784ee02079e963cd37345473ca85690b83aa5011 # timeout=10
 > git tag -a -f -m Jenkins Build #16 jenkins-jclouds-labs-2.0.x-branch-16 # timeout=10
Parsing POMs
Failed to transfer Could not find metadata org.apache.jclouds:jclouds-project:2.0.1-SNAPSHOT/maven-metadata.xml
in cloudbees-private-snapshot-repository (https://repository-jclouds.forge.cloudbees.com/snapshot)
Downloaded artifact https://repository.apache.org/content/repositories/snapshots/org/apache/jclouds/jclouds-project/2.0.1-SNAPSHOT/maven-metadata.xml
Failed to transfer Could not find metadata org.apache.jclouds:jclouds-project:2.0.1-SNAPSHOT/maven-metadata.xml
in sonatype-nexus-snapshots (https://oss.sonatype.org/content/repositories/snapshots)
Downloaded artifact https://repository.apache.org/content/repositories/snapshots/org/apache/jclouds/jclouds-project/2.0.1-SNAPSHOT/jclouds-project-2.0.1-20170125.083311-11.pom
Downloaded artifact https://repo.cloudbees.com/content/repositories/central/org/apache/apache/14/apache-14.pom
ERROR: Failed to parse POMs
java.io.IOException: remote file operation failed: <https://jclouds.ci.cloudbees.com/job/jclouds-labs-2.0.x-branch/ws/>
at hudson.remoting.Channel@56a5054c:d58c4375: hudson.remoting.ProxyException: hudson.maven.MavenModuleSetBuild$MavenExecutionException:
org.apache.maven.project.ProjectBuildingException: Some problems were encountered while processing
the POMs:
[ERROR] Child module <https://jclouds.ci.cloudbees.com/job/jclouds-labs-2.0.x-branch/ws/packet>
of <https://jclouds.ci.cloudbees.com/job/jclouds-labs-2.0.x-branch/ws/pom.xml> does
not exist @ 

	at hudson.FilePath.act(FilePath.java:1014)
	at hudson.FilePath.act(FilePath.java:996)
	at hudson.maven.MavenModuleSetBuild$MavenModuleSetBuildExecution.parsePoms(MavenModuleSetBuild.java:959)
	at hudson.maven.MavenModuleSetBuild$MavenModuleSetBuildExecution.doRun(MavenModuleSetBuild.java:679)
	at hudson.model.AbstractBuild$AbstractBuildExecution.run(AbstractBuild.java:544)
	at hudson.model.Run.execute(Run.java:1741)
	at hudson.maven.MavenModuleSetBuild.run(MavenModuleSetBuild.java:531)
	at hudson.model.ResourceController.execute(ResourceController.java:98)
	at hudson.model.Executor.run(Executor.java:410)
Caused by: hudson.remoting.ProxyException: hudson.maven.MavenModuleSetBuild$MavenExecutionException:
org.apache.maven.project.ProjectBuildingException: Some problems were encountered while processing
the POMs:
[ERROR] Child module <https://jclouds.ci.cloudbees.com/job/jclouds-labs-2.0.x-branch/ws/packet>
of <https://jclouds.ci.cloudbees.com/job/jclouds-labs-2.0.x-branch/ws/pom.xml> does
not exist @ 

	at hudson.maven.MavenModuleSetBuild$PomParser.invoke(MavenModuleSetBuild.java:1363)
	at hudson.maven.MavenModuleSetBuild$PomParser.invoke(MavenModuleSetBuild.java:1097)
	at hudson.FilePath$FileCallableWrapper.call(FilePath.java:2772)
	at hudson.remoting.UserRequest.perform(UserRequest.java:153)
	at hudson.remoting.UserRequest.perform(UserRequest.java:50)
	at hudson.remoting.Request$2.run(Request.java:332)
	at hudson.remoting.InterceptingExecutorService$1.call(InterceptingExecutorService.java:68)
	at java.util.concurrent.FutureTask.run(FutureTask.java:262)
	at java.util.concurrent.ThreadPoolExecutor.runWorker(ThreadPoolExecutor.java:1145)
	at java.util.concurrent.ThreadPoolExecutor$Worker.run(ThreadPoolExecutor.java:615)
	at java.lang.Thread.run(Thread.java:745)
	at ......remote call to d58c4375(Native Method)
	at hudson.remoting.Channel.attachCallSiteStackTrace(Channel.java:1416)
	at hudson.remoting.UserResponse.retrieve(UserRequest.java:253)
	at hudson.remoting.Channel.call(Channel.java:781)
	at hudson.FilePath.act(FilePath.java:1007)
	... 8 more
Caused by: hudson.remoting.ProxyException: org.apache.maven.project.ProjectBuildingException:
Some problems were encountered while processing the POMs:
[ERROR] Child module <https://jclouds.ci.cloudbees.com/job/jclouds-labs-2.0.x-branch/ws/packet>
of <https://jclouds.ci.cloudbees.com/job/jclouds-labs-2.0.x-branch/ws/pom.xml> does
not exist @ 

	at org.apache.maven.project.DefaultProjectBuilder.build(DefaultProjectBuilder.java:364)
	at hudson.maven.MavenEmbedder.buildProjects(MavenEmbedder.java:361)
	at hudson.maven.MavenEmbedder.readProjects(MavenEmbedder.java:331)
	at hudson.maven.MavenModuleSetBuild$PomParser.invoke(MavenModuleSetBuild.java:1300)
	at hudson.maven.MavenModuleSetBuild$PomParser.invoke(MavenModuleSetBuild.java:1097)
	at hudson.FilePath$FileCallableWrapper.call(FilePath.java:2772)
	at hudson.remoting.UserRequest.perform(UserRequest.java:153)
	at hudson.remoting.UserRequest.perform(UserRequest.java:50)
	at hudson.remoting.Request$2.run(Request.java:332)
	at hudson.remoting.InterceptingExecutorService$1.call(InterceptingExecutorService.java:68)
	at java.util.concurrent.FutureTask.run(FutureTask.java:262)
	at java.util.concurrent.ThreadPoolExecutor.runWorker(ThreadPoolExecutor.java:1145)
	at java.util.concurrent.ThreadPoolExecutor$Worker.run(ThreadPoolExecutor.java:615)
	at java.lang.Thread.run(Thread.java:745)
Started calculate disk usage of build
Finished Calculation of disk usage of build in 0 seconds
Started calculate disk usage of workspace
Finished Calculation of disk usage of workspace in 0 seconds

Mime
View raw message