jclouds-notifications mailing list archives

Site index · List index
Message view « Date » · « Thread »
Top « Date » · « Thread »
From jenkins-no-re...@cloudbees.com
Subject Build failed in Jenkins: jclouds-karaf-2.0.x-branch #18
Date Thu, 26 Jan 2017 22:04:44 GMT
https://jclouds.ci.cloudbees.com/job/jclouds-karaf-2.0.x-branch/18/------------------------------------------
[...truncated 151 lines...]
[INFO] Downloading: https://repository.apache.org/content/repositories/snapshots/org/apache/jclouds/jclouds-scriptbuilder/2.0.1-SNAPSHOT/maven-metadata.xml
[INFO] Downloading: https://oss.sonatype.org/content/repositories/releases/org/apache/jclouds/jclouds-scriptbuilder/2.0.1-SNAPSHOT/maven-metadata.xml
[INFO] Downloading: http://download.java.net/maven/2/org/apache/jclouds/jclouds-scriptbuilder/2.0.1-SNAPSHOT/maven-metadata.xml
[INFO] Downloading: http://repository.apache.org/snapshots/org/apache/jclouds/jclouds-scriptbuilder/2.0.1-SNAPSHOT/maven-metadata.xml
[WARNING] Could not transfer metadata org.apache.jclouds:jclouds-scriptbuilder:2.0.1-SNAPSHOT/maven-metadata.xml
from/to apache-snapshots (https://repository.apache.org/content/repositories/snapshots): Connection
to https://repository.apache.org refused
[WARNING] Could not transfer metadata org.apache.jclouds:jclouds-scriptbuilder:2.0.1-SNAPSHOT/maven-metadata.xml
from/to apache.snapshots (http://repository.apache.org/snapshots): Connection to http://repository.apache.org
refused
[INFO] Downloading: https://repository-jclouds.forge.cloudbees.com/snapshot/org/apache/jclouds/jclouds-blobstore/2.0.1-SNAPSHOT/maven-metadata.xml
[INFO] Downloading: https://oss.sonatype.org/content/repositories/releases/org/apache/jclouds/jclouds-blobstore/2.0.1-SNAPSHOT/maven-metadata.xml
[INFO] Downloading: https://repository.apache.org/content/repositories/snapshots/org/apache/jclouds/jclouds-blobstore/2.0.1-SNAPSHOT/maven-metadata.xml
[INFO] Downloading: http://download.java.net/maven/2/org/apache/jclouds/jclouds-blobstore/2.0.1-SNAPSHOT/maven-metadata.xml
[INFO] Downloading: http://repository.apache.org/snapshots/org/apache/jclouds/jclouds-blobstore/2.0.1-SNAPSHOT/maven-metadata.xml
[WARNING] Could not transfer metadata org.apache.jclouds:jclouds-blobstore:2.0.1-SNAPSHOT/maven-metadata.xml
from/to apache-snapshots (https://repository.apache.org/content/repositories/snapshots): Connection
to https://repository.apache.org refused
[WARNING] Could not transfer metadata org.apache.jclouds:jclouds-blobstore:2.0.1-SNAPSHOT/maven-metadata.xml
from/to apache.snapshots (http://repository.apache.org/snapshots): Connection to http://repository.apache.org
refused
[INFO] 
[INFO] --- maven-clean-plugin:2.5:clean (default-clean) @ core ---
[INFO] Deleting <https://jclouds.ci.cloudbees.com/job/jclouds-karaf-2.0.x-branch/ws/core/target>
[INFO] 
[INFO] --- maven-remote-resources-plugin:1.5:process (default) @ core ---
[WARNING] Failure to transfer org.apache.jclouds:jclouds-scriptbuilder:2.0.1-SNAPSHOT/maven-metadata.xml
from https://repository.apache.org/content/repositories/snapshots was cached in the local
repository, resolution will not be reattempted until the update interval of apache-snapshots
has elapsed or updates are forced. Original error: Could not transfer metadata org.apache.jclouds:jclouds-scriptbuilder:2.0.1-SNAPSHOT/maven-metadata.xml
from/to apache-snapshots (https://repository.apache.org/content/repositories/snapshots): Connection
to https://repository.apache.org refused
[WARNING] Failure to transfer org.apache.jclouds:jclouds-scriptbuilder:2.0.1-SNAPSHOT/maven-metadata.xml
from http://repository.apache.org/snapshots was cached in the local repository, resolution
will not be reattempted until the update interval of apache.snapshots has elapsed or updates
are forced. Original error: Could not transfer metadata org.apache.jclouds:jclouds-scriptbuilder:2.0.1-SNAPSHOT/maven-metadata.xml
from/to apache.snapshots (http://repository.apache.org/snapshots): Connection to http://repository.apache.org
refused
[WARNING] Failure to transfer org.apache.jclouds:jclouds-blobstore:2.0.1-SNAPSHOT/maven-metadata.xml
from https://repository.apache.org/content/repositories/snapshots was cached in the local
repository, resolution will not be reattempted until the update interval of apache-snapshots
has elapsed or updates are forced. Original error: Could not transfer metadata org.apache.jclouds:jclouds-blobstore:2.0.1-SNAPSHOT/maven-metadata.xml
from/to apache-snapshots (https://repository.apache.org/content/repositories/snapshots): Connection
to https://repository.apache.org refused
[WARNING] Failure to transfer org.apache.jclouds:jclouds-blobstore:2.0.1-SNAPSHOT/maven-metadata.xml
from http://repository.apache.org/snapshots was cached in the local repository, resolution
will not be reattempted until the update interval of apache.snapshots has elapsed or updates
are forced. Original error: Could not transfer metadata org.apache.jclouds:jclouds-blobstore:2.0.1-SNAPSHOT/maven-metadata.xml
from/to apache.snapshots (http://repository.apache.org/snapshots): Connection to http://repository.apache.org
refused
[WARNING] Failure to transfer org.apache.jclouds:jclouds-compute:2.0.1-SNAPSHOT/maven-metadata.xml
from https://repository.apache.org/content/repositories/snapshots was cached in the local
repository, resolution will not be reattempted until the update interval of apache-snapshots
has elapsed or updates are forced. Original error: Could not transfer metadata org.apache.jclouds:jclouds-compute:2.0.1-SNAPSHOT/maven-metadata.xml
from/to apache-snapshots (https://repository.apache.org/content/repositories/snapshots): Connection
to https://repository.apache.org refused
[WARNING] Failure to transfer org.apache.jclouds:jclouds-compute:2.0.1-SNAPSHOT/maven-metadata.xml
from http://repository.apache.org/snapshots was cached in the local repository, resolution
will not be reattempted until the update interval of apache.snapshots has elapsed or updates
are forced. Original error: Could not transfer metadata org.apache.jclouds:jclouds-compute:2.0.1-SNAPSHOT/maven-metadata.xml
from/to apache.snapshots (http://repository.apache.org/snapshots): Connection to http://repository.apache.org
refused
[INFO] 
[INFO] --- maven-resources-plugin:2.6:resources (default-resources) @ core ---
[INFO] Using 'UTF-8' encoding to copy filtered resources.
[INFO] skip non existing resourceDirectory <https://jclouds.ci.cloudbees.com/job/jclouds-karaf-2.0.x-branch/ws/core/src/main/resources>
[INFO] Copying 3 resources
[INFO] 
[INFO] --- maven-compiler-plugin:3.1:compile (default-compile) @ core ---
[INFO] Changes detected - recompiling the module!
[INFO] Compiling 4 source files to <https://jclouds.ci.cloudbees.com/job/jclouds-karaf-2.0.x-branch/ws/core/target/classes>
[INFO] 
[INFO] --- maven-bundle-plugin:2.1.0:manifest (bundle-manifest) @ core ---
[INFO] 
[INFO] --- maven-resources-plugin:2.6:testResources (default-testResources) @ core ---
[INFO] Using 'UTF-8' encoding to copy filtered resources.
[INFO] skip non existing resourceDirectory <https://jclouds.ci.cloudbees.com/job/jclouds-karaf-2.0.x-branch/ws/core/src/test/resources>
[INFO] Copying 3 resources
[INFO] 
[INFO] --- maven-compiler-plugin:3.1:testCompile (default-testCompile) @ core ---
[INFO] No sources to compile
[INFO] 
[INFO] --- maven-surefire-plugin:2.16:test (default-test) @ core ---
[JENKINS] Recording test results[INFO] 
[INFO] --- maven-bundle-plugin:2.1.0:bundle (default-bundle) @ core ---

[INFO] Expanding: <https://jclouds.ci.cloudbees.com/job/jclouds-karaf-2.0.x-branch/ws/core/target/core-2.0.1-SNAPSHOT.jar>
into <https://jclouds.ci.cloudbees.com/job/jclouds-karaf-2.0.x-branch/ws/core/target/classes>
[INFO] 
[INFO] --- maven-site-plugin:3.3:attach-descriptor (attach-descriptor) @ core ---
[INFO] 
[INFO] --- apache-rat-plugin:0.10:check (default) @ core ---
[INFO] 51 implicit excludes (use -debug for more details).
[INFO] Exclude: **/LICENSE.txt
[INFO] Exclude: **/header.txt
[INFO] Exclude: **/NOTICE.txt
[INFO] Exclude: **/DISCLAIMER
[INFO] Exclude: **/BUILD.txt
[INFO] Exclude: **/CHANGES.txt
[INFO] Exclude: **/README.md
[INFO] Exclude: **/README.txt
[INFO] Exclude: **/DEPENDENCIES
[INFO] Exclude: **/CONTRIBUTING.md
[INFO] Exclude: .git/**
[INFO] Exclude: **/.gitignore
[INFO] Exclude: **/*.json
[INFO] Exclude: **/*.log*
[INFO] Exclude: **/TODO
[INFO] Exclude: .mailmap
[INFO] Exclude: .idea/**
[INFO] Exclude: **/*.iml
[INFO] Exclude: **/.project
[INFO] Exclude: **/.classpath
[INFO] Exclude: **/.settings/**
[INFO] Exclude: **/.checkstyle
[INFO] Exclude: **/target/**
[INFO] Exclude: .repository/**
[INFO] Exclude: **/src/main/resources/**/*.txt
[INFO] 5 resources included (use -debug for more details)
Warning:  org.apache.xerces.jaxp.SAXParserImpl$JAXPSAXParser: Property 'http://www.oracle.com/xml/jaxp/properties/entityExpansionLimit'
is not recognized.
Compiler warnings:
  WARNING:  'org.apache.xerces.jaxp.SAXParserImpl: Property 'http://javax.xml.XMLConstants/property/accessExternalDTD'
is not recognized.'
Warning:  org.apache.xerces.parsers.SAXParser: Feature 'http://javax.xml.XMLConstants/feature/secure-processing'
is not recognized.
Warning:  org.apache.xerces.parsers.SAXParser: Property 'http://javax.xml.XMLConstants/property/accessExternalDTD'
is not recognized.
Warning:  org.apache.xerces.parsers.SAXParser: Property 'http://www.oracle.com/xml/jaxp/properties/entityExpansionLimit'
is not recognized.
[INFO] Rat check: Summary of files. Unapproved: 0 unknown: 0 generated: 0 approved: 5 licence.
[INFO] 
[INFO] --- maven-install-plugin:2.5.1:install (default-install) @ core ---
[INFO] Installing <https://jclouds.ci.cloudbees.com/job/jclouds-karaf-2.0.x-branch/ws/core/target/core-2.0.1-SNAPSHOT.jar>
to /home/jenkins/.m2/repository/org/apache/jclouds/karaf/core/2.0.1-SNAPSHOT/core-2.0.1-SNAPSHOT.jar
[INFO] Installing <https://jclouds.ci.cloudbees.com/job/jclouds-karaf-2.0.x-branch/ws/core/pom.xml>
to /home/jenkins/.m2/repository/org/apache/jclouds/karaf/core/2.0.1-SNAPSHOT/core-2.0.1-SNAPSHOT.pom
[INFO] 
[INFO] --- maven-bundle-plugin:2.1.0:install (default-install) @ core ---
[INFO] Installing org/apache/jclouds/karaf/core/2.0.1-SNAPSHOT/core-2.0.1-SNAPSHOT.jar
[INFO] Writing OBR metadata
[INFO] 
[INFO] --- maven-deploy-plugin:2.8.1:deploy (default-deploy) @ core ---
[INFO] Downloading: https://repository.apache.org/content/repositories/snapshots/org/apache/jclouds/karaf/core/2.0.1-SNAPSHOT/maven-metadata.xml
[WARNING] Could not transfer metadata org.apache.jclouds.karaf:core:2.0.1-SNAPSHOT/maven-metadata.xml
from/to apache.snapshots.https (https://repository.apache.org/content/repositories/snapshots):
Connection to https://repository.apache.org refused
Started calculate disk usage of build
Finished Calculation of disk usage of build in 0 seconds
Started calculate disk usage of workspace
Finished Calculation of disk usage of workspace in 0 seconds
[INFO] ------------------------------------------------------------------------
[INFO] Reactor Summary:
[INFO] 
[INFO] Apache jclouds :: Karaf ........................... SUCCESS [9.947s]
[INFO] jclouds :: Karaf :: Core .......................... FAILURE [8:33.985s]
[INFO] jclouds :: Karaf :: Bundles ....................... SKIPPED
[INFO] jclouds :: Karaf :: JSch Agentproxy for JSch (shaded bundle)  SKIPPED
[INFO] jclouds :: Karaf :: Utils ......................... SKIPPED
[INFO] jclouds :: Karaf :: Recipe ........................ SKIPPED
[INFO] jclouds :: Karaf :: Cache ......................... SKIPPED
[INFO] jclouds :: Karaf :: Services ...................... SKIPPED
[INFO] jclouds :: Karaf :: Commands ...................... SKIPPED
[INFO] jclouds :: Karaf :: URL Handler ................... SKIPPED
[INFO] jclouds :: Karaf :: Chef .......................... SKIPPED
[INFO] jclouds :: Karaf :: Chef :: Core .................. SKIPPED
[INFO] jclouds :: Karaf :: Chef :: Services .............. SKIPPED
[INFO] jclouds :: Karaf :: Chef :: Commands .............. SKIPPED
[INFO] jclouds :: Karaf :: Chef :: Cache ................. SKIPPED
[INFO] jclouds :: Karaf :: Feature ....................... SKIPPED
[INFO] jclouds :: Karaf :: Integration Tests ............. SKIPPED
[INFO] ------------------------------------------------------------------------
[INFO] BUILD FAILURE
[INFO] ------------------------------------------------------------------------
[INFO] Total time: 8:52.423s
[INFO] Finished at: Thu Jan 26 17:04:31 EST 2017
[INFO] Final Memory: 25M/119M
[INFO] ------------------------------------------------------------------------
[WARNING] The requested profile "doc" could not be activated because it does not exist.
[WARNING] The requested profile "src" could not be activated because it does not exist.
[ERROR] Failed to execute goal org.apache.maven.plugins:maven-deploy-plugin:2.8.1:deploy (default-deploy)
on project core: Failed to retrieve remote metadata org.apache.jclouds.karaf:core:2.0.1-SNAPSHOT/maven-metadata.xml:
Could not transfer metadata org.apache.jclouds.karaf:core:2.0.1-SNAPSHOT/maven-metadata.xml
from/to apache.snapshots.https (https://repository.apache.org/content/repositories/snapshots):
Connection to https://repository.apache.org refused: Connection timed out -> [Help 1]
org.apache.maven.lifecycle.LifecycleExecutionException: Failed to execute goal org.apache.maven.plugins:maven-deploy-plugin:2.8.1:deploy
(default-deploy) on project core: Failed to retrieve remote metadata org.apache.jclouds.karaf:core:2.0.1-SNAPSHOT/maven-metadata.xml:
Could not transfer metadata org.apache.jclouds.karaf:core:2.0.1-SNAPSHOT/maven-metadata.xml
from/to apache.snapshots.https (https://repository.apache.org/content/repositories/snapshots):
Connection to https://repository.apache.org refused
	at org.apache.maven.lifecycle.internal.MojoExecutor.execute(MojoExecutor.java:216)
	at org.apache.maven.lifecycle.internal.MojoExecutor.execute(MojoExecutor.java:153)
	at org.apache.maven.lifecycle.internal.MojoExecutor.execute(MojoExecutor.java:145)
	at org.apache.maven.lifecycle.internal.LifecycleModuleBuilder.buildProject(LifecycleModuleBuilder.java:84)
	at org.apache.maven.lifecycle.internal.LifecycleModuleBuilder.buildProject(LifecycleModuleBuilder.java:59)
	at org.apache.maven.lifecycle.internal.LifecycleStarter.singleThreadedBuild(LifecycleStarter.java:183)
	at org.apache.maven.lifecycle.internal.LifecycleStarter.execute(LifecycleStarter.java:161)
	at org.apache.maven.DefaultMaven.doExecute(DefaultMaven.java:318)
	at org.apache.maven.DefaultMaven.execute(DefaultMaven.java:153)
	at org.jvnet.hudson.maven3.launcher.Maven31Launcher.main(Maven31Launcher.java:132)
	at sun.reflect.NativeMethodAccessorImpl.invoke0(Native Method)
	at sun.reflect.NativeMethodAccessorImpl.invoke(NativeMethodAccessorImpl.java:57)
	at sun.reflect.DelegatingMethodAccessorImpl.invoke(DelegatingMethodAccessorImpl.java:43)
	at java.lang.reflect.Method.invoke(Method.java:606)
	at org.codehaus.plexus.classworlds.launcher.Launcher.launchStandard(Launcher.java:331)
	at org.codehaus.plexus.classworlds.launcher.Launcher.launch(Launcher.java:239)
	at jenkins.maven3.agent.Maven31Main.launch(Maven31Main.java:181)
	at sun.reflect.NativeMethodAccessorImpl.invoke0(Native Method)
	at sun.reflect.NativeMethodAccessorImpl.invoke(NativeMethodAccessorImpl.java:57)
	at sun.reflect.DelegatingMethodAccessorImpl.invoke(DelegatingMethodAccessorImpl.java:43)
	at java.lang.reflect.Method.invoke(Method.java:606)
	at hudson.maven.Maven3Builder.call(Maven3Builder.java:136)
	at hudson.maven.Maven3Builder.call(Maven3Builder.java:71)
	at hudson.remoting.UserRequest.perform(UserRequest.java:153)
	at hudson.remoting.UserRequest.perform(UserRequest.java:50)
	at hudson.remoting.Request$2.run(Request.java:332)
	at hudson.remoting.InterceptingExecutorService$1.call(InterceptingExecutorService.java:68)
	at java.util.concurrent.FutureTask.run(FutureTask.java:262)
	at java.util.concurrent.ThreadPoolExecutor.runWorker(ThreadPoolExecutor.java:1145)
	at java.util.concurrent.ThreadPoolExecutor$Worker.run(ThreadPoolExecutor.java:615)
	at java.lang.Thread.run(Thread.java:745)
Caused by: org.apache.maven.plugin.MojoExecutionException: Failed to retrieve remote metadata
org.apache.jclouds.karaf:core:2.0.1-SNAPSHOT/maven-metadata.xml: Could not transfer metadata
org.apache.jclouds.karaf:core:2.0.1-SNAPSHOT/maven-metadata.xml from/to apache.snapshots.https
(https://repository.apache.org/content/repositories/snapshots): Connection to https://repository.apache.org
refused
	at org.apache.maven.plugin.deploy.DeployMojo.deployProject(DeployMojo.java:282)
	at org.apache.maven.plugin.deploy.DeployMojo.execute(DeployMojo.java:169)
	at org.apache.maven.plugin.DefaultBuildPluginManager.executeMojo(DefaultBuildPluginManager.java:106)
	at org.apache.maven.lifecycle.internal.MojoExecutor.execute(MojoExecutor.java:208)
	... 30 more
Caused by: org.apache.maven.artifact.deployer.ArtifactDeploymentException: Failed to retrieve
remote metadata org.apache.jclouds.karaf:core:2.0.1-SNAPSHOT/maven-metadata.xml: Could not
transfer metadata org.apache.jclouds.karaf:core:2.0.1-SNAPSHOT/maven-metadata.xml from/to
apache.snapshots.https (https://repository.apache.org/content/repositories/snapshots): Connection
to https://repository.apache.org refused
	at org.apache.maven.artifact.deployer.DefaultArtifactDeployer.deploy(DefaultArtifactDeployer.java:143)
	at org.apache.maven.plugin.deploy.AbstractDeployMojo.deploy(AbstractDeployMojo.java:171)
	at org.apache.maven.plugin.deploy.DeployMojo.deployProject(DeployMojo.java:248)
	... 33 more
Caused by: org.eclipse.aether.deployment.DeploymentException: Failed to retrieve remote metadata
org.apache.jclouds.karaf:core:2.0.1-SNAPSHOT/maven-metadata.xml: Could not transfer metadata
org.apache.jclouds.karaf:core:2.0.1-SNAPSHOT/maven-metadata.xml from/to apache.snapshots.https
(https://repository.apache.org/content/repositories/snapshots): Connection to https://repository.apache.org
refused
	at org.eclipse.aether.internal.impl.DefaultDeployer.upload(DefaultDeployer.java:463)
	at org.eclipse.aether.internal.impl.DefaultDeployer.deploy(DefaultDeployer.java:313)
	at org.eclipse.aether.internal.impl.DefaultDeployer.deploy(DefaultDeployer.java:268)
	at org.eclipse.aether.internal.impl.DefaultRepositorySystem.deploy(DefaultRepositorySystem.java:413)
	at org.apache.maven.artifact.deployer.DefaultArtifactDeployer.deploy(DefaultArtifactDeployer.java:139)
	... 35 more
Caused by: org.eclipse.aether.transfer.MetadataTransferException: Could not transfer metadata
org.apache.jclouds.karaf:core:2.0.1-SNAPSHOT/maven-metadata.xml from/to apache.snapshots.https
(https://repository.apache.org/content/repositories/snapshots): Connection to https://repository.apache.org
refused
	at org.eclipse.aether.connector.wagon.WagonRepositoryConnector$5.wrap(WagonRepositoryConnector.java:995)
	at org.eclipse.aether.connector.wagon.WagonRepositoryConnector$5.wrap(WagonRepositoryConnector.java:983)
	at org.eclipse.aether.connector.wagon.WagonRepositoryConnector$GetTask.run(WagonRepositoryConnector.java:725)
	at org.eclipse.aether.util.concurrency.RunnableErrorForwarder$1.run(RunnableErrorForwarder.java:67)
	... 3 more
Caused by: org.apache.maven.wagon.TransferFailedException: Connection to https://repository.apache.org
refused
	at org.apache.maven.wagon.shared.http4.AbstractHttpClientWagon.fillInputData(AbstractHttpClientWagon.java:892)
	at org.apache.maven.wagon.StreamWagon.getInputStream(StreamWagon.java:116)
	at org.apache.maven.wagon.StreamWagon.getIfNewer(StreamWagon.java:88)
	at org.apache.maven.wagon.StreamWagon.get(StreamWagon.java:61)
	at org.eclipse.aether.connector.wagon.WagonRepositoryConnector$GetTask.run(WagonRepositoryConnector.java:660)
	... 4 more
Caused by: org.apache.maven.wagon.providers.http.httpclient.conn.HttpHostConnectException:
Connection to https://repository.apache.org refused
	at org.apache.maven.wagon.providers.http.httpclient.impl.conn.DefaultClientConnectionOperator.openConnection(DefaultClientConnectionOperator.java:190)
	at org.apache.maven.wagon.providers.http.httpclient.impl.conn.ManagedClientConnectionImpl.open(ManagedClientConnectionImpl.java:294)
	at org.apache.maven.wagon.providers.http.httpclient.impl.client.DefaultRequestDirector.tryConnect(DefaultRequestDirector.java:645)
	at org.apache.maven.wagon.providers.http.httpclient.impl.client.DefaultRequestDirector.execute(DefaultRequestDirector.java:480)
	at org.apache.maven.wagon.providers.http.httpclient.impl.client.AbstractHttpClient.execute(AbstractHttpClient.java:906)
	at org.apache.maven.wagon.providers.http.httpclient.impl.client.AbstractHttpClient.execute(AbstractHttpClient.java:805)
	at org.apache.maven.wagon.shared.http4.AbstractHttpClientWagon.execute(AbstractHttpClientWagon.java:746)
	at org.apache.maven.wagon.shared.http4.AbstractHttpClientWagon.fillInputData(AbstractHttpClientWagon.java:886)
	... 8 more
Caused by: java.net.ConnectException: Connection timed out
	at java.net.PlainSocketImpl.socketConnect(Native Method)
	at java.net.AbstractPlainSocketImpl.doConnect(AbstractPlainSocketImpl.java:339)
	at java.net.AbstractPlainSocketImpl.connectToAddress(AbstractPlainSocketImpl.java:200)
	at java.net.AbstractPlainSocketImpl.connect(AbstractPlainSocketImpl.java:182)
	at java.net.SocksSocketImpl.connect(SocksSocketImpl.java:392)
	at java.net.Socket.connect(Socket.java:579)
	at sun.security.ssl.SSLSocketImpl.connect(SSLSocketImpl.java:625)
	at org.apache.maven.wagon.providers.http.httpclient.conn.ssl.SSLSocketFactory.connectSocket(SSLSocketFactory.java:549)
	at org.apache.maven.wagon.shared.http4.ConfigurableSSLSocketFactoryDecorator.connectSocket(ConfigurableSSLSocketFactoryDecorator.java:64)
	at org.apache.maven.wagon.providers.http.httpclient.impl.conn.DefaultClientConnectionOperator.openConnection(DefaultClientConnectionOperator.java:180)
	... 15 more
[ERROR] 
[ERROR] Re-run Maven using the -X switch to enable full debug logging.
[ERROR] 
[ERROR] For more information about the errors and possible solutions, please read the following
articles:
[ERROR] [Help 1] http://cwiki.apache.org/confluence/display/MAVEN/MojoExecutionException
[ERROR] 
[ERROR] After correcting the problems, you can resume the build with the command
[ERROR]   mvn <goals> -rf :core
[JENKINS] Archiving <https://jclouds.ci.cloudbees.com/job/jclouds-karaf-2.0.x-branch/ws/chef/core/pom.xml>
to org.apache.jclouds.karaf.chef/core/2.0.1-SNAPSHOT/core-2.0.1-SNAPSHOT.pom
[JENKINS] Archiving <https://jclouds.ci.cloudbees.com/job/jclouds-karaf-2.0.x-branch/ws/bundles/pom.xml>
to org.apache.jclouds.karaf/bundles/2.0.1-SNAPSHOT/bundles-2.0.1-SNAPSHOT.pom
[JENKINS] Archiving <https://jclouds.ci.cloudbees.com/job/jclouds-karaf-2.0.x-branch/ws/utils/pom.xml>
to org.apache.jclouds.karaf/utils/2.0.1-SNAPSHOT/utils-2.0.1-SNAPSHOT.pom
[JENKINS] Archiving <https://jclouds.ci.cloudbees.com/job/jclouds-karaf-2.0.x-branch/ws/chef/commands/pom.xml>
to org.apache.jclouds.karaf.chef/commands/2.0.1-SNAPSHOT/commands-2.0.1-SNAPSHOT.pom
[JENKINS] Archiving <https://jclouds.ci.cloudbees.com/job/jclouds-karaf-2.0.x-branch/ws/services/pom.xml>
to org.apache.jclouds.karaf/services/2.0.1-SNAPSHOT/services-2.0.1-SNAPSHOT.pom
[JENKINS] Archiving <https://jclouds.ci.cloudbees.com/job/jclouds-karaf-2.0.x-branch/ws/feature/pom.xml>
to org.apache.jclouds.karaf/jclouds-karaf/2.0.1-SNAPSHOT/jclouds-karaf-2.0.1-SNAPSHOT.pom
[JENKINS] Archiving <https://jclouds.ci.cloudbees.com/job/jclouds-karaf-2.0.x-branch/ws/recipe/pom.xml>
to org.apache.jclouds.karaf/recipe/2.0.1-SNAPSHOT/recipe-2.0.1-SNAPSHOT.pom
[JENKINS] Archiving <https://jclouds.ci.cloudbees.com/job/jclouds-karaf-2.0.x-branch/ws/urlhandler/pom.xml>
to org.apache.jclouds.karaf/urlhandler/2.0.1-SNAPSHOT/urlhandler-2.0.1-SNAPSHOT.pom
[JENKINS] Archiving <https://jclouds.ci.cloudbees.com/job/jclouds-karaf-2.0.x-branch/ws/pom.xml>
to org.apache.jclouds/jclouds-karaf/2.0.1-SNAPSHOT/jclouds-karaf-2.0.1-SNAPSHOT.pom
[JENKINS] Archiving <https://jclouds.ci.cloudbees.com/job/jclouds-karaf-2.0.x-branch/ws/core/pom.xml>
to org.apache.jclouds.karaf/core/2.0.1-SNAPSHOT/core-2.0.1-SNAPSHOT.pom
[JENKINS] Archiving <https://jclouds.ci.cloudbees.com/job/jclouds-karaf-2.0.x-branch/ws/core/target/core-2.0.1-SNAPSHOT.jar>
to org.apache.jclouds.karaf/core/2.0.1-SNAPSHOT/core-2.0.1-SNAPSHOT.jar
[JENKINS] Archiving <https://jclouds.ci.cloudbees.com/job/jclouds-karaf-2.0.x-branch/ws/itests/pom.xml>
to org.apache.jclouds.karaf/itests/2.0.1-SNAPSHOT/itests-2.0.1-SNAPSHOT.pom
[JENKINS] Archiving <https://jclouds.ci.cloudbees.com/job/jclouds-karaf-2.0.x-branch/ws/cache/pom.xml>
to org.apache.jclouds.karaf/cache/2.0.1-SNAPSHOT/cache-2.0.1-SNAPSHOT.pom
[JENKINS] Archiving <https://jclouds.ci.cloudbees.com/job/jclouds-karaf-2.0.x-branch/ws/chef/services/pom.xml>
to org.apache.jclouds.karaf.chef/services/2.0.1-SNAPSHOT/services-2.0.1-SNAPSHOT.pom
[JENKINS] Archiving <https://jclouds.ci.cloudbees.com/job/jclouds-karaf-2.0.x-branch/ws/chef/pom.xml>
to org.apache.jclouds.karaf/chef/2.0.1-SNAPSHOT/chef-2.0.1-SNAPSHOT.pom
[JENKINS] Archiving <https://jclouds.ci.cloudbees.com/job/jclouds-karaf-2.0.x-branch/ws/chef/cache/pom.xml>
to org.apache.jclouds.karaf.chef/cache/2.0.1-SNAPSHOT/cache-2.0.1-SNAPSHOT.pom
[JENKINS] Archiving <https://jclouds.ci.cloudbees.com/job/jclouds-karaf-2.0.x-branch/ws/bundles/jsch-agentproxy-jsch/pom.xml>
to org.apache.jclouds.karaf.bundles/jsch-agentproxy-jsch/2.0.1-SNAPSHOT/jsch-agentproxy-jsch-2.0.1-SNAPSHOT.pom
[JENKINS] Archiving <https://jclouds.ci.cloudbees.com/job/jclouds-karaf-2.0.x-branch/ws/commands/pom.xml>
to org.apache.jclouds.karaf/commands/2.0.1-SNAPSHOT/commands-2.0.1-SNAPSHOT.pom
channel stopped
Started calculate disk usage of build
Finished Calculation of disk usage of build in 0 seconds
Started calculate disk usage of workspace
Finished Calculation of disk usage of workspace in 0 seconds

Mime
View raw message