jclouds-notifications mailing list archives

Site index · List index
Message view « Date » · « Thread »
Top « Date » · « Thread »
From jenkins-no-re...@cloudbees.com
Subject Build failed in Jenkins: jclouds-labs-2.0.x-branch #46
Date Wed, 01 Mar 2017 09:47:37 GMT
https://jclouds.ci.cloudbees.com/job/jclouds-labs-2.0.x-branch/46/Changes:

[Ignasi Barrera] Improve image lookup when getting node info

------------------------------------------
[...truncated 378.01 KB...]
  Alternatively, if you host your own repository you can deploy the file there: 
      mvn deploy:deploy-file -DgroupId=org.apache.jclouds.labs -DartifactId=cloudsigma2 -Dversion=2.0.2-SNAPSHOT
-Dpackaging=jar -Dfile=/path/to/file -Durl=[url] -DrepositoryId=[id]

  Path to dependency: 
  	1) org.apache.jclouds.labs:cloudsigma2-hnl:bundle:2.0.2-SNAPSHOT
  	2) org.apache.jclouds.labs:cloudsigma2:jar:2.0.2-SNAPSHOT

2) org.apache.jclouds.labs:cloudsigma2:test-jar:tests:2.0.2-SNAPSHOT

  Try downloading the file manually from the project website.

  Then, install it using the command: 
      mvn install:install-file -DgroupId=org.apache.jclouds.labs -DartifactId=cloudsigma2
-Dversion=2.0.2-SNAPSHOT -Dclassifier=tests -Dpackaging=test-jar -Dfile=/path/to/file

  Alternatively, if you host your own repository you can deploy the file there: 
      mvn deploy:deploy-file -DgroupId=org.apache.jclouds.labs -DartifactId=cloudsigma2 -Dversion=2.0.2-SNAPSHOT
-Dclassifier=tests -Dpackaging=test-jar -Dfile=/path/to/file -Durl=[url] -DrepositoryId=[id]

  Path to dependency: 
  	1) org.apache.jclouds.labs:cloudsigma2-hnl:bundle:2.0.2-SNAPSHOT
  	2) org.apache.jclouds.labs:cloudsigma2:test-jar:tests:2.0.2-SNAPSHOT

----------
2 required artifacts are missing.

for artifact: 
  org.apache.jclouds.labs:cloudsigma2-hnl:bundle:2.0.2-SNAPSHOT

from the specified remote repositories:
  central (https://repo.cloudbees.com/content/repositories/central, releases=true, snapshots=false),
  cloudbees-private-snapshot-repository (https://repository-jclouds.forge.cloudbees.com/snapshot,
releases=false, snapshots=true),
  cloudbees-private-release-repository (https://repository-jclouds.forge.cloudbees.com/release,
releases=true, snapshots=false),
  apache-snapshots (https://repository.apache.org/content/repositories/snapshots, releases=false,
snapshots=true),
  sonatype-nexus-snapshots (https://oss.sonatype.org/content/repositories/snapshots, releases=false,
snapshots=true),
  apache.snapshots (http://repository.apache.org/snapshots, releases=false, snapshots=true)

	at org.apache.maven.lifecycle.internal.MojoExecutor.execute(MojoExecutor.java:217)
	at org.apache.maven.lifecycle.internal.MojoExecutor.execute(MojoExecutor.java:153)
	at org.apache.maven.lifecycle.internal.MojoExecutor.execute(MojoExecutor.java:145)
	at org.apache.maven.lifecycle.internal.LifecycleModuleBuilder.buildProject(LifecycleModuleBuilder.java:84)
	at org.apache.maven.lifecycle.internal.LifecycleModuleBuilder.buildProject(LifecycleModuleBuilder.java:59)
	at org.apache.maven.lifecycle.internal.LifecycleStarter.singleThreadedBuild(LifecycleStarter.java:183)
	at org.apache.maven.lifecycle.internal.LifecycleStarter.execute(LifecycleStarter.java:161)
	at org.apache.maven.DefaultMaven.doExecute(DefaultMaven.java:320)
	at org.apache.maven.DefaultMaven.execute(DefaultMaven.java:156)
	at org.jvnet.hudson.maven3.launcher.Maven3Launcher.main(Maven3Launcher.java:117)
	at sun.reflect.NativeMethodAccessorImpl.invoke0(Native Method)
	at sun.reflect.NativeMethodAccessorImpl.invoke(NativeMethodAccessorImpl.java:57)
	at sun.reflect.DelegatingMethodAccessorImpl.invoke(DelegatingMethodAccessorImpl.java:43)
	at java.lang.reflect.Method.invoke(Method.java:606)
	at org.codehaus.plexus.classworlds.launcher.Launcher.launchStandard(Launcher.java:329)
	at org.codehaus.plexus.classworlds.launcher.Launcher.launch(Launcher.java:239)
	at org.jvnet.hudson.maven3.agent.Maven3Main.launch(Maven3Main.java:181)
	at sun.reflect.NativeMethodAccessorImpl.invoke0(Native Method)
	at sun.reflect.NativeMethodAccessorImpl.invoke(NativeMethodAccessorImpl.java:57)
	at sun.reflect.DelegatingMethodAccessorImpl.invoke(DelegatingMethodAccessorImpl.java:43)
	at java.lang.reflect.Method.invoke(Method.java:606)
	at hudson.maven.Maven3Builder.call(Maven3Builder.java:139)
	at hudson.maven.Maven3Builder.call(Maven3Builder.java:70)
	at hudson.remoting.UserRequest.perform(UserRequest.java:153)
	at hudson.remoting.UserRequest.perform(UserRequest.java:50)
	at hudson.remoting.Request$2.run(Request.java:336)
	at hudson.remoting.InterceptingExecutorService$1.call(InterceptingExecutorService.java:68)
	at java.util.concurrent.FutureTask.run(FutureTask.java:262)
	at java.util.concurrent.ThreadPoolExecutor.runWorker(ThreadPoolExecutor.java:1145)
	at java.util.concurrent.ThreadPoolExecutor$Worker.run(ThreadPoolExecutor.java:615)
	at java.lang.Thread.run(Thread.java:745)
Caused by: org.apache.maven.plugin.MojoExecutionException: MavenReportException: Error while
creating archive: Missing:
----------
1) org.apache.jclouds.labs:cloudsigma2:jar:2.0.2-SNAPSHOT

  Try downloading the file manually from the project website.

  Then, install it using the command: 
      mvn install:install-file -DgroupId=org.apache.jclouds.labs -DartifactId=cloudsigma2
-Dversion=2.0.2-SNAPSHOT -Dpackaging=jar -Dfile=/path/to/file

  Alternatively, if you host your own repository you can deploy the file there: 
      mvn deploy:deploy-file -DgroupId=org.apache.jclouds.labs -DartifactId=cloudsigma2 -Dversion=2.0.2-SNAPSHOT
-Dpackaging=jar -Dfile=/path/to/file -Durl=[url] -DrepositoryId=[id]

  Path to dependency: 
  	1) org.apache.jclouds.labs:cloudsigma2-hnl:bundle:2.0.2-SNAPSHOT
  	2) org.apache.jclouds.labs:cloudsigma2:jar:2.0.2-SNAPSHOT

2) org.apache.jclouds.labs:cloudsigma2:test-jar:tests:2.0.2-SNAPSHOT

  Try downloading the file manually from the project website.

  Then, install it using the command: 
      mvn install:install-file -DgroupId=org.apache.jclouds.labs -DartifactId=cloudsigma2
-Dversion=2.0.2-SNAPSHOT -Dclassifier=tests -Dpackaging=test-jar -Dfile=/path/to/file

  Alternatively, if you host your own repository you can deploy the file there: 
      mvn deploy:deploy-file -DgroupId=org.apache.jclouds.labs -DartifactId=cloudsigma2 -Dversion=2.0.2-SNAPSHOT
-Dclassifier=tests -Dpackaging=test-jar -Dfile=/path/to/file -Durl=[url] -DrepositoryId=[id]

  Path to dependency: 
  	1) org.apache.jclouds.labs:cloudsigma2-hnl:bundle:2.0.2-SNAPSHOT
  	2) org.apache.jclouds.labs:cloudsigma2:test-jar:tests:2.0.2-SNAPSHOT

----------
2 required artifacts are missing.

for artifact: 
  org.apache.jclouds.labs:cloudsigma2-hnl:bundle:2.0.2-SNAPSHOT

from the specified remote repositories:
  central (https://repo.cloudbees.com/content/repositories/central, releases=true, snapshots=false),
  cloudbees-private-snapshot-repository (https://repository-jclouds.forge.cloudbees.com/snapshot,
releases=false, snapshots=true),
  cloudbees-private-release-repository (https://repository-jclouds.forge.cloudbees.com/release,
releases=true, snapshots=false),
  apache-snapshots (https://repository.apache.org/content/repositories/snapshots, releases=false,
snapshots=true),
  sonatype-nexus-snapshots (https://oss.sonatype.org/content/repositories/snapshots, releases=false,
snapshots=true),
  apache.snapshots (http://repository.apache.org/snapshots, releases=false, snapshots=true)

	at org.apache.maven.plugin.javadoc.AbstractJavadocMojo.failOnError(AbstractJavadocMojo.java:5826)
	at org.apache.maven.plugin.javadoc.JavadocJar.execute(JavadocJar.java:209)
	at org.apache.maven.plugin.DefaultBuildPluginManager.executeMojo(DefaultBuildPluginManager.java:101)
	at org.apache.maven.lifecycle.internal.MojoExecutor.execute(MojoExecutor.java:209)
	... 30 more
Caused by: org.apache.maven.reporting.MavenReportException: Missing:
----------
1) org.apache.jclouds.labs:cloudsigma2:jar:2.0.2-SNAPSHOT

  Try downloading the file manually from the project website.

  Then, install it using the command: 
      mvn install:install-file -DgroupId=org.apache.jclouds.labs -DartifactId=cloudsigma2
-Dversion=2.0.2-SNAPSHOT -Dpackaging=jar -Dfile=/path/to/file

  Alternatively, if you host your own repository you can deploy the file there: 
      mvn deploy:deploy-file -DgroupId=org.apache.jclouds.labs -DartifactId=cloudsigma2 -Dversion=2.0.2-SNAPSHOT
-Dpackaging=jar -Dfile=/path/to/file -Durl=[url] -DrepositoryId=[id]

  Path to dependency: 
  	1) org.apache.jclouds.labs:cloudsigma2-hnl:bundle:2.0.2-SNAPSHOT
  	2) org.apache.jclouds.labs:cloudsigma2:jar:2.0.2-SNAPSHOT

2) org.apache.jclouds.labs:cloudsigma2:test-jar:tests:2.0.2-SNAPSHOT

  Try downloading the file manually from the project website.

  Then, install it using the command: 
      mvn install:install-file -DgroupId=org.apache.jclouds.labs -DartifactId=cloudsigma2
-Dversion=2.0.2-SNAPSHOT -Dclassifier=tests -Dpackaging=test-jar -Dfile=/path/to/file

  Alternatively, if you host your own repository you can deploy the file there: 
      mvn deploy:deploy-file -DgroupId=org.apache.jclouds.labs -DartifactId=cloudsigma2 -Dversion=2.0.2-SNAPSHOT
-Dclassifier=tests -Dpackaging=test-jar -Dfile=/path/to/file -Durl=[url] -DrepositoryId=[id]

  Path to dependency: 
  	1) org.apache.jclouds.labs:cloudsigma2-hnl:bundle:2.0.2-SNAPSHOT
  	2) org.apache.jclouds.labs:cloudsigma2:test-jar:tests:2.0.2-SNAPSHOT

----------
2 required artifacts are missing.

for artifact: 
  org.apache.jclouds.labs:cloudsigma2-hnl:bundle:2.0.2-SNAPSHOT

from the specified remote repositories:
  central (https://repo.cloudbees.com/content/repositories/central, releases=true, snapshots=false),
  cloudbees-private-snapshot-repository (https://repository-jclouds.forge.cloudbees.com/snapshot,
releases=false, snapshots=true),
  cloudbees-private-release-repository (https://repository-jclouds.forge.cloudbees.com/release,
releases=true, snapshots=false),
  apache-snapshots (https://repository.apache.org/content/repositories/snapshots, releases=false,
snapshots=true),
  sonatype-nexus-snapshots (https://oss.sonatype.org/content/repositories/snapshots, releases=false,
snapshots=true),
  apache.snapshots (http://repository.apache.org/snapshots, releases=false, snapshots=true)

	at org.apache.maven.plugin.javadoc.AbstractJavadocMojo.getClasspath(AbstractJavadocMojo.java:2438)
	at org.apache.maven.plugin.javadoc.AbstractJavadocMojo.addJavadocOptions(AbstractJavadocMojo.java:4536)
	at org.apache.maven.plugin.javadoc.AbstractJavadocMojo.executeReport(AbstractJavadocMojo.java:1937)
	at org.apache.maven.plugin.javadoc.JavadocJar.execute(JavadocJar.java:181)
	... 32 more
Caused by: org.apache.maven.artifact.resolver.MultipleArtifactsNotFoundException: Missing:
----------
1) org.apache.jclouds.labs:cloudsigma2:jar:2.0.2-SNAPSHOT

  Try downloading the file manually from the project website.

  Then, install it using the command: 
      mvn install:install-file -DgroupId=org.apache.jclouds.labs -DartifactId=cloudsigma2
-Dversion=2.0.2-SNAPSHOT -Dpackaging=jar -Dfile=/path/to/file

  Alternatively, if you host your own repository you can deploy the file there: 
      mvn deploy:deploy-file -DgroupId=org.apache.jclouds.labs -DartifactId=cloudsigma2 -Dversion=2.0.2-SNAPSHOT
-Dpackaging=jar -Dfile=/path/to/file -Durl=[url] -DrepositoryId=[id]

  Path to dependency: 
  	1) org.apache.jclouds.labs:cloudsigma2-hnl:bundle:2.0.2-SNAPSHOT
  	2) org.apache.jclouds.labs:cloudsigma2:jar:2.0.2-SNAPSHOT

2) org.apache.jclouds.labs:cloudsigma2:test-jar:tests:2.0.2-SNAPSHOT

  Try downloading the file manually from the project website.

  Then, install it using the command: 
      mvn install:install-file -DgroupId=org.apache.jclouds.labs -DartifactId=cloudsigma2
-Dversion=2.0.2-SNAPSHOT -Dclassifier=tests -Dpackaging=test-jar -Dfile=/path/to/file

  Alternatively, if you host your own repository you can deploy the file there: 
      mvn deploy:deploy-file -DgroupId=org.apache.jclouds.labs -DartifactId=cloudsigma2 -Dversion=2.0.2-SNAPSHOT
-Dclassifier=tests -Dpackaging=test-jar -Dfile=/path/to/file -Durl=[url] -DrepositoryId=[id]

  Path to dependency: 
  	1) org.apache.jclouds.labs:cloudsigma2-hnl:bundle:2.0.2-SNAPSHOT
  	2) org.apache.jclouds.labs:cloudsigma2:test-jar:tests:2.0.2-SNAPSHOT

----------
2 required artifacts are missing.

for artifact: 
  org.apache.jclouds.labs:cloudsigma2-hnl:bundle:2.0.2-SNAPSHOT

from the specified remote repositories:
  central (https://repo.cloudbees.com/content/repositories/central, releases=true, snapshots=false),
  cloudbees-private-snapshot-repository (https://repository-jclouds.forge.cloudbees.com/snapshot,
releases=false, snapshots=true),
  cloudbees-private-release-repository (https://repository-jclouds.forge.cloudbees.com/release,
releases=true, snapshots=false),
  apache-snapshots (https://repository.apache.org/content/repositories/snapshots, releases=false,
snapshots=true),
  sonatype-nexus-snapshots (https://oss.sonatype.org/content/repositories/snapshots, releases=false,
snapshots=true),
  apache.snapshots (http://repository.apache.org/snapshots, releases=false, snapshots=true)

	at org.apache.maven.artifact.resolver.DefaultResolutionErrorHandler.throwErrors(DefaultResolutionErrorHandler.java:71)
	at org.apache.maven.artifact.resolver.DefaultArtifactResolver.resolveWithExceptions(DefaultArtifactResolver.java:326)
	at org.apache.maven.artifact.resolver.DefaultArtifactResolver.resolveTransitively(DefaultArtifactResolver.java:314)
	at org.apache.maven.artifact.resolver.DefaultArtifactResolver.resolveTransitively(DefaultArtifactResolver.java:293)
	at org.apache.maven.artifact.resolver.DefaultArtifactResolver.resolveTransitively(DefaultArtifactResolver.java:271)
	at org.apache.maven.artifact.resolver.DefaultArtifactResolver.resolveTransitively(DefaultArtifactResolver.java:264)
	at org.apache.maven.plugin.javadoc.AbstractJavadocMojo.getClasspath(AbstractJavadocMojo.java:2423)
	... 35 more
[ERROR] 
[ERROR] Re-run Maven using the -X switch to enable full debug logging.
[ERROR] 
[ERROR] For more information about the errors and possible solutions, please read the following
articles:
[ERROR] [Help 1] http://cwiki.apache.org/confluence/display/MAVEN/MojoExecutionException
[JENKINS] Archiving <https://jclouds.ci.cloudbees.com/job/jclouds-labs-2.0.x-branch/ws/joyentcloud/pom.xml>
to org.apache.jclouds.labs/joyentcloud/2.0.2-SNAPSHOT/joyentcloud-2.0.2-SNAPSHOT.pom
[JENKINS] Archiving <https://jclouds.ci.cloudbees.com/job/jclouds-labs-2.0.x-branch/ws/joyent-cloudapi/pom.xml>
to org.apache.jclouds.labs/joyent-cloudapi/2.0.2-SNAPSHOT/joyent-cloudapi-2.0.2-SNAPSHOT.pom
[JENKINS] Archiving <https://jclouds.ci.cloudbees.com/job/jclouds-labs-2.0.x-branch/ws/cloudsigma2-wdc/pom.xml>
to org.apache.jclouds.labs/cloudsigma2-wdc/2.0.2-SNAPSHOT/cloudsigma2-wdc-2.0.2-SNAPSHOT.pom
[JENKINS] Archiving <https://jclouds.ci.cloudbees.com/job/jclouds-labs-2.0.x-branch/ws/cloudsigma2/pom.xml>
to org.apache.jclouds.labs/cloudsigma2/2.0.2-SNAPSHOT/cloudsigma2-2.0.2-SNAPSHOT.pom
[JENKINS] Archiving <https://jclouds.ci.cloudbees.com/job/jclouds-labs-2.0.x-branch/ws/profitbricks-rest/pom.xml>
to org.apache.jclouds.labs/profitbricks-rest/2.0.2-SNAPSHOT/profitbricks-rest-2.0.2-SNAPSHOT.pom
[JENKINS] Archiving <https://jclouds.ci.cloudbees.com/job/jclouds-labs-2.0.x-branch/ws/packet/pom.xml>
to org.apache.jclouds.labs/packet/2.0.2-SNAPSHOT/packet-2.0.2-SNAPSHOT.pom
[JENKINS] Archiving <https://jclouds.ci.cloudbees.com/job/jclouds-labs-2.0.x-branch/ws/cloudsigma2-zrh/pom.xml>
to org.apache.jclouds.labs/cloudsigma2-zrh/2.0.2-SNAPSHOT/cloudsigma2-zrh-2.0.2-SNAPSHOT.pom
[JENKINS] Archiving <https://jclouds.ci.cloudbees.com/job/jclouds-labs-2.0.x-branch/ws/vagrant/pom.xml>
to org.apache.jclouds.labs/vagrant/2.0.2-SNAPSHOT/vagrant-2.0.2-SNAPSHOT.pom
[JENKINS] Archiving <https://jclouds.ci.cloudbees.com/job/jclouds-labs-2.0.x-branch/ws/pom.xml>
to org.apache.jclouds.labs/jclouds-labs/2.0.2-SNAPSHOT/jclouds-labs-2.0.2-SNAPSHOT.pom
[JENKINS] Archiving <https://jclouds.ci.cloudbees.com/job/jclouds-labs-2.0.x-branch/ws/target/jclouds-labs-2.0.2-SNAPSHOT-tests.jar>
to org.apache.jclouds.labs/jclouds-labs/2.0.2-SNAPSHOT/jclouds-labs-2.0.2-SNAPSHOT-tests.jar
[JENKINS] Archiving <https://jclouds.ci.cloudbees.com/job/jclouds-labs-2.0.x-branch/ws/oneandone/pom.xml>
to org.apache.jclouds.labs/oneandone/2.0.2-SNAPSHOT/oneandone-2.0.2-SNAPSHOT.pom
[JENKINS] Archiving <https://jclouds.ci.cloudbees.com/job/jclouds-labs-2.0.x-branch/ws/cloudsigma2-hnl/pom.xml>
to org.apache.jclouds.labs/cloudsigma2-hnl/2.0.2-SNAPSHOT/cloudsigma2-hnl-2.0.2-SNAPSHOT.pom
[JENKINS] Archiving <https://jclouds.ci.cloudbees.com/job/jclouds-labs-2.0.x-branch/ws/b2/pom.xml>
to org.apache.jclouds.labs/b2/2.0.2-SNAPSHOT/b2-2.0.2-SNAPSHOT.pom
[JENKINS] Archiving <https://jclouds.ci.cloudbees.com/job/jclouds-labs-2.0.x-branch/ws/cloudsigma2-mia/pom.xml>
to org.apache.jclouds.labs/cloudsigma2-mia/2.0.2-SNAPSHOT/cloudsigma2-mia-2.0.2-SNAPSHOT.pom
[JENKINS] Archiving <https://jclouds.ci.cloudbees.com/job/jclouds-labs-2.0.x-branch/ws/azurecompute/pom.xml>
to org.apache.jclouds.labs/azurecompute/2.0.2-SNAPSHOT/azurecompute-2.0.2-SNAPSHOT.pom
[JENKINS] Archiving <https://jclouds.ci.cloudbees.com/job/jclouds-labs-2.0.x-branch/ws/cloudsigma2-sjc/pom.xml>
to org.apache.jclouds.labs/cloudsigma2-sjc/2.0.2-SNAPSHOT/cloudsigma2-sjc-2.0.2-SNAPSHOT.pom
[JENKINS] Archiving <https://jclouds.ci.cloudbees.com/job/jclouds-labs-2.0.x-branch/ws/azurecompute-arm/pom.xml>
to org.apache.jclouds.labs/azurecompute-arm/2.0.2-SNAPSHOT/azurecompute-arm-2.0.2-SNAPSHOT.pom
[JENKINS] Archiving <https://jclouds.ci.cloudbees.com/job/jclouds-labs-2.0.x-branch/ws/jdbc/pom.xml>
to org.apache.jclouds.labs/jdbc/2.0.2-SNAPSHOT/jdbc-2.0.2-SNAPSHOT.pom
[JENKINS] Archiving <https://jclouds.ci.cloudbees.com/job/jclouds-labs-2.0.x-branch/ws/cdmi/pom.xml>
to org.apache.jclouds.labs/cdmi/2.0.2-SNAPSHOT/cdmi-2.0.2-SNAPSHOT.pom
[JENKINS] Archiving <https://jclouds.ci.cloudbees.com/job/jclouds-labs-2.0.x-branch/ws/cloudsigma2-lvs/pom.xml>
to org.apache.jclouds.labs/cloudsigma2-lvs/2.0.2-SNAPSHOT/cloudsigma2-lvs-2.0.2-SNAPSHOT.pom
[JENKINS] Archiving <https://jclouds.ci.cloudbees.com/job/jclouds-labs-2.0.x-branch/ws/abiquo/pom.xml>
to org.apache.jclouds.labs/abiquo/2.0.2-SNAPSHOT/abiquo-2.0.2-SNAPSHOT.pom
[JENKINS] Archiving <https://jclouds.ci.cloudbees.com/job/jclouds-labs-2.0.x-branch/ws/h2-jdbc/pom.xml>
to org.apache.jclouds.labs/h2-jdbc/2.0.2-SNAPSHOT/h2-jdbc-2.0.2-SNAPSHOT.pom
Sending e-mails to: notifications@jclouds.apache.org
channel stopped
Started calculate disk usage of build
Finished Calculation of disk usage of build in 0 seconds
Started calculate disk usage of workspace
Finished Calculation of disk usage of workspace in 0 seconds

Mime
View raw message