jclouds-notifications mailing list archives

Site index · List index
Message view « Date » · « Thread »
Top « Date » · « Thread »
From jenkins-no-re...@cloudbees.com
Subject Build failed in Jenkins: jclouds-cli #1314
Date Sat, 08 Apr 2017 03:29:07 GMT
See <https://jclouds.ci.cloudbees.com/job/jclouds-cli/1314/display/redirect>

------------------------------------------
[...truncated 87.85 KB...]
Uploaded: https://repository.apache.org/content/repositories/snapshots/org/apache/jclouds/cli/jclouds-cli-runner/2.1.0-SNAPSHOT/jclouds-cli-runner-2.1.0-20170408.032855-67-javadoc.jar
(47 KB at 463.0 KB/sec)
Uploading: https://repository.apache.org/content/repositories/snapshots/org/apache/jclouds/cli/jclouds-cli-runner/2.1.0-SNAPSHOT/maven-metadata.xml
Uploaded: https://repository.apache.org/content/repositories/snapshots/org/apache/jclouds/cli/jclouds-cli-runner/2.1.0-SNAPSHOT/maven-metadata.xml
(2 KB at 20.7 KB/sec)
Uploading: https://repository.apache.org/content/repositories/snapshots/org/apache/jclouds/cli/jclouds-cli-runner/2.1.0-SNAPSHOT/jclouds-cli-runner-2.1.0-20170408.032855-67-sources.jar
Uploaded: https://repository.apache.org/content/repositories/snapshots/org/apache/jclouds/cli/jclouds-cli-runner/2.1.0-SNAPSHOT/jclouds-cli-runner-2.1.0-20170408.032855-67-sources.jar
(13 KB at 161.2 KB/sec)
Uploading: https://repository.apache.org/content/repositories/snapshots/org/apache/jclouds/cli/jclouds-cli-runner/2.1.0-SNAPSHOT/maven-metadata.xml
Uploaded: https://repository.apache.org/content/repositories/snapshots/org/apache/jclouds/cli/jclouds-cli-runner/2.1.0-SNAPSHOT/maven-metadata.xml
(2 KB at 23.1 KB/sec)
Uploading: https://repository.apache.org/content/repositories/snapshots/org/apache/jclouds/cli/jclouds-cli-runner/2.1.0-SNAPSHOT/jclouds-cli-runner-2.1.0-20170408.032855-67-test-sources.jar
Uploaded: https://repository.apache.org/content/repositories/snapshots/org/apache/jclouds/cli/jclouds-cli-runner/2.1.0-SNAPSHOT/jclouds-cli-runner-2.1.0-20170408.032855-67-test-sources.jar
(7 KB at 83.5 KB/sec)
Uploading: https://repository.apache.org/content/repositories/snapshots/org/apache/jclouds/cli/jclouds-cli-runner/2.1.0-SNAPSHOT/maven-metadata.xml
Uploaded: https://repository.apache.org/content/repositories/snapshots/org/apache/jclouds/cli/jclouds-cli-runner/2.1.0-SNAPSHOT/maven-metadata.xml
(2 KB at 21.9 KB/sec)
Started calculate disk usage of build
Finished Calculation of disk usage of build in 0 seconds
Started calculate disk usage of workspace
Finished Calculation of disk usage of workspace in 0 seconds
[INFO]                                                                         
[INFO] ------------------------------------------------------------------------
[INFO] Building jclouds :: cli :: assembly 2.1.0-SNAPSHOT
[INFO] ------------------------------------------------------------------------
Downloading: https://repository-jclouds.forge.cloudbees.com/release/org/apache/maven/plugins/maven-resources-plugin/2.4.2/maven-resources-plugin-2.4.2.pom
Downloading: https://repo.cloudbees.com/content/repositories/central/org/apache/maven/plugins/maven-resources-plugin/2.4.2/maven-resources-plugin-2.4.2.pom
Downloaded: https://repo.cloudbees.com/content/repositories/central/org/apache/maven/plugins/maven-resources-plugin/2.4.2/maven-resources-plugin-2.4.2.pom
(5 KB at 305.2 KB/sec)
Downloading: https://repository-jclouds.forge.cloudbees.com/release/org/apache/maven/plugins/maven-plugins/17/maven-plugins-17.pom
Downloading: https://repo.cloudbees.com/content/repositories/central/org/apache/maven/plugins/maven-plugins/17/maven-plugins-17.pom
Downloaded: https://repo.cloudbees.com/content/repositories/central/org/apache/maven/plugins/maven-plugins/17/maven-plugins-17.pom
(13 KB at 56.2 KB/sec)
Downloading: https://repository-jclouds.forge.cloudbees.com/release/org/apache/maven/plugins/maven-resources-plugin/2.4.2/maven-resources-plugin-2.4.2.jar
Downloading: https://repo.cloudbees.com/content/repositories/central/org/apache/maven/plugins/maven-resources-plugin/2.4.2/maven-resources-plugin-2.4.2.jar
Downloaded: https://repo.cloudbees.com/content/repositories/central/org/apache/maven/plugins/maven-resources-plugin/2.4.2/maven-resources-plugin-2.4.2.jar
(24 KB at 1323.0 KB/sec)
Downloading: https://repository-jclouds.forge.cloudbees.com/release/org/apache/maven/plugins/maven-antrun-plugin/1.7/maven-antrun-plugin-1.7.pom
Downloading: https://repo.cloudbees.com/content/repositories/central/org/apache/maven/plugins/maven-antrun-plugin/1.7/maven-antrun-plugin-1.7.pom
Downloaded: https://repo.cloudbees.com/content/repositories/central/org/apache/maven/plugins/maven-antrun-plugin/1.7/maven-antrun-plugin-1.7.pom
(5 KB at 236.9 KB/sec)
Downloading: https://repository-jclouds.forge.cloudbees.com/release/org/apache/maven/plugins/maven-antrun-plugin/1.7/maven-antrun-plugin-1.7.jar
Downloading: https://repo.cloudbees.com/content/repositories/central/org/apache/maven/plugins/maven-antrun-plugin/1.7/maven-antrun-plugin-1.7.jar
Downloaded: https://repo.cloudbees.com/content/repositories/central/org/apache/maven/plugins/maven-antrun-plugin/1.7/maven-antrun-plugin-1.7.jar
(31 KB at 1714.6 KB/sec)
Downloading: https://repository-jclouds.forge.cloudbees.com/release/org/apache/maven/plugins/maven-assembly-plugin/2.2.1/maven-assembly-plugin-2.2.1.pom
Downloading: https://repo.cloudbees.com/content/repositories/central/org/apache/maven/plugins/maven-assembly-plugin/2.2.1/maven-assembly-plugin-2.2.1.pom
Downloaded: https://repo.cloudbees.com/content/repositories/central/org/apache/maven/plugins/maven-assembly-plugin/2.2.1/maven-assembly-plugin-2.2.1.pom
(17 KB at 895.2 KB/sec)
Downloading: https://repository-jclouds.forge.cloudbees.com/release/org/apache/maven/plugins/maven-plugins/19/maven-plugins-19.pom
Downloading: https://repo.cloudbees.com/content/repositories/central/org/apache/maven/plugins/maven-plugins/19/maven-plugins-19.pom
Downloaded: https://repo.cloudbees.com/content/repositories/central/org/apache/maven/plugins/maven-plugins/19/maven-plugins-19.pom
(11 KB at 716.6 KB/sec)
Downloading: https://repository-jclouds.forge.cloudbees.com/release/org/apache/maven/plugins/maven-assembly-plugin/2.2.1/maven-assembly-plugin-2.2.1.jar
Downloading: https://repo.cloudbees.com/content/repositories/central/org/apache/maven/plugins/maven-assembly-plugin/2.2.1/maven-assembly-plugin-2.2.1.jar
Downloaded: https://repo.cloudbees.com/content/repositories/central/org/apache/maven/plugins/maven-assembly-plugin/2.2.1/maven-assembly-plugin-2.2.1.jar
(216 KB at 6344.4 KB/sec)
Downloading: https://repo.cloudbees.com/content/repositories/central/org/slf4j/slf4j-simple/1.7.7/slf4j-simple-1.7.7.pom
Downloaded: https://repo.cloudbees.com/content/repositories/central/org/slf4j/slf4j-simple/1.7.7/slf4j-simple-1.7.7.pom
(2 KB at 75.7 KB/sec)
Downloading: https://repo.cloudbees.com/content/repositories/central/org/eclipse/jetty/jetty-server/8.1.8.v20121106/jetty-server-8.1.8.v20121106.pom
Downloaded: https://repo.cloudbees.com/content/repositories/central/org/eclipse/jetty/jetty-server/8.1.8.v20121106/jetty-server-8.1.8.v20121106.pom
(4 KB at 228.1 KB/sec)
Downloading: https://repo.cloudbees.com/content/repositories/central/org/eclipse/jetty/jetty-project/8.1.8.v20121106/jetty-project-8.1.8.v20121106.pom
Downloaded: https://repo.cloudbees.com/content/repositories/central/org/eclipse/jetty/jetty-project/8.1.8.v20121106/jetty-project-8.1.8.v20121106.pom
(27 KB at 1559.3 KB/sec)
Downloading: https://repo.cloudbees.com/content/repositories/central/org/eclipse/jetty/orbit/javax.servlet/3.0.0.v201112011016/javax.servlet-3.0.0.v201112011016.pom
Downloaded: https://repo.cloudbees.com/content/repositories/central/org/eclipse/jetty/orbit/javax.servlet/3.0.0.v201112011016/javax.servlet-3.0.0.v201112011016.pom
(732 B at 44.7 KB/sec)
Downloading: https://repo.cloudbees.com/content/repositories/central/org/eclipse/jetty/jetty-continuation/8.1.8.v20121106/jetty-continuation-8.1.8.v20121106.pom
Downloaded: https://repo.cloudbees.com/content/repositories/central/org/eclipse/jetty/jetty-continuation/8.1.8.v20121106/jetty-continuation-8.1.8.v20121106.pom
(3 KB at 164.3 KB/sec)
Downloading: https://repo.cloudbees.com/content/repositories/central/org/eclipse/jetty/jetty-http/8.1.8.v20121106/jetty-http-8.1.8.v20121106.pom
Downloaded: https://repo.cloudbees.com/content/repositories/central/org/eclipse/jetty/jetty-http/8.1.8.v20121106/jetty-http-8.1.8.v20121106.pom
(3 KB at 169.1 KB/sec)
Downloading: https://repo.cloudbees.com/content/repositories/central/org/eclipse/jetty/jetty-io/8.1.8.v20121106/jetty-io-8.1.8.v20121106.pom
Downloaded: https://repo.cloudbees.com/content/repositories/central/org/eclipse/jetty/jetty-io/8.1.8.v20121106/jetty-io-8.1.8.v20121106.pom
(3 KB at 128.4 KB/sec)
Downloading: https://repo.cloudbees.com/content/repositories/central/org/eclipse/jetty/jetty-util/8.1.8.v20121106/jetty-util-8.1.8.v20121106.pom
Downloaded: https://repo.cloudbees.com/content/repositories/central/org/eclipse/jetty/jetty-util/8.1.8.v20121106/jetty-util-8.1.8.v20121106.pom
(4 KB at 207.0 KB/sec)
Downloading: https://repo.cloudbees.com/content/repositories/central/org/eclipse/jetty/jetty-security/8.1.8.v20121106/jetty-security-8.1.8.v20121106.pom
Downloaded: https://repo.cloudbees.com/content/repositories/central/org/eclipse/jetty/jetty-security/8.1.8.v20121106/jetty-security-8.1.8.v20121106.pom
(3 KB at 175.4 KB/sec)
Downloading: https://repo.cloudbees.com/content/repositories/central/org/slf4j/slf4j-log4j12/1.7.7/slf4j-log4j12-1.7.7.pom
Downloaded: https://repo.cloudbees.com/content/repositories/central/org/slf4j/slf4j-log4j12/1.7.7/slf4j-log4j12-1.7.7.pom
(2 KB at 97.6 KB/sec)
Downloading: https://repo.cloudbees.com/content/repositories/central/org/slf4j/slf4j-simple/1.7.7/slf4j-simple-1.7.7.jar
Downloading: https://repo.cloudbees.com/content/repositories/central/org/eclipse/jetty/jetty-server/8.1.8.v20121106/jetty-server-8.1.8.v20121106.jar
Downloading: https://repo.cloudbees.com/content/repositories/central/org/eclipse/jetty/orbit/javax.servlet/3.0.0.v201112011016/javax.servlet-3.0.0.v201112011016.jar
Downloading: https://repo.cloudbees.com/content/repositories/central/org/eclipse/jetty/jetty-security/8.1.8.v20121106/jetty-security-8.1.8.v20121106.jar
Downloading: https://repo.cloudbees.com/content/repositories/central/org/apache/karaf/apache-karaf/2.3.11/apache-karaf-2.3.11.zip
Downloaded: https://repo.cloudbees.com/content/repositories/central/org/slf4j/slf4j-simple/1.7.7/slf4j-simple-1.7.7.jar
(11 KB at 496.8 KB/sec)
Downloading: https://repo.cloudbees.com/content/repositories/central/org/slf4j/slf4j-log4j12/1.7.7/slf4j-log4j12-1.7.7.jar
Downloaded: https://repo.cloudbees.com/content/repositories/central/org/eclipse/jetty/jetty-security/8.1.8.v20121106/jetty-security-8.1.8.v20121106.jar
(88 KB at 2924.9 KB/sec)
Downloaded: https://repo.cloudbees.com/content/repositories/central/org/eclipse/jetty/orbit/javax.servlet/3.0.0.v201112011016/javax.servlet-3.0.0.v201112011016.jar
(196 KB at 5288.9 KB/sec)
Downloaded: https://repo.cloudbees.com/content/repositories/central/org/slf4j/slf4j-log4j12/1.7.7/slf4j-log4j12-1.7.7.jar
(9 KB at 309.4 KB/sec)
Downloaded: https://repo.cloudbees.com/content/repositories/central/org/eclipse/jetty/jetty-server/8.1.8.v20121106/jetty-server-8.1.8.v20121106.jar
(332 KB at 6246.0 KB/sec)
Downloaded: https://repo.cloudbees.com/content/repositories/central/org/apache/karaf/apache-karaf/2.3.11/apache-karaf-2.3.11.zip
(12681 KB at 23013.7 KB/sec)
[INFO] 
[INFO] --- maven-clean-plugin:2.5:clean (default-clean) @ jclouds-cli-assembly ---
[INFO] 
[INFO] --- maven-enforcer-plugin:1.1.1:enforce (enforce-banned-dependencies) @ jclouds-cli-assembly
---
[INFO] 
[INFO] --- maven-enforcer-plugin:1.1.1:enforce (enforce-java) @ jclouds-cli-assembly ---
[INFO] 
[INFO] --- maven-remote-resources-plugin:1.5:process (default) @ jclouds-cli-assembly ---
[INFO] 
[INFO] --- maven-resources-plugin:2.4.2:resources (filter) @ jclouds-cli-assembly ---
[INFO] Using 'UTF-8' encoding to copy filtered resources.
[INFO] skip non existing resourceDirectory <https://jclouds.ci.cloudbees.com/job/jclouds-cli/ws/assembly/src/main/resources>
[INFO] Copying 13 resources
[INFO] Copying 3 resources
[INFO] 
[INFO] --- maven-dependency-plugin:2.8:unpack (unpack-unix) @ jclouds-cli-assembly ---
[INFO] Configured Artifact: org.apache.karaf:apache-karaf:minimal:2.3.11:tar.gz
Downloading: https://repo.cloudbees.com/content/repositories/central/org/apache/karaf/apache-karaf/2.3.11/apache-karaf-2.3.11-minimal.tar.gz
Downloaded: https://repo.cloudbees.com/content/repositories/central/org/apache/karaf/apache-karaf/2.3.11/apache-karaf-2.3.11-minimal.tar.gz
(7822 KB at 30315.0 KB/sec)
[INFO] Unpacking /home/jenkins/.m2/repository/org/apache/karaf/apache-karaf/2.3.11/apache-karaf-2.3.11-minimal.tar.gz
to <https://jclouds.ci.cloudbees.com/job/jclouds-cli/ws/assembly/target/dependencies/unix>
with includes "" and excludes ""
[INFO] Expanding: /home/jenkins/.m2/repository/org/apache/karaf/apache-karaf/2.3.11/apache-karaf-2.3.11-minimal.tar.gz
into <https://jclouds.ci.cloudbees.com/job/jclouds-cli/ws/assembly/target/dependencies/unix>
[INFO] 
[INFO] --- maven-dependency-plugin:2.8:unpack (unpack-win) @ jclouds-cli-assembly ---
[INFO] Configured Artifact: org.apache.karaf:apache-karaf:minimal:2.3.11:zip
Downloading: https://repo.cloudbees.com/content/repositories/central/org/apache/karaf/apache-karaf/2.3.11/apache-karaf-2.3.11-minimal.zip
Downloaded: https://repo.cloudbees.com/content/repositories/central/org/apache/karaf/apache-karaf/2.3.11/apache-karaf-2.3.11-minimal.zip
(8918 KB at 28580.5 KB/sec)
[INFO] Unpacking /home/jenkins/.m2/repository/org/apache/karaf/apache-karaf/2.3.11/apache-karaf-2.3.11-minimal.zip
to <https://jclouds.ci.cloudbees.com/job/jclouds-cli/ws/assembly/target/dependencies/win>
with includes "" and excludes ""
[INFO] 
[INFO] --- maven-resources-plugin:2.4.2:resources (default-resources) @ jclouds-cli-assembly
---
[INFO] Using 'UTF-8' encoding to copy filtered resources.
[INFO] skip non existing resourceDirectory <https://jclouds.ci.cloudbees.com/job/jclouds-cli/ws/assembly/src/main/resources>
[INFO] Copying 13 resources
[INFO] Copying 3 resources
[INFO] 
[INFO] --- maven-compiler-plugin:3.1:compile (default-compile) @ jclouds-cli-assembly ---
[INFO] No sources to compile
[INFO] 
[INFO] --- maven-enforcer-plugin:1.1.1:enforce (enforce-banned-dependencies) @ jclouds-cli-assembly
---
[INFO] 
[INFO] --- maven-enforcer-plugin:1.1.1:enforce (enforce-java) @ jclouds-cli-assembly ---
[INFO] 
[INFO] --- maven-remote-resources-plugin:1.5:process (default) @ jclouds-cli-assembly ---
[INFO] 
[INFO] --- maven-resources-plugin:2.4.2:resources (filter) @ jclouds-cli-assembly ---
[INFO] Using 'UTF-8' encoding to copy filtered resources.
[INFO] skip non existing resourceDirectory <https://jclouds.ci.cloudbees.com/job/jclouds-cli/ws/assembly/src/main/resources>
[INFO] Copying 13 resources
[INFO] Copying 3 resources
[INFO] Copying 3 resources
[INFO] 
[INFO] --- maven-dependency-plugin:2.8:unpack (unpack-unix) @ jclouds-cli-assembly ---
[INFO] Configured Artifact: org.apache.karaf:apache-karaf:minimal:2.3.11:tar.gz
[INFO] apache-karaf-2.3.11-minimal.tar.gz already unpacked.
[INFO] 
[INFO] --- maven-dependency-plugin:2.8:unpack (unpack-win) @ jclouds-cli-assembly ---
[INFO] Configured Artifact: org.apache.karaf:apache-karaf:minimal:2.3.11:zip
[INFO] apache-karaf-2.3.11-minimal.zip already unpacked.
[INFO] 
[INFO] --- maven-resources-plugin:2.4.2:resources (default-resources) @ jclouds-cli-assembly
---
[INFO] Using 'UTF-8' encoding to copy filtered resources.
[INFO] skip non existing resourceDirectory <https://jclouds.ci.cloudbees.com/job/jclouds-cli/ws/assembly/src/main/resources>
[INFO] Copying 13 resources
[INFO] Copying 3 resources
[INFO] Copying 3 resources
[INFO] 
[INFO] --- maven-compiler-plugin:3.1:compile (default-compile) @ jclouds-cli-assembly ---
[INFO] No sources to compile
[WARNING] Failed to getClass for org.apache.karaf.tooling.features.AddFeaturesToRepoMojo
[INFO] 
[INFO] --- features-maven-plugin:2.3.11:add-features-to-repo (add-features-to-repo) @ jclouds-cli-assembly
---
[INFO] Copying bundle: org.apache.karaf.assemblies.features:standard:xml:features:2.3.11
[INFO] Copying bundle: org.apache.karaf.assemblies.features:enterprise:xml:features:2.3.11
[INFO] Copying bundle: org.apache.karaf.assemblies.features:enterprise:xml:features:2.3.11
[INFO] Copying bundle: org.ops4j.pax.cdi:pax-cdi-features:xml:features:0.8.0
[INFO] Copying bundle: org.apache.karaf.assemblies.features:standard:xml:features:2.3.11
[INFO] Copying bundle: org.apache.karaf.assemblies.features:standard:xml:features:2.3.11
[INFO] Copying bundle: org.apache.jclouds.karaf:jclouds-karaf:xml:features:2.1.0-SNAPSHOT
Downloading: http://repository.apache.org/snapshots/org/apache/jclouds/karaf/jclouds-karaf/2.1.0-SNAPSHOT/maven-metadata.xml
Downloading: https://repository.apache.org/content/repositories/snapshots/org/apache/jclouds/karaf/jclouds-karaf/2.1.0-SNAPSHOT/maven-metadata.xml
Downloading: https://repository-jclouds.forge.cloudbees.com/snapshot/org/apache/jclouds/karaf/jclouds-karaf/2.1.0-SNAPSHOT/maven-metadata.xml
Downloaded: https://repository.apache.org/content/repositories/snapshots/org/apache/jclouds/karaf/jclouds-karaf/2.1.0-SNAPSHOT/maven-metadata.xml
(2 KB at 31.7 KB/sec)
Downloaded: http://repository.apache.org/snapshots/org/apache/jclouds/karaf/jclouds-karaf/2.1.0-SNAPSHOT/maven-metadata.xml
(2 KB at 29.4 KB/sec)
Downloading: https://repository.apache.org/content/repositories/snapshots/org/apache/jclouds/karaf/jclouds-karaf/2.1.0-SNAPSHOT/jclouds-karaf-2.1.0-20170408.031524-97-features.xml
Downloaded: https://repository.apache.org/content/repositories/snapshots/org/apache/jclouds/karaf/jclouds-karaf/2.1.0-SNAPSHOT/jclouds-karaf-2.1.0-20170408.031524-97-features.xml
(43 KB at 897.7 KB/sec)
Started calculate disk usage of build
Finished Calculation of disk usage of build in 0 seconds
Started calculate disk usage of workspace
Finished Calculation of disk usage of workspace in 0 seconds
[INFO] ------------------------------------------------------------------------
[INFO] Reactor Summary:
[INFO] 
[INFO] Apache jclouds :: cli ............................. SUCCESS [8.411s]
[INFO] jclouds :: cli :: branding ........................ SUCCESS [3.887s]
[INFO] jclouds :: cli :: runner .......................... SUCCESS [27.526s]
[INFO] jclouds :: cli :: assembly ........................ FAILURE [8.326s]
[INFO] Apache jclouds :: cli ............................. SKIPPED
[INFO] ------------------------------------------------------------------------
[INFO] BUILD FAILURE
[INFO] ------------------------------------------------------------------------
[INFO] Total time: 51.594s
[INFO] Finished at: Fri Apr 07 23:29:05 EDT 2017
[INFO] Final Memory: 51M/272M
[INFO] ------------------------------------------------------------------------
Waiting for Jenkins to finish collecting data
[ERROR] Failed to execute goal org.apache.karaf.tooling:features-maven-plugin:2.3.11:add-features-to-repo
(add-features-to-repo) on project jclouds-cli-assembly: Error populating repository: Unable
to find the feature 'jclouds-api-cloudsigma2' -> [Help 1]
org.apache.maven.lifecycle.LifecycleExecutionException: Failed to execute goal org.apache.karaf.tooling:features-maven-plugin:2.3.11:add-features-to-repo
(add-features-to-repo) on project jclouds-cli-assembly: Error populating repository
	at org.apache.maven.lifecycle.internal.MojoExecutor.execute(MojoExecutor.java:217)
	at org.apache.maven.lifecycle.internal.MojoExecutor.execute(MojoExecutor.java:153)
	at org.apache.maven.lifecycle.internal.MojoExecutor.execute(MojoExecutor.java:145)
	at org.apache.maven.lifecycle.internal.LifecycleModuleBuilder.buildProject(LifecycleModuleBuilder.java:84)
	at org.apache.maven.lifecycle.internal.LifecycleModuleBuilder.buildProject(LifecycleModuleBuilder.java:59)
	at org.apache.maven.lifecycle.internal.LifecycleStarter.singleThreadedBuild(LifecycleStarter.java:183)
	at org.apache.maven.lifecycle.internal.LifecycleStarter.execute(LifecycleStarter.java:161)
	at org.apache.maven.DefaultMaven.doExecute(DefaultMaven.java:320)
	at org.apache.maven.DefaultMaven.execute(DefaultMaven.java:156)
	at org.jvnet.hudson.maven3.launcher.Maven3Launcher.main(Maven3Launcher.java:117)
	at sun.reflect.NativeMethodAccessorImpl.invoke0(Native Method)
	at sun.reflect.NativeMethodAccessorImpl.invoke(NativeMethodAccessorImpl.java:57)
	at sun.reflect.DelegatingMethodAccessorImpl.invoke(DelegatingMethodAccessorImpl.java:43)
	at java.lang.reflect.Method.invoke(Method.java:606)
	at org.codehaus.plexus.classworlds.launcher.Launcher.launchStandard(Launcher.java:329)
	at org.codehaus.plexus.classworlds.launcher.Launcher.launch(Launcher.java:239)
	at org.jvnet.hudson.maven3.agent.Maven3Main.launch(Maven3Main.java:181)
	at sun.reflect.NativeMethodAccessorImpl.invoke0(Native Method)
	at sun.reflect.NativeMethodAccessorImpl.invoke(NativeMethodAccessorImpl.java:57)
	at sun.reflect.DelegatingMethodAccessorImpl.invoke(DelegatingMethodAccessorImpl.java:43)
	at java.lang.reflect.Method.invoke(Method.java:606)
	at hudson.maven.Maven3Builder.call(Maven3Builder.java:139)
	at hudson.maven.Maven3Builder.call(Maven3Builder.java:70)
	at hudson.remoting.UserRequest.perform(UserRequest.java:153)
	at hudson.remoting.UserRequest.perform(UserRequest.java:50)
	at hudson.remoting.Request$2.run(Request.java:336)
	at hudson.remoting.InterceptingExecutorService$1.call(InterceptingExecutorService.java:68)
	at java.util.concurrent.FutureTask.run(FutureTask.java:262)
	at java.util.concurrent.ThreadPoolExecutor.runWorker(ThreadPoolExecutor.java:1145)
	at java.util.concurrent.ThreadPoolExecutor$Worker.run(ThreadPoolExecutor.java:615)
	at java.lang.Thread.run(Thread.java:745)
Caused by: org.apache.maven.plugin.MojoExecutionException: Error populating repository
	at org.apache.karaf.tooling.features.AddFeaturesToRepoMojo.execute(AddFeaturesToRepoMojo.java:226)
	at org.apache.maven.plugin.DefaultBuildPluginManager.executeMojo(DefaultBuildPluginManager.java:101)
	at org.apache.maven.lifecycle.internal.MojoExecutor.execute(MojoExecutor.java:209)
	... 30 more
Caused by: java.lang.IllegalArgumentException: Unable to find the feature 'jclouds-api-cloudsigma2'
	at org.apache.karaf.tooling.features.AddFeaturesToRepoMojo.addFeatures(AddFeaturesToRepoMojo.java:328)
	at org.apache.karaf.tooling.features.AddFeaturesToRepoMojo.execute(AddFeaturesToRepoMojo.java:165)
	... 32 more
[ERROR] 
[ERROR] Re-run Maven using the -X switch to enable full debug logging.
[ERROR] 
[ERROR] For more information about the errors and possible solutions, please read the following
articles:
[ERROR] [Help 1] http://cwiki.apache.org/confluence/display/MAVEN/MojoExecutionException
[ERROR] 
[ERROR] After correcting the problems, you can resume the build with the command
[ERROR]   mvn <goals> -rf :jclouds-cli-assembly
[JENKINS] Archiving <https://jclouds.ci.cloudbees.com/job/jclouds-cli/ws/branding/pom.xml>
to org.apache.jclouds.cli/jclouds-cli-branding/2.1.0-SNAPSHOT/jclouds-cli-branding-2.1.0-SNAPSHOT.pom
[JENKINS] Archiving <https://jclouds.ci.cloudbees.com/job/jclouds-cli/ws/branding/target/jclouds-cli-branding-2.1.0-SNAPSHOT.jar>
to org.apache.jclouds.cli/jclouds-cli-branding/2.1.0-20170408.032827-69/jclouds-cli-branding-2.1.0-20170408.032827-69.jar
[JENKINS] Archiving <https://jclouds.ci.cloudbees.com/job/jclouds-cli/ws/branding/target/jclouds-cli-branding-2.1.0-SNAPSHOT-tests.jar>
to org.apache.jclouds.cli/jclouds-cli-branding/2.1.0-20170408.032827-69/jclouds-cli-branding-2.1.0-20170408.032827-69-tests.jar
[JENKINS] Archiving <https://jclouds.ci.cloudbees.com/job/jclouds-cli/ws/branding/target/jclouds-cli-branding-2.1.0-SNAPSHOT-sources.jar>
to org.apache.jclouds.cli/jclouds-cli-branding/2.1.0-20170408.032827-69/jclouds-cli-branding-2.1.0-20170408.032827-69-sources.jar
[JENKINS] Archiving <https://jclouds.ci.cloudbees.com/job/jclouds-cli/ws/branding/target/jclouds-cli-branding-2.1.0-SNAPSHOT-test-sources.jar>
to org.apache.jclouds.cli/jclouds-cli-branding/2.1.0-20170408.032827-69/jclouds-cli-branding-2.1.0-20170408.032827-69-test-sources.jar
[JENKINS] Archiving <https://jclouds.ci.cloudbees.com/job/jclouds-cli/ws/assembly/pom.xml>
to org.apache.jclouds.cli/jclouds-cli-assembly/2.1.0-SNAPSHOT/jclouds-cli-assembly-2.1.0-SNAPSHOT.pom
[JENKINS] Archiving <https://jclouds.ci.cloudbees.com/job/jclouds-cli/ws/pom.xml> to
org.apache.jclouds.cli/jclouds-cli/2.1.0-SNAPSHOT/jclouds-cli-2.1.0-SNAPSHOT.pom
[JENKINS] Archiving <https://jclouds.ci.cloudbees.com/job/jclouds-cli/ws/runner/pom.xml>
to org.apache.jclouds.cli/jclouds-cli-runner/2.1.0-SNAPSHOT/jclouds-cli-runner-2.1.0-SNAPSHOT.pom
[JENKINS] Archiving <https://jclouds.ci.cloudbees.com/job/jclouds-cli/ws/runner/target/jclouds-cli-runner-2.1.0-SNAPSHOT.jar>
to org.apache.jclouds.cli/jclouds-cli-runner/2.1.0-20170408.032855-67/jclouds-cli-runner-2.1.0-20170408.032855-67.jar
[JENKINS] Archiving <https://jclouds.ci.cloudbees.com/job/jclouds-cli/ws/runner/target/jclouds-cli-runner-2.1.0-SNAPSHOT-tests.jar>
to org.apache.jclouds.cli/jclouds-cli-runner/2.1.0-20170408.032855-67/jclouds-cli-runner-2.1.0-20170408.032855-67-tests.jar
[JENKINS] Archiving <https://jclouds.ci.cloudbees.com/job/jclouds-cli/ws/runner/target/jclouds-cli-runner-2.1.0-SNAPSHOT-javadoc.jar>
to org.apache.jclouds.cli/jclouds-cli-runner/2.1.0-20170408.032855-67/jclouds-cli-runner-2.1.0-20170408.032855-67-javadoc.jar
[JENKINS] Archiving <https://jclouds.ci.cloudbees.com/job/jclouds-cli/ws/runner/target/jclouds-cli-runner-2.1.0-SNAPSHOT-sources.jar>
to org.apache.jclouds.cli/jclouds-cli-runner/2.1.0-20170408.032855-67/jclouds-cli-runner-2.1.0-20170408.032855-67-sources.jar
[JENKINS] Archiving <https://jclouds.ci.cloudbees.com/job/jclouds-cli/ws/runner/target/jclouds-cli-runner-2.1.0-SNAPSHOT-test-sources.jar>
to org.apache.jclouds.cli/jclouds-cli-runner/2.1.0-20170408.032855-67/jclouds-cli-runner-2.1.0-20170408.032855-67-test-sources.jar
[JENKINS] Archiving <https://jclouds.ci.cloudbees.com/job/jclouds-cli/ws/project/pom.xml>
to org.apache.jclouds.cli/jclouds-cli-project/2.1.0-SNAPSHOT/jclouds-cli-project-2.1.0-SNAPSHOT.pom
[JENKINS] Archiving <https://jclouds.ci.cloudbees.com/job/jclouds-cli/ws/project/target/jclouds-cli-project-2.1.0-SNAPSHOT-tests.jar>
to org.apache.jclouds.cli/jclouds-cli-project/2.1.0-20170408.032823-69/jclouds-cli-project-2.1.0-20170408.032823-69-tests.jar
channel stopped
Started calculate disk usage of build
Finished Calculation of disk usage of build in 0 seconds
Started calculate disk usage of workspace
Finished Calculation of disk usage of workspace in 0 seconds

Mime
View raw message