jclouds-notifications mailing list archives

Site index · List index
Message view « Date » · « Thread »
Top « Date » · « Thread »
From jenkins-no-re...@cloudbees.com
Subject Build failed in Jenkins: jclouds-cli #1316
Date Sat, 08 Apr 2017 23:14:47 GMT
See <https://jclouds.ci.cloudbees.com/job/jclouds-cli/1316/display/redirect>

------------------------------------------
[...truncated 59.29 KB...]
Compiler warnings:
  WARNING:  'org.apache.xerces.jaxp.SAXParserImpl: Property 'http://javax.xml.XMLConstants/property/accessExternalDTD'
is not recognized.'
Warning:  org.apache.xerces.parsers.SAXParser: Feature 'http://javax.xml.XMLConstants/feature/secure-processing'
is not recognized.
Warning:  org.apache.xerces.parsers.SAXParser: Property 'http://javax.xml.XMLConstants/property/accessExternalDTD'
is not recognized.
Warning:  org.apache.xerces.parsers.SAXParser: Property 'http://www.oracle.com/xml/jaxp/properties/entityExpansionLimit'
is not recognized.
[INFO] Rat check: Summary of files. Unapproved: 0 unknown: 0 generated: 0 approved: 2 licence.
[INFO] 
[INFO] --- maven-jar-plugin:2.4:test-jar (default) @ jclouds-cli-runner ---
[INFO] Building jar: <https://jclouds.ci.cloudbees.com/job/jclouds-cli/ws/runner/target/jclouds-cli-runner-2.1.0-SNAPSHOT-tests.jar>
[INFO] 
[INFO] --- maven-javadoc-plugin:2.9:jar (javadoc) @ jclouds-cli-runner ---
[INFO] 
2 warnings
[WARNING] Javadoc Warnings
[WARNING] <https://jclouds.ci.cloudbees.com/job/jclouds-cli/ws/runner/src/main/java/org/jclouds/cli/runner/Main.java>:317:
warning - @return tag has no arguments.
[WARNING] <https://jclouds.ci.cloudbees.com/job/jclouds-cli/ws/runner/src/main/java/org/jclouds/cli/runner/Main.java>:327:
warning - @return tag has no arguments.
[INFO] Building jar: <https://jclouds.ci.cloudbees.com/job/jclouds-cli/ws/runner/target/jclouds-cli-runner-2.1.0-SNAPSHOT-javadoc.jar>
[INFO] 
[INFO] --- maven-source-plugin:2.2:jar-no-fork (attach-sources) @ jclouds-cli-runner ---
[INFO] Building jar: <https://jclouds.ci.cloudbees.com/job/jclouds-cli/ws/runner/target/jclouds-cli-runner-2.1.0-SNAPSHOT-sources.jar>
[INFO] 
[INFO] --- maven-source-plugin:2.2:test-jar-no-fork (attach-sources) @ jclouds-cli-runner
---
[INFO] Building jar: <https://jclouds.ci.cloudbees.com/job/jclouds-cli/ws/runner/target/jclouds-cli-runner-2.1.0-SNAPSHOT-test-sources.jar>
[INFO] 
[INFO] --- maven-surefire-plugin:2.17:test (integration) @ jclouds-cli-runner ---
[JENKINS] Recording test results
[INFO] 
[INFO] --- duplicate-finder-maven-plugin:1.1.1:check (default) @ jclouds-cli-runner ---
[INFO] Skipping duplicate-finder execution!
[INFO] 
[INFO] --- maven-checkstyle-plugin:2.15:check (default) @ jclouds-cli-runner ---
[INFO] 
[INFO] --- modernizer-maven-plugin:1.4.0:modernizer (modernizer) @ jclouds-cli-runner ---
[INFO] 
[INFO] --- maven-install-plugin:2.4:install (default-install) @ jclouds-cli-runner ---
[INFO] Installing <https://jclouds.ci.cloudbees.com/job/jclouds-cli/ws/runner/target/jclouds-cli-runner-2.1.0-SNAPSHOT.jar>
to /home/jenkins/.m2/repository/org/apache/jclouds/cli/jclouds-cli-runner/2.1.0-SNAPSHOT/jclouds-cli-runner-2.1.0-SNAPSHOT.jar
[INFO] Installing <https://jclouds.ci.cloudbees.com/job/jclouds-cli/ws/runner/pom.xml>
to /home/jenkins/.m2/repository/org/apache/jclouds/cli/jclouds-cli-runner/2.1.0-SNAPSHOT/jclouds-cli-runner-2.1.0-SNAPSHOT.pom
[INFO] Installing <https://jclouds.ci.cloudbees.com/job/jclouds-cli/ws/runner/target/jclouds-cli-runner-2.1.0-SNAPSHOT-tests.jar>
to /home/jenkins/.m2/repository/org/apache/jclouds/cli/jclouds-cli-runner/2.1.0-SNAPSHOT/jclouds-cli-runner-2.1.0-SNAPSHOT-tests.jar
[INFO] Installing <https://jclouds.ci.cloudbees.com/job/jclouds-cli/ws/runner/target/jclouds-cli-runner-2.1.0-SNAPSHOT-javadoc.jar>
to /home/jenkins/.m2/repository/org/apache/jclouds/cli/jclouds-cli-runner/2.1.0-SNAPSHOT/jclouds-cli-runner-2.1.0-SNAPSHOT-javadoc.jar
[INFO] Installing <https://jclouds.ci.cloudbees.com/job/jclouds-cli/ws/runner/target/jclouds-cli-runner-2.1.0-SNAPSHOT-sources.jar>
to /home/jenkins/.m2/repository/org/apache/jclouds/cli/jclouds-cli-runner/2.1.0-SNAPSHOT/jclouds-cli-runner-2.1.0-SNAPSHOT-sources.jar
[INFO] Installing <https://jclouds.ci.cloudbees.com/job/jclouds-cli/ws/runner/target/jclouds-cli-runner-2.1.0-SNAPSHOT-test-sources.jar>
to /home/jenkins/.m2/repository/org/apache/jclouds/cli/jclouds-cli-runner/2.1.0-SNAPSHOT/jclouds-cli-runner-2.1.0-SNAPSHOT-test-sources.jar
[INFO] 
[INFO] --- maven-deploy-plugin:2.7:deploy (default-deploy) @ jclouds-cli-runner ---
Downloading: https://repository.apache.org/content/repositories/snapshots/org/apache/jclouds/cli/jclouds-cli-runner/2.1.0-SNAPSHOT/maven-metadata.xml
Downloaded: https://repository.apache.org/content/repositories/snapshots/org/apache/jclouds/cli/jclouds-cli-runner/2.1.0-SNAPSHOT/maven-metadata.xml
(2 KB at 26.1 KB/sec)
Uploading: https://repository.apache.org/content/repositories/snapshots/org/apache/jclouds/cli/jclouds-cli-runner/2.1.0-SNAPSHOT/jclouds-cli-runner-2.1.0-20170408.231436-69.jar
Uploaded: https://repository.apache.org/content/repositories/snapshots/org/apache/jclouds/cli/jclouds-cli-runner/2.1.0-SNAPSHOT/jclouds-cli-runner-2.1.0-20170408.231436-69.jar
(20 KB at 191.3 KB/sec)
Uploading: https://repository.apache.org/content/repositories/snapshots/org/apache/jclouds/cli/jclouds-cli-runner/2.1.0-SNAPSHOT/jclouds-cli-runner-2.1.0-20170408.231436-69.pom
Uploaded: https://repository.apache.org/content/repositories/snapshots/org/apache/jclouds/cli/jclouds-cli-runner/2.1.0-SNAPSHOT/jclouds-cli-runner-2.1.0-20170408.231436-69.pom
(3 KB at 23.4 KB/sec)
Downloading: https://repository.apache.org/content/repositories/snapshots/org/apache/jclouds/cli/jclouds-cli-runner/maven-metadata.xml
Downloaded: https://repository.apache.org/content/repositories/snapshots/org/apache/jclouds/cli/jclouds-cli-runner/maven-metadata.xml
(440 B at 10.5 KB/sec)
Uploading: https://repository.apache.org/content/repositories/snapshots/org/apache/jclouds/cli/jclouds-cli-runner/2.1.0-SNAPSHOT/maven-metadata.xml
Uploaded: https://repository.apache.org/content/repositories/snapshots/org/apache/jclouds/cli/jclouds-cli-runner/2.1.0-SNAPSHOT/maven-metadata.xml
(2 KB at 20.0 KB/sec)
Uploading: https://repository.apache.org/content/repositories/snapshots/org/apache/jclouds/cli/jclouds-cli-runner/maven-metadata.xml
Uploaded: https://repository.apache.org/content/repositories/snapshots/org/apache/jclouds/cli/jclouds-cli-runner/maven-metadata.xml
(440 B at 5.4 KB/sec)
Uploading: https://repository.apache.org/content/repositories/snapshots/org/apache/jclouds/cli/jclouds-cli-runner/2.1.0-SNAPSHOT/jclouds-cli-runner-2.1.0-20170408.231436-69-tests.jar
Uploaded: https://repository.apache.org/content/repositories/snapshots/org/apache/jclouds/cli/jclouds-cli-runner/2.1.0-SNAPSHOT/jclouds-cli-runner-2.1.0-20170408.231436-69-tests.jar
(9 KB at 116.4 KB/sec)
Uploading: https://repository.apache.org/content/repositories/snapshots/org/apache/jclouds/cli/jclouds-cli-runner/2.1.0-SNAPSHOT/maven-metadata.xml
Uploaded: https://repository.apache.org/content/repositories/snapshots/org/apache/jclouds/cli/jclouds-cli-runner/2.1.0-SNAPSHOT/maven-metadata.xml
(2 KB at 19.0 KB/sec)
Uploading: https://repository.apache.org/content/repositories/snapshots/org/apache/jclouds/cli/jclouds-cli-runner/2.1.0-SNAPSHOT/jclouds-cli-runner-2.1.0-20170408.231436-69-javadoc.jar
Uploaded: https://repository.apache.org/content/repositories/snapshots/org/apache/jclouds/cli/jclouds-cli-runner/2.1.0-SNAPSHOT/jclouds-cli-runner-2.1.0-20170408.231436-69-javadoc.jar
(47 KB at 497.3 KB/sec)
Uploading: https://repository.apache.org/content/repositories/snapshots/org/apache/jclouds/cli/jclouds-cli-runner/2.1.0-SNAPSHOT/maven-metadata.xml
Uploaded: https://repository.apache.org/content/repositories/snapshots/org/apache/jclouds/cli/jclouds-cli-runner/2.1.0-SNAPSHOT/maven-metadata.xml
(2 KB at 22.5 KB/sec)
Uploading: https://repository.apache.org/content/repositories/snapshots/org/apache/jclouds/cli/jclouds-cli-runner/2.1.0-SNAPSHOT/jclouds-cli-runner-2.1.0-20170408.231436-69-sources.jar
Uploaded: https://repository.apache.org/content/repositories/snapshots/org/apache/jclouds/cli/jclouds-cli-runner/2.1.0-SNAPSHOT/jclouds-cli-runner-2.1.0-20170408.231436-69-sources.jar
(13 KB at 142.5 KB/sec)
Uploading: https://repository.apache.org/content/repositories/snapshots/org/apache/jclouds/cli/jclouds-cli-runner/2.1.0-SNAPSHOT/maven-metadata.xml
Uploaded: https://repository.apache.org/content/repositories/snapshots/org/apache/jclouds/cli/jclouds-cli-runner/2.1.0-SNAPSHOT/maven-metadata.xml
(2 KB at 22.5 KB/sec)
Uploading: https://repository.apache.org/content/repositories/snapshots/org/apache/jclouds/cli/jclouds-cli-runner/2.1.0-SNAPSHOT/jclouds-cli-runner-2.1.0-20170408.231436-69-test-sources.jar
Uploaded: https://repository.apache.org/content/repositories/snapshots/org/apache/jclouds/cli/jclouds-cli-runner/2.1.0-SNAPSHOT/jclouds-cli-runner-2.1.0-20170408.231436-69-test-sources.jar
(7 KB at 87.8 KB/sec)
Uploading: https://repository.apache.org/content/repositories/snapshots/org/apache/jclouds/cli/jclouds-cli-runner/2.1.0-SNAPSHOT/maven-metadata.xml
Uploaded: https://repository.apache.org/content/repositories/snapshots/org/apache/jclouds/cli/jclouds-cli-runner/2.1.0-SNAPSHOT/maven-metadata.xml
(2 KB at 22.5 KB/sec)
Started calculate disk usage of build
Finished Calculation of disk usage of build in 0 seconds
Started calculate disk usage of workspace
Finished Calculation of disk usage of workspace in 0 seconds
[INFO]                                                                         
[INFO] ------------------------------------------------------------------------
[INFO] Building jclouds :: cli :: assembly 2.1.0-SNAPSHOT
[INFO] ------------------------------------------------------------------------
[INFO] 
[INFO] --- maven-clean-plugin:2.5:clean (default-clean) @ jclouds-cli-assembly ---
[INFO] 
[INFO] --- maven-enforcer-plugin:1.1.1:enforce (enforce-banned-dependencies) @ jclouds-cli-assembly
---
[INFO] 
[INFO] --- maven-enforcer-plugin:1.1.1:enforce (enforce-java) @ jclouds-cli-assembly ---
[INFO] 
[INFO] --- maven-remote-resources-plugin:1.5:process (default) @ jclouds-cli-assembly ---
[INFO] 
[INFO] --- maven-resources-plugin:2.4.2:resources (filter) @ jclouds-cli-assembly ---
[INFO] Using 'UTF-8' encoding to copy filtered resources.
[INFO] skip non existing resourceDirectory <https://jclouds.ci.cloudbees.com/job/jclouds-cli/ws/assembly/src/main/resources>
[INFO] Copying 13 resources
[INFO] Copying 3 resources
[INFO] 
[INFO] --- maven-dependency-plugin:2.8:unpack (unpack-unix) @ jclouds-cli-assembly ---
[INFO] Configured Artifact: org.apache.karaf:apache-karaf:minimal:2.3.11:tar.gz
[INFO] Unpacking /home/jenkins/.m2/repository/org/apache/karaf/apache-karaf/2.3.11/apache-karaf-2.3.11-minimal.tar.gz
to <https://jclouds.ci.cloudbees.com/job/jclouds-cli/ws/assembly/target/dependencies/unix>
with includes "" and excludes ""
[INFO] Expanding: /home/jenkins/.m2/repository/org/apache/karaf/apache-karaf/2.3.11/apache-karaf-2.3.11-minimal.tar.gz
into <https://jclouds.ci.cloudbees.com/job/jclouds-cli/ws/assembly/target/dependencies/unix>
[INFO] 
[INFO] --- maven-dependency-plugin:2.8:unpack (unpack-win) @ jclouds-cli-assembly ---
[INFO] Configured Artifact: org.apache.karaf:apache-karaf:minimal:2.3.11:zip
[INFO] Unpacking /home/jenkins/.m2/repository/org/apache/karaf/apache-karaf/2.3.11/apache-karaf-2.3.11-minimal.zip
to <https://jclouds.ci.cloudbees.com/job/jclouds-cli/ws/assembly/target/dependencies/win>
with includes "" and excludes ""
[INFO] 
[INFO] --- maven-resources-plugin:2.4.2:resources (default-resources) @ jclouds-cli-assembly
---
[INFO] Using 'UTF-8' encoding to copy filtered resources.
[INFO] skip non existing resourceDirectory <https://jclouds.ci.cloudbees.com/job/jclouds-cli/ws/assembly/src/main/resources>
[INFO] Copying 13 resources
[INFO] Copying 3 resources
[INFO] 
[INFO] --- maven-compiler-plugin:3.1:compile (default-compile) @ jclouds-cli-assembly ---
[INFO] No sources to compile
[INFO] 
[INFO] --- maven-enforcer-plugin:1.1.1:enforce (enforce-banned-dependencies) @ jclouds-cli-assembly
---
[INFO] 
[INFO] --- maven-enforcer-plugin:1.1.1:enforce (enforce-java) @ jclouds-cli-assembly ---
[INFO] 
[INFO] --- maven-remote-resources-plugin:1.5:process (default) @ jclouds-cli-assembly ---
[INFO] 
[INFO] --- maven-resources-plugin:2.4.2:resources (filter) @ jclouds-cli-assembly ---
[INFO] Using 'UTF-8' encoding to copy filtered resources.
[INFO] skip non existing resourceDirectory <https://jclouds.ci.cloudbees.com/job/jclouds-cli/ws/assembly/src/main/resources>
[INFO] Copying 13 resources
[INFO] Copying 3 resources
[INFO] Copying 3 resources
[INFO] 
[INFO] --- maven-dependency-plugin:2.8:unpack (unpack-unix) @ jclouds-cli-assembly ---
[INFO] Configured Artifact: org.apache.karaf:apache-karaf:minimal:2.3.11:tar.gz
[INFO] apache-karaf-2.3.11-minimal.tar.gz already unpacked.
[INFO] 
[INFO] --- maven-dependency-plugin:2.8:unpack (unpack-win) @ jclouds-cli-assembly ---
[INFO] Configured Artifact: org.apache.karaf:apache-karaf:minimal:2.3.11:zip
[INFO] apache-karaf-2.3.11-minimal.zip already unpacked.
[INFO] 
[INFO] --- maven-resources-plugin:2.4.2:resources (default-resources) @ jclouds-cli-assembly
---
[INFO] Using 'UTF-8' encoding to copy filtered resources.
[INFO] skip non existing resourceDirectory <https://jclouds.ci.cloudbees.com/job/jclouds-cli/ws/assembly/src/main/resources>
[INFO] Copying 13 resources
[INFO] Copying 3 resources
[INFO] Copying 3 resources
[INFO] 
[INFO] --- maven-compiler-plugin:3.1:compile (default-compile) @ jclouds-cli-assembly ---
[INFO] No sources to compile
[WARNING] Failed to getClass for org.apache.karaf.tooling.features.AddFeaturesToRepoMojo
[INFO] 
[INFO] --- features-maven-plugin:2.3.11:add-features-to-repo (add-features-to-repo) @ jclouds-cli-assembly
---
[INFO] Copying bundle: org.apache.karaf.assemblies.features:standard:xml:features:2.3.11
[INFO] Copying bundle: org.apache.karaf.assemblies.features:enterprise:xml:features:2.3.11
[INFO] Copying bundle: org.apache.karaf.assemblies.features:enterprise:xml:features:2.3.11
[INFO] Copying bundle: org.ops4j.pax.cdi:pax-cdi-features:xml:features:0.8.0
[INFO] Copying bundle: org.apache.karaf.assemblies.features:standard:xml:features:2.3.11
[INFO] Copying bundle: org.apache.karaf.assemblies.features:standard:xml:features:2.3.11
[INFO] Copying bundle: org.apache.jclouds.karaf:jclouds-karaf:xml:features:2.1.0-SNAPSHOT
Downloading: https://repository-jclouds.forge.cloudbees.com/snapshot/org/apache/jclouds/karaf/jclouds-karaf/2.1.0-SNAPSHOT/maven-metadata.xml
Downloading: http://repository.apache.org/snapshots/org/apache/jclouds/karaf/jclouds-karaf/2.1.0-SNAPSHOT/maven-metadata.xml
Downloading: https://repository.apache.org/content/repositories/snapshots/org/apache/jclouds/karaf/jclouds-karaf/2.1.0-SNAPSHOT/maven-metadata.xml
Downloaded: http://repository.apache.org/snapshots/org/apache/jclouds/karaf/jclouds-karaf/2.1.0-SNAPSHOT/maven-metadata.xml
(2 KB at 31.7 KB/sec)
Downloaded: https://repository.apache.org/content/repositories/snapshots/org/apache/jclouds/karaf/jclouds-karaf/2.1.0-SNAPSHOT/maven-metadata.xml
(2 KB at 27.4 KB/sec)
Downloading: https://repository.apache.org/content/repositories/snapshots/org/apache/jclouds/karaf/jclouds-karaf/2.1.0-SNAPSHOT/jclouds-karaf-2.1.0-20170408.230025-99-features.xml
Downloaded: https://repository.apache.org/content/repositories/snapshots/org/apache/jclouds/karaf/jclouds-karaf/2.1.0-SNAPSHOT/jclouds-karaf-2.1.0-20170408.230025-99-features.xml
(43 KB at 917.2 KB/sec)
Started calculate disk usage of build
Finished Calculation of disk usage of build in 0 seconds
Started calculate disk usage of workspace
Finished Calculation of disk usage of workspace in 0 seconds
[INFO] ------------------------------------------------------------------------
[INFO] Reactor Summary:
[INFO] 
[INFO] Apache jclouds :: cli ............................. SUCCESS [7.596s]
[INFO] jclouds :: cli :: branding ........................ SUCCESS [4.454s]
[INFO] jclouds :: cli :: runner .......................... SUCCESS [23.745s]
[INFO] jclouds :: cli :: assembly ........................ FAILURE [7.029s]
[INFO] Apache jclouds :: cli ............................. SKIPPED
[INFO] ------------------------------------------------------------------------
[INFO] BUILD FAILURE
[INFO] ------------------------------------------------------------------------
[INFO] Total time: 45.886s
[INFO] Finished at: Sat Apr 08 19:14:45 EDT 2017
[INFO] Final Memory: 51M/248M
[INFO] ------------------------------------------------------------------------
Waiting for Jenkins to finish collecting data
[ERROR] Failed to execute goal org.apache.karaf.tooling:features-maven-plugin:2.3.11:add-features-to-repo
(add-features-to-repo) on project jclouds-cli-assembly: Error populating repository: Unable
to find the feature 'jclouds-api-cloudsigma2' -> [Help 1]
org.apache.maven.lifecycle.LifecycleExecutionException: Failed to execute goal org.apache.karaf.tooling:features-maven-plugin:2.3.11:add-features-to-repo
(add-features-to-repo) on project jclouds-cli-assembly: Error populating repository
	at org.apache.maven.lifecycle.internal.MojoExecutor.execute(MojoExecutor.java:217)
	at org.apache.maven.lifecycle.internal.MojoExecutor.execute(MojoExecutor.java:153)
	at org.apache.maven.lifecycle.internal.MojoExecutor.execute(MojoExecutor.java:145)
	at org.apache.maven.lifecycle.internal.LifecycleModuleBuilder.buildProject(LifecycleModuleBuilder.java:84)
	at org.apache.maven.lifecycle.internal.LifecycleModuleBuilder.buildProject(LifecycleModuleBuilder.java:59)
	at org.apache.maven.lifecycle.internal.LifecycleStarter.singleThreadedBuild(LifecycleStarter.java:183)
	at org.apache.maven.lifecycle.internal.LifecycleStarter.execute(LifecycleStarter.java:161)
	at org.apache.maven.DefaultMaven.doExecute(DefaultMaven.java:320)
	at org.apache.maven.DefaultMaven.execute(DefaultMaven.java:156)
	at org.jvnet.hudson.maven3.launcher.Maven3Launcher.main(Maven3Launcher.java:117)
	at sun.reflect.NativeMethodAccessorImpl.invoke0(Native Method)
	at sun.reflect.NativeMethodAccessorImpl.invoke(NativeMethodAccessorImpl.java:57)
	at sun.reflect.DelegatingMethodAccessorImpl.invoke(DelegatingMethodAccessorImpl.java:43)
	at java.lang.reflect.Method.invoke(Method.java:606)
	at org.codehaus.plexus.classworlds.launcher.Launcher.launchStandard(Launcher.java:329)
	at org.codehaus.plexus.classworlds.launcher.Launcher.launch(Launcher.java:239)
	at org.jvnet.hudson.maven3.agent.Maven3Main.launch(Maven3Main.java:181)
	at sun.reflect.NativeMethodAccessorImpl.invoke0(Native Method)
	at sun.reflect.NativeMethodAccessorImpl.invoke(NativeMethodAccessorImpl.java:57)
	at sun.reflect.DelegatingMethodAccessorImpl.invoke(DelegatingMethodAccessorImpl.java:43)
	at java.lang.reflect.Method.invoke(Method.java:606)
	at hudson.maven.Maven3Builder.call(Maven3Builder.java:139)
	at hudson.maven.Maven3Builder.call(Maven3Builder.java:70)
	at hudson.remoting.UserRequest.perform(UserRequest.java:153)
	at hudson.remoting.UserRequest.perform(UserRequest.java:50)
	at hudson.remoting.Request$2.run(Request.java:336)
	at hudson.remoting.InterceptingExecutorService$1.call(InterceptingExecutorService.java:68)
	at java.util.concurrent.FutureTask.run(FutureTask.java:262)
	at java.util.concurrent.ThreadPoolExecutor.runWorker(ThreadPoolExecutor.java:1145)
	at java.util.concurrent.ThreadPoolExecutor$Worker.run(ThreadPoolExecutor.java:615)
	at java.lang.Thread.run(Thread.java:745)
Caused by: org.apache.maven.plugin.MojoExecutionException: Error populating repository
	at org.apache.karaf.tooling.features.AddFeaturesToRepoMojo.execute(AddFeaturesToRepoMojo.java:226)
	at org.apache.maven.plugin.DefaultBuildPluginManager.executeMojo(DefaultBuildPluginManager.java:101)
	at org.apache.maven.lifecycle.internal.MojoExecutor.execute(MojoExecutor.java:209)
	... 30 more
Caused by: java.lang.IllegalArgumentException: Unable to find the feature 'jclouds-api-cloudsigma2'
	at org.apache.karaf.tooling.features.AddFeaturesToRepoMojo.addFeatures(AddFeaturesToRepoMojo.java:328)
	at org.apache.karaf.tooling.features.AddFeaturesToRepoMojo.execute(AddFeaturesToRepoMojo.java:165)
	... 32 more
[ERROR] 
[ERROR] Re-run Maven using the -X switch to enable full debug logging.
[ERROR] 
[ERROR] For more information about the errors and possible solutions, please read the following
articles:
[ERROR] [Help 1] http://cwiki.apache.org/confluence/display/MAVEN/MojoExecutionException
[ERROR] 
[ERROR] After correcting the problems, you can resume the build with the command
[ERROR]   mvn <goals> -rf :jclouds-cli-assembly
[JENKINS] Archiving <https://jclouds.ci.cloudbees.com/job/jclouds-cli/ws/branding/pom.xml>
to org.apache.jclouds.cli/jclouds-cli-branding/2.1.0-SNAPSHOT/jclouds-cli-branding-2.1.0-SNAPSHOT.pom
[JENKINS] Archiving <https://jclouds.ci.cloudbees.com/job/jclouds-cli/ws/branding/target/jclouds-cli-branding-2.1.0-SNAPSHOT.jar>
to org.apache.jclouds.cli/jclouds-cli-branding/2.1.0-20170408.231413-71/jclouds-cli-branding-2.1.0-20170408.231413-71.jar
[JENKINS] Archiving <https://jclouds.ci.cloudbees.com/job/jclouds-cli/ws/branding/target/jclouds-cli-branding-2.1.0-SNAPSHOT-tests.jar>
to org.apache.jclouds.cli/jclouds-cli-branding/2.1.0-20170408.231413-71/jclouds-cli-branding-2.1.0-20170408.231413-71-tests.jar
[JENKINS] Archiving <https://jclouds.ci.cloudbees.com/job/jclouds-cli/ws/branding/target/jclouds-cli-branding-2.1.0-SNAPSHOT-sources.jar>
to org.apache.jclouds.cli/jclouds-cli-branding/2.1.0-20170408.231413-71/jclouds-cli-branding-2.1.0-20170408.231413-71-sources.jar
[JENKINS] Archiving <https://jclouds.ci.cloudbees.com/job/jclouds-cli/ws/branding/target/jclouds-cli-branding-2.1.0-SNAPSHOT-test-sources.jar>
to org.apache.jclouds.cli/jclouds-cli-branding/2.1.0-20170408.231413-71/jclouds-cli-branding-2.1.0-20170408.231413-71-test-sources.jar
[JENKINS] Archiving <https://jclouds.ci.cloudbees.com/job/jclouds-cli/ws/assembly/pom.xml>
to org.apache.jclouds.cli/jclouds-cli-assembly/2.1.0-SNAPSHOT/jclouds-cli-assembly-2.1.0-SNAPSHOT.pom
[JENKINS] Archiving <https://jclouds.ci.cloudbees.com/job/jclouds-cli/ws/pom.xml> to
org.apache.jclouds.cli/jclouds-cli/2.1.0-SNAPSHOT/jclouds-cli-2.1.0-SNAPSHOT.pom
[JENKINS] Archiving <https://jclouds.ci.cloudbees.com/job/jclouds-cli/ws/runner/pom.xml>
to org.apache.jclouds.cli/jclouds-cli-runner/2.1.0-SNAPSHOT/jclouds-cli-runner-2.1.0-SNAPSHOT.pom
[JENKINS] Archiving <https://jclouds.ci.cloudbees.com/job/jclouds-cli/ws/runner/target/jclouds-cli-runner-2.1.0-SNAPSHOT.jar>
to org.apache.jclouds.cli/jclouds-cli-runner/2.1.0-20170408.231436-69/jclouds-cli-runner-2.1.0-20170408.231436-69.jar
[JENKINS] Archiving <https://jclouds.ci.cloudbees.com/job/jclouds-cli/ws/runner/target/jclouds-cli-runner-2.1.0-SNAPSHOT-tests.jar>
to org.apache.jclouds.cli/jclouds-cli-runner/2.1.0-20170408.231436-69/jclouds-cli-runner-2.1.0-20170408.231436-69-tests.jar
[JENKINS] Archiving <https://jclouds.ci.cloudbees.com/job/jclouds-cli/ws/runner/target/jclouds-cli-runner-2.1.0-SNAPSHOT-javadoc.jar>
to org.apache.jclouds.cli/jclouds-cli-runner/2.1.0-20170408.231436-69/jclouds-cli-runner-2.1.0-20170408.231436-69-javadoc.jar
[JENKINS] Archiving <https://jclouds.ci.cloudbees.com/job/jclouds-cli/ws/runner/target/jclouds-cli-runner-2.1.0-SNAPSHOT-sources.jar>
to org.apache.jclouds.cli/jclouds-cli-runner/2.1.0-20170408.231436-69/jclouds-cli-runner-2.1.0-20170408.231436-69-sources.jar
[JENKINS] Archiving <https://jclouds.ci.cloudbees.com/job/jclouds-cli/ws/runner/target/jclouds-cli-runner-2.1.0-SNAPSHOT-test-sources.jar>
to org.apache.jclouds.cli/jclouds-cli-runner/2.1.0-20170408.231436-69/jclouds-cli-runner-2.1.0-20170408.231436-69-test-sources.jar
[JENKINS] Archiving <https://jclouds.ci.cloudbees.com/job/jclouds-cli/ws/project/pom.xml>
to org.apache.jclouds.cli/jclouds-cli-project/2.1.0-SNAPSHOT/jclouds-cli-project-2.1.0-SNAPSHOT.pom
[JENKINS] Archiving <https://jclouds.ci.cloudbees.com/job/jclouds-cli/ws/project/target/jclouds-cli-project-2.1.0-SNAPSHOT-tests.jar>
to org.apache.jclouds.cli/jclouds-cli-project/2.1.0-20170408.231408-71/jclouds-cli-project-2.1.0-20170408.231408-71-tests.jar
channel stopped
Started calculate disk usage of build
Finished Calculation of disk usage of build in 0 seconds
Started calculate disk usage of workspace
Finished Calculation of disk usage of workspace in 0 seconds

Mime
View raw message