jclouds-notifications mailing list archives

Site index · List index
Message view « Date » · « Thread »
Top « Date » · « Thread »
From jenkins-no-re...@cloudbees.com
Subject Build failed in Jenkins: jclouds-karaf #2154
Date Mon, 24 Apr 2017 15:09:59 GMT
See <https://jclouds.ci.cloudbees.com/job/jclouds-karaf/2154/display/redirect>

------------------------------------------
[...truncated 328.24 KB...]
Downloaded: https://repo.cloudbees.com/content/repositories/central/com/google/google/5/google-5.pom
(3 KB at 12.2 KB/sec)
Downloading: https://repo.cloudbees.com/content/repositories/central/javax/inject/javax.inject/1/javax.inject-1.pom
Downloaded: https://repo.cloudbees.com/content/repositories/central/javax/inject/javax.inject/1/javax.inject-1.pom
(612 B at 5.5 KB/sec)
Downloading: https://repo.cloudbees.com/content/repositories/central/aopalliance/aopalliance/1.0/aopalliance-1.0.pom
Downloaded: https://repo.cloudbees.com/content/repositories/central/aopalliance/aopalliance/1.0/aopalliance-1.0.pom
(363 B at 23.6 KB/sec)
Downloading: https://repo.cloudbees.com/content/repositories/central/com/google/guava/guava/16.0.1/guava-16.0.1.pom
Downloaded: https://repo.cloudbees.com/content/repositories/central/com/google/guava/guava/16.0.1/guava-16.0.1.pom
(6 KB at 397.3 KB/sec)
Downloading: https://repo.cloudbees.com/content/repositories/central/com/google/guava/guava-parent/16.0.1/guava-parent-16.0.1.pom
Downloaded: https://repo.cloudbees.com/content/repositories/central/com/google/guava/guava-parent/16.0.1/guava-parent-16.0.1.pom
(8 KB at 511.7 KB/sec)
Downloading: https://repo.cloudbees.com/content/repositories/central/org/sonatype/oss/oss-parent/7/oss-parent-7.pom
Downloaded: https://repo.cloudbees.com/content/repositories/central/org/sonatype/oss/oss-parent/7/oss-parent-7.pom
(5 KB at 277.1 KB/sec)
Downloading: https://repository-jclouds.forge.cloudbees.com/snapshot/org/apache/jclouds/jclouds-core/2.1.0-SNAPSHOT/maven-metadata.xml
Downloading: https://oss.sonatype.org/content/repositories/releases/org/apache/jclouds/jclouds-core/2.1.0-SNAPSHOT/maven-metadata.xml
Downloading: https://repository.apache.org/content/repositories/snapshots/org/apache/jclouds/jclouds-core/2.1.0-SNAPSHOT/maven-metadata.xml
Downloading: http://download.java.net/maven/2/org/apache/jclouds/jclouds-core/2.1.0-SNAPSHOT/maven-metadata.xml
Downloading: http://repository.apache.org/snapshots/org/apache/jclouds/jclouds-core/2.1.0-SNAPSHOT/maven-metadata.xml
Downloaded: https://repository.apache.org/content/repositories/snapshots/org/apache/jclouds/jclouds-core/2.1.0-SNAPSHOT/maven-metadata.xml
(2 KB at 43.4 KB/sec)
Downloaded: http://repository.apache.org/snapshots/org/apache/jclouds/jclouds-core/2.1.0-SNAPSHOT/maven-metadata.xml
(2 KB at 48.7 KB/sec)
Downloading: https://repository-jclouds.forge.cloudbees.com/snapshot/org/apache/jclouds/jclouds-core/2.1.0-SNAPSHOT/jclouds-core-2.1.0-20170424.063436-64.pom
Downloading: https://repository.apache.org/content/repositories/snapshots/org/apache/jclouds/jclouds-core/2.1.0-SNAPSHOT/jclouds-core-2.1.0-20170424.063436-64.pom
Downloaded: https://repository.apache.org/content/repositories/snapshots/org/apache/jclouds/jclouds-core/2.1.0-SNAPSHOT/jclouds-core-2.1.0-20170424.063436-64.pom
(6 KB at 140.1 KB/sec)
Downloading: https://repository.apache.org/content/repositories/snapshots/org/apache/jclouds/jclouds-project/2.1.0-SNAPSHOT/maven-metadata.xml
Downloading: https://repository-jclouds.forge.cloudbees.com/snapshot/org/apache/jclouds/jclouds-project/2.1.0-SNAPSHOT/maven-metadata.xml
Downloading: https://oss.sonatype.org/content/repositories/releases/org/apache/jclouds/jclouds-project/2.1.0-SNAPSHOT/maven-metadata.xml
Downloading: http://download.java.net/maven/2/org/apache/jclouds/jclouds-project/2.1.0-SNAPSHOT/maven-metadata.xml
Downloading: http://repository.apache.org/snapshots/org/apache/jclouds/jclouds-project/2.1.0-SNAPSHOT/maven-metadata.xml
Downloaded: https://repository.apache.org/content/repositories/snapshots/org/apache/jclouds/jclouds-project/2.1.0-SNAPSHOT/maven-metadata.xml
(825 B at 20.1 KB/sec)
Downloaded: http://repository.apache.org/snapshots/org/apache/jclouds/jclouds-project/2.1.0-SNAPSHOT/maven-metadata.xml
(825 B at 20.7 KB/sec)
Downloading: https://repository.apache.org/content/repositories/snapshots/org/apache/jclouds/jclouds-project/2.1.0-SNAPSHOT/jclouds-project-2.1.0-20170424.063240-65.pom
Downloaded: https://repository.apache.org/content/repositories/snapshots/org/apache/jclouds/jclouds-project/2.1.0-SNAPSHOT/jclouds-project-2.1.0-20170424.063240-65.pom
(55 KB at 1292.6 KB/sec)
Downloading: https://repo.cloudbees.com/content/repositories/central/javax/ws/rs/javax.ws.rs-api/2.0.1/javax.ws.rs-api-2.0.1.pom
Downloaded: https://repo.cloudbees.com/content/repositories/central/javax/ws/rs/javax.ws.rs-api/2.0.1/javax.ws.rs-api-2.0.1.pom
(21 KB at 1045.6 KB/sec)
Downloading: https://repo.cloudbees.com/content/repositories/central/net/java/jvnet-parent/5/jvnet-parent-5.pom
Downloaded: https://repo.cloudbees.com/content/repositories/central/net/java/jvnet-parent/5/jvnet-parent-5.pom
(9 KB at 618.2 KB/sec)
Downloading: https://repo.cloudbees.com/content/repositories/central/com/google/inject/extensions/guice-assistedinject/3.0/guice-assistedinject-3.0.pom
Downloaded: https://repo.cloudbees.com/content/repositories/central/com/google/inject/extensions/guice-assistedinject/3.0/guice-assistedinject-3.0.pom
(549 B at 38.3 KB/sec)
Downloading: https://repo.cloudbees.com/content/repositories/central/com/google/inject/extensions/extensions-parent/3.0/extensions-parent-3.0.pom
Downloaded: https://repo.cloudbees.com/content/repositories/central/com/google/inject/extensions/extensions-parent/3.0/extensions-parent-3.0.pom
(4 KB at 234.7 KB/sec)
Downloading: https://repo.cloudbees.com/content/repositories/central/javax/annotation/jsr250-api/1.0/jsr250-api-1.0.pom
Downloaded: https://repo.cloudbees.com/content/repositories/central/javax/annotation/jsr250-api/1.0/jsr250-api-1.0.pom
(1023 B at 6.2 KB/sec)
Downloading: https://repo.cloudbees.com/content/repositories/central/com/google/code/gson/gson/2.5/gson-2.5.pom
Downloaded: https://repo.cloudbees.com/content/repositories/central/com/google/code/gson/gson/2.5/gson-2.5.pom
(9 KB at 50.9 KB/sec)
Downloading: https://oss.sonatype.org/content/repositories/releases/org/apache/jclouds/jclouds-compute/2.1.0-SNAPSHOT/maven-metadata.xml
Downloading: https://repository.apache.org/content/repositories/snapshots/org/apache/jclouds/jclouds-compute/2.1.0-SNAPSHOT/maven-metadata.xml
Downloading: https://repository-jclouds.forge.cloudbees.com/snapshot/org/apache/jclouds/jclouds-compute/2.1.0-SNAPSHOT/maven-metadata.xml
Downloading: http://download.java.net/maven/2/org/apache/jclouds/jclouds-compute/2.1.0-SNAPSHOT/maven-metadata.xml
Downloading: http://repository.apache.org/snapshots/org/apache/jclouds/jclouds-compute/2.1.0-SNAPSHOT/maven-metadata.xml
Downloaded: https://repository.apache.org/content/repositories/snapshots/org/apache/jclouds/jclouds-compute/2.1.0-SNAPSHOT/maven-metadata.xml
(2 KB at 44.7 KB/sec)
Downloaded: http://repository.apache.org/snapshots/org/apache/jclouds/jclouds-compute/2.1.0-SNAPSHOT/maven-metadata.xml
(2 KB at 44.7 KB/sec)
Downloading: https://repository-jclouds.forge.cloudbees.com/snapshot/org/apache/jclouds/jclouds-compute/2.1.0-SNAPSHOT/jclouds-compute-2.1.0-20170424.063628-62.pom
Downloading: https://repository.apache.org/content/repositories/snapshots/org/apache/jclouds/jclouds-compute/2.1.0-SNAPSHOT/jclouds-compute-2.1.0-20170424.063628-62.pom
Downloaded: https://repository.apache.org/content/repositories/snapshots/org/apache/jclouds/jclouds-compute/2.1.0-SNAPSHOT/jclouds-compute-2.1.0-20170424.063628-62.pom
(3 KB at 70.1 KB/sec)
Downloading: https://repository-jclouds.forge.cloudbees.com/snapshot/org/apache/jclouds/jclouds-scriptbuilder/2.1.0-SNAPSHOT/maven-metadata.xml
Downloading: https://repository.apache.org/content/repositories/snapshots/org/apache/jclouds/jclouds-scriptbuilder/2.1.0-SNAPSHOT/maven-metadata.xml
Downloading: https://oss.sonatype.org/content/repositories/releases/org/apache/jclouds/jclouds-scriptbuilder/2.1.0-SNAPSHOT/maven-metadata.xml
Downloading: http://download.java.net/maven/2/org/apache/jclouds/jclouds-scriptbuilder/2.1.0-SNAPSHOT/maven-metadata.xml
Downloading: http://repository.apache.org/snapshots/org/apache/jclouds/jclouds-scriptbuilder/2.1.0-SNAPSHOT/maven-metadata.xml
Downloaded: https://repository.apache.org/content/repositories/snapshots/org/apache/jclouds/jclouds-scriptbuilder/2.1.0-SNAPSHOT/maven-metadata.xml
(2 KB at 25.7 KB/sec)
Downloaded: http://repository.apache.org/snapshots/org/apache/jclouds/jclouds-scriptbuilder/2.1.0-SNAPSHOT/maven-metadata.xml
(2 KB at 23.4 KB/sec)
Downloading: https://repository-jclouds.forge.cloudbees.com/snapshot/org/apache/jclouds/jclouds-scriptbuilder/2.1.0-SNAPSHOT/jclouds-scriptbuilder-2.1.0-20170424.063541-63.pom
Downloading: https://repository.apache.org/content/repositories/snapshots/org/apache/jclouds/jclouds-scriptbuilder/2.1.0-SNAPSHOT/jclouds-scriptbuilder-2.1.0-20170424.063541-63.pom
Downloaded: https://repository.apache.org/content/repositories/snapshots/org/apache/jclouds/jclouds-scriptbuilder/2.1.0-SNAPSHOT/jclouds-scriptbuilder-2.1.0-20170424.063541-63.pom
(3 KB at 42.3 KB/sec)
Downloading: https://repository.apache.org/content/repositories/snapshots/org/apache/jclouds/jclouds-blobstore/2.1.0-SNAPSHOT/maven-metadata.xml
Downloading: https://repository-jclouds.forge.cloudbees.com/snapshot/org/apache/jclouds/jclouds-blobstore/2.1.0-SNAPSHOT/maven-metadata.xml
Downloading: https://oss.sonatype.org/content/repositories/releases/org/apache/jclouds/jclouds-blobstore/2.1.0-SNAPSHOT/maven-metadata.xml
Downloading: http://download.java.net/maven/2/org/apache/jclouds/jclouds-blobstore/2.1.0-SNAPSHOT/maven-metadata.xml
Downloading: http://repository.apache.org/snapshots/org/apache/jclouds/jclouds-blobstore/2.1.0-SNAPSHOT/maven-metadata.xml
Downloaded: https://repository.apache.org/content/repositories/snapshots/org/apache/jclouds/jclouds-blobstore/2.1.0-SNAPSHOT/maven-metadata.xml
(2 KB at 47.4 KB/sec)
Downloaded: http://repository.apache.org/snapshots/org/apache/jclouds/jclouds-blobstore/2.1.0-SNAPSHOT/maven-metadata.xml
(2 KB at 46.1 KB/sec)
Downloading: https://repository-jclouds.forge.cloudbees.com/snapshot/org/apache/jclouds/jclouds-blobstore/2.1.0-SNAPSHOT/jclouds-blobstore-2.1.0-20170424.063856-62.pom
Downloading: https://repository.apache.org/content/repositories/snapshots/org/apache/jclouds/jclouds-blobstore/2.1.0-SNAPSHOT/jclouds-blobstore-2.1.0-20170424.063856-62.pom
Downloaded: https://repository.apache.org/content/repositories/snapshots/org/apache/jclouds/jclouds-blobstore/2.1.0-SNAPSHOT/jclouds-blobstore-2.1.0-20170424.063856-62.pom
(5 KB at 113.5 KB/sec)
Downloading: https://repo.cloudbees.com/content/repositories/central/org/slf4j/slf4j-api/1.5.8/slf4j-api-1.5.8.pom
Downloaded: https://repo.cloudbees.com/content/repositories/central/org/slf4j/slf4j-api/1.5.8/slf4j-api-1.5.8.pom
(3 KB at 9.5 KB/sec)
Downloading: https://repo.cloudbees.com/content/repositories/central/org/slf4j/slf4j-parent/1.5.8/slf4j-parent-1.5.8.pom
Downloaded: https://repo.cloudbees.com/content/repositories/central/org/slf4j/slf4j-parent/1.5.8/slf4j-parent-1.5.8.pom
(8 KB at 526.6 KB/sec)
Downloading: https://repo.cloudbees.com/content/repositories/central/org/osgi/osgi.cmpn/6.0.0/osgi.cmpn-6.0.0.jar
Downloading: https://repo.cloudbees.com/content/repositories/central/com/google/inject/guice/3.0/guice-3.0.jar
Downloading: https://repo.cloudbees.com/content/repositories/central/javax/inject/javax.inject/1/javax.inject-1.jar
Downloading: https://repo.cloudbees.com/content/repositories/central/aopalliance/aopalliance/1.0/aopalliance-1.0.jar
Downloading: https://repo.cloudbees.com/content/repositories/central/com/google/guava/guava/16.0.1/guava-16.0.1.jar
Downloaded: https://repo.cloudbees.com/content/repositories/central/aopalliance/aopalliance/1.0/aopalliance-1.0.jar
(5 KB at 117.9 KB/sec)
Downloading: https://repo.cloudbees.com/content/repositories/central/javax/ws/rs/javax.ws.rs-api/2.0.1/javax.ws.rs-api-2.0.1.jar
Downloaded: https://repo.cloudbees.com/content/repositories/central/javax/inject/javax.inject/1/javax.inject-1.jar
(3 KB at 14.4 KB/sec)
Downloading: https://repo.cloudbees.com/content/repositories/central/com/google/inject/extensions/guice-assistedinject/3.0/guice-assistedinject-3.0.jar
Downloaded: https://repo.cloudbees.com/content/repositories/central/org/osgi/osgi.cmpn/6.0.0/osgi.cmpn-6.0.0.jar
(937 KB at 5350.6 KB/sec)
Downloading: https://repo.cloudbees.com/content/repositories/central/javax/annotation/jsr250-api/1.0/jsr250-api-1.0.jar
Downloaded: https://repo.cloudbees.com/content/repositories/central/javax/annotation/jsr250-api/1.0/jsr250-api-1.0.jar
(6 KB at 121.5 KB/sec)
Downloading: https://repo.cloudbees.com/content/repositories/central/com/google/code/gson/gson/2.5/gson-2.5.jar
Downloaded: https://repo.cloudbees.com/content/repositories/central/javax/ws/rs/javax.ws.rs-api/2.0.1/javax.ws.rs-api-2.0.1.jar
(113 KB at 590.7 KB/sec)
Downloading: https://repo.cloudbees.com/content/repositories/central/org/slf4j/slf4j-api/1.5.8/slf4j-api-1.5.8.jar
Downloaded: https://repo.cloudbees.com/content/repositories/central/org/slf4j/slf4j-api/1.5.8/slf4j-api-1.5.8.jar
(23 KB at 817.7 KB/sec)
Downloaded: https://repo.cloudbees.com/content/repositories/central/com/google/code/gson/gson/2.5/gson-2.5.jar
(228 KB at 6136.0 KB/sec)
Downloaded: https://repo.cloudbees.com/content/repositories/central/com/google/inject/extensions/guice-assistedinject/3.0/guice-assistedinject-3.0.jar
(37 KB at 178.0 KB/sec)
Downloaded: https://repo.cloudbees.com/content/repositories/central/com/google/guava/guava/16.0.1/guava-16.0.1.jar
(2176 KB at 5802.1 KB/sec)
Downloaded: https://repo.cloudbees.com/content/repositories/central/com/google/inject/guice/3.0/guice-3.0.jar
(694 KB at 703.7 KB/sec)
Downloading: https://repository.apache.org/content/repositories/snapshots/org/apache/jclouds/jclouds-core/2.1.0-SNAPSHOT/jclouds-core-2.1.0-20170424.063436-64.jar
Downloading: https://repository.apache.org/content/repositories/snapshots/org/apache/jclouds/jclouds-compute/2.1.0-SNAPSHOT/jclouds-compute-2.1.0-20170424.063628-62.jar
Downloading: https://repository.apache.org/content/repositories/snapshots/org/apache/jclouds/jclouds-blobstore/2.1.0-SNAPSHOT/jclouds-blobstore-2.1.0-20170424.063856-62.jar
Downloading: https://repository.apache.org/content/repositories/snapshots/org/apache/jclouds/jclouds-scriptbuilder/2.1.0-SNAPSHOT/jclouds-scriptbuilder-2.1.0-20170424.063541-63.jar
Started calculate disk usage of build
Finished Calculation of disk usage of build in 0 seconds
Started calculate disk usage of workspace
Finished Calculation of disk usage of workspace in 0 seconds
[INFO] ------------------------------------------------------------------------
[INFO] Reactor Summary:
[INFO] 
[INFO] Apache jclouds :: Karaf ........................... SUCCESS [16.578s]
[INFO] jclouds :: Karaf :: Core .......................... FAILURE [2:16.863s]
[INFO] jclouds :: Karaf :: Bundles ....................... SKIPPED
[INFO] jclouds :: Karaf :: JSch Agentproxy for JSch (shaded bundle)  SKIPPED
[INFO] jclouds :: Karaf :: Utils ......................... SKIPPED
[INFO] jclouds :: Karaf :: Recipe ........................ SKIPPED
[INFO] jclouds :: Karaf :: Cache ......................... SKIPPED
[INFO] jclouds :: Karaf :: Services ...................... SKIPPED
[INFO] jclouds :: Karaf :: Commands ...................... SKIPPED
[INFO] jclouds :: Karaf :: URL Handler ................... SKIPPED
[INFO] jclouds :: Karaf :: Chef .......................... SKIPPED
[INFO] jclouds :: Karaf :: Chef :: Core .................. SKIPPED
[INFO] jclouds :: Karaf :: Chef :: Services .............. SKIPPED
[INFO] jclouds :: Karaf :: Chef :: Commands .............. SKIPPED
[INFO] jclouds :: Karaf :: Chef :: Cache ................. SKIPPED
[INFO] jclouds :: Karaf :: Feature ....................... SKIPPED
[INFO] jclouds :: Karaf :: Feature Labs .................. SKIPPED
[INFO] jclouds :: Karaf :: Integration Tests ............. SKIPPED
[INFO] ------------------------------------------------------------------------
[INFO] BUILD FAILURE
[INFO] ------------------------------------------------------------------------
[INFO] Total time: 3:32.702s
[INFO] Finished at: Mon Apr 24 11:09:56 EDT 2017
[INFO] Final Memory: 27M/110M
[INFO] ------------------------------------------------------------------------
Waiting for Jenkins to finish collecting data
[ERROR] Failed to execute goal on project core: Could not resolve dependencies for project
org.apache.jclouds.karaf:core:bundle:2.1.0-SNAPSHOT: The following artifacts could not be
resolved: org.apache.jclouds:jclouds-core:jar:2.1.0-SNAPSHOT, org.apache.jclouds:jclouds-compute:jar:2.1.0-SNAPSHOT,
org.apache.jclouds:jclouds-blobstore:jar:2.1.0-SNAPSHOT, org.apache.jclouds:jclouds-scriptbuilder:jar:2.1.0-SNAPSHOT:
Could not transfer artifact org.apache.jclouds:jclouds-core:jar:2.1.0-20170424.063436-64 from/to
apache-snapshots (https://repository.apache.org/content/repositories/snapshots): Connection
to https://repository.apache.org refused: Connection timed out -> [Help 1]
org.apache.maven.lifecycle.LifecycleExecutionException: Failed to execute goal on project
core: Could not resolve dependencies for project org.apache.jclouds.karaf:core:bundle:2.1.0-SNAPSHOT:
The following artifacts could not be resolved: org.apache.jclouds:jclouds-core:jar:2.1.0-SNAPSHOT,
org.apache.jclouds:jclouds-compute:jar:2.1.0-SNAPSHOT, org.apache.jclouds:jclouds-blobstore:jar:2.1.0-SNAPSHOT,
org.apache.jclouds:jclouds-scriptbuilder:jar:2.1.0-SNAPSHOT: Could not transfer artifact org.apache.jclouds:jclouds-core:jar:2.1.0-20170424.063436-64
from/to apache-snapshots (https://repository.apache.org/content/repositories/snapshots): Connection
to https://repository.apache.org refused
	at org.apache.maven.lifecycle.internal.LifecycleDependencyResolver.getDependencies(LifecycleDependencyResolver.java:210)
	at org.apache.maven.lifecycle.internal.LifecycleDependencyResolver.resolveProjectDependencies(LifecycleDependencyResolver.java:117)
	at org.apache.maven.lifecycle.internal.MojoExecutor.ensureDependenciesAreResolved(MojoExecutor.java:258)
	at org.apache.maven.lifecycle.internal.MojoExecutor.execute(MojoExecutor.java:201)
	at org.apache.maven.lifecycle.internal.MojoExecutor.execute(MojoExecutor.java:153)
	at org.apache.maven.lifecycle.internal.MojoExecutor.execute(MojoExecutor.java:145)
	at org.apache.maven.lifecycle.internal.LifecycleModuleBuilder.buildProject(LifecycleModuleBuilder.java:84)
	at org.apache.maven.lifecycle.internal.LifecycleModuleBuilder.buildProject(LifecycleModuleBuilder.java:59)
	at org.apache.maven.lifecycle.internal.LifecycleStarter.singleThreadedBuild(LifecycleStarter.java:183)
	at org.apache.maven.lifecycle.internal.LifecycleStarter.execute(LifecycleStarter.java:161)
	at org.apache.maven.DefaultMaven.doExecute(DefaultMaven.java:320)
	at org.apache.maven.DefaultMaven.execute(DefaultMaven.java:156)
	at org.jvnet.hudson.maven3.launcher.Maven3Launcher.main(Maven3Launcher.java:117)
	at sun.reflect.NativeMethodAccessorImpl.invoke0(Native Method)
	at sun.reflect.NativeMethodAccessorImpl.invoke(NativeMethodAccessorImpl.java:57)
	at sun.reflect.DelegatingMethodAccessorImpl.invoke(DelegatingMethodAccessorImpl.java:43)
	at java.lang.reflect.Method.invoke(Method.java:606)
	at org.codehaus.plexus.classworlds.launcher.Launcher.launchStandard(Launcher.java:329)
	at org.codehaus.plexus.classworlds.launcher.Launcher.launch(Launcher.java:239)
	at org.jvnet.hudson.maven3.agent.Maven3Main.launch(Maven3Main.java:181)
	at sun.reflect.NativeMethodAccessorImpl.invoke0(Native Method)
	at sun.reflect.NativeMethodAccessorImpl.invoke(NativeMethodAccessorImpl.java:57)
	at sun.reflect.DelegatingMethodAccessorImpl.invoke(DelegatingMethodAccessorImpl.java:43)
	at java.lang.reflect.Method.invoke(Method.java:606)
	at hudson.maven.Maven3Builder.call(Maven3Builder.java:139)
	at hudson.maven.Maven3Builder.call(Maven3Builder.java:70)
	at hudson.remoting.UserRequest.perform(UserRequest.java:153)
	at hudson.remoting.UserRequest.perform(UserRequest.java:50)
	at hudson.remoting.Request$2.run(Request.java:336)
	at hudson.remoting.InterceptingExecutorService$1.call(InterceptingExecutorService.java:68)
	at java.util.concurrent.FutureTask.run(FutureTask.java:262)
	at java.util.concurrent.ThreadPoolExecutor.runWorker(ThreadPoolExecutor.java:1145)
	at java.util.concurrent.ThreadPoolExecutor$Worker.run(ThreadPoolExecutor.java:615)
	at java.lang.Thread.run(Thread.java:745)
Caused by: org.apache.maven.project.DependencyResolutionException: Could not resolve dependencies
for project org.apache.jclouds.karaf:core:bundle:2.1.0-SNAPSHOT: The following artifacts could
not be resolved: org.apache.jclouds:jclouds-core:jar:2.1.0-SNAPSHOT, org.apache.jclouds:jclouds-compute:jar:2.1.0-SNAPSHOT,
org.apache.jclouds:jclouds-blobstore:jar:2.1.0-SNAPSHOT, org.apache.jclouds:jclouds-scriptbuilder:jar:2.1.0-SNAPSHOT:
Could not transfer artifact org.apache.jclouds:jclouds-core:jar:2.1.0-20170424.063436-64 from/to
apache-snapshots (https://repository.apache.org/content/repositories/snapshots): Connection
to https://repository.apache.org refused
	at org.apache.maven.project.DefaultProjectDependenciesResolver.resolve(DefaultProjectDependenciesResolver.java:189)
	at org.apache.maven.lifecycle.internal.LifecycleDependencyResolver.getDependencies(LifecycleDependencyResolver.java:185)
	... 33 more
Caused by: org.sonatype.aether.resolution.DependencyResolutionException: The following artifacts
could not be resolved: org.apache.jclouds:jclouds-core:jar:2.1.0-SNAPSHOT, org.apache.jclouds:jclouds-compute:jar:2.1.0-SNAPSHOT,
org.apache.jclouds:jclouds-blobstore:jar:2.1.0-SNAPSHOT, org.apache.jclouds:jclouds-scriptbuilder:jar:2.1.0-SNAPSHOT:
Could not transfer artifact org.apache.jclouds:jclouds-core:jar:2.1.0-20170424.063436-64 from/to
apache-snapshots (https://repository.apache.org/content/repositories/snapshots): Connection
to https://repository.apache.org refused
	at org.sonatype.aether.impl.internal.DefaultRepositorySystem.resolveDependencies(DefaultRepositorySystem.java:375)
	at org.apache.maven.project.DefaultProjectDependenciesResolver.resolve(DefaultProjectDependenciesResolver.java:183)
	... 34 more
Caused by: org.sonatype.aether.resolution.ArtifactResolutionException: The following artifacts
could not be resolved: org.apache.jclouds:jclouds-core:jar:2.1.0-SNAPSHOT, org.apache.jclouds:jclouds-compute:jar:2.1.0-SNAPSHOT,
org.apache.jclouds:jclouds-blobstore:jar:2.1.0-SNAPSHOT, org.apache.jclouds:jclouds-scriptbuilder:jar:2.1.0-SNAPSHOT:
Could not transfer artifact org.apache.jclouds:jclouds-core:jar:2.1.0-20170424.063436-64 from/to
apache-snapshots (https://repository.apache.org/content/repositories/snapshots): Connection
to https://repository.apache.org refused
	at org.sonatype.aether.impl.internal.DefaultArtifactResolver.resolve(DefaultArtifactResolver.java:538)
	at org.sonatype.aether.impl.internal.DefaultArtifactResolver.resolveArtifacts(DefaultArtifactResolver.java:216)
	at org.sonatype.aether.impl.internal.DefaultRepositorySystem.resolveDependencies(DefaultRepositorySystem.java:358)
	... 35 more
Caused by: org.sonatype.aether.transfer.ArtifactTransferException: Could not transfer artifact
org.apache.jclouds:jclouds-core:jar:2.1.0-20170424.063436-64 from/to apache-snapshots (https://repository.apache.org/content/repositories/snapshots):
Connection to https://repository.apache.org refused
	at org.sonatype.aether.connector.wagon.WagonRepositoryConnector$4.wrap(WagonRepositoryConnector.java:951)
	at org.sonatype.aether.connector.wagon.WagonRepositoryConnector$4.wrap(WagonRepositoryConnector.java:941)
	at org.sonatype.aether.connector.wagon.WagonRepositoryConnector$GetTask.run(WagonRepositoryConnector.java:669)
	at org.sonatype.aether.util.concurrency.RunnableErrorForwarder$1.run(RunnableErrorForwarder.java:60)
	... 3 more
Caused by: org.apache.maven.wagon.TransferFailedException: Connection to https://repository.apache.org
refused
	at org.apache.maven.wagon.shared.http4.AbstractHttpClientWagon.fillInputData(AbstractHttpClientWagon.java:892)
	at org.apache.maven.wagon.StreamWagon.getInputStream(StreamWagon.java:116)
	at org.apache.maven.wagon.StreamWagon.getIfNewer(StreamWagon.java:88)
	at org.apache.maven.wagon.StreamWagon.get(StreamWagon.java:61)
	at org.sonatype.aether.connector.wagon.WagonRepositoryConnector$GetTask.run(WagonRepositoryConnector.java:601)
	... 4 more
Caused by: org.apache.maven.wagon.providers.http.httpclient.conn.HttpHostConnectException:
Connection to https://repository.apache.org refused
	at org.apache.maven.wagon.providers.http.httpclient.impl.conn.DefaultClientConnectionOperator.openConnection(DefaultClientConnectionOperator.java:190)
	at org.apache.maven.wagon.providers.http.httpclient.impl.conn.ManagedClientConnectionImpl.open(ManagedClientConnectionImpl.java:294)
	at org.apache.maven.wagon.providers.http.httpclient.impl.client.DefaultRequestDirector.tryConnect(DefaultRequestDirector.java:645)
	at org.apache.maven.wagon.providers.http.httpclient.impl.client.DefaultRequestDirector.execute(DefaultRequestDirector.java:480)
	at org.apache.maven.wagon.providers.http.httpclient.impl.client.AbstractHttpClient.execute(AbstractHttpClient.java:906)
	at org.apache.maven.wagon.providers.http.httpclient.impl.client.AbstractHttpClient.execute(AbstractHttpClient.java:805)
	at org.apache.maven.wagon.shared.http4.AbstractHttpClientWagon.execute(AbstractHttpClientWagon.java:746)
	at org.apache.maven.wagon.shared.http4.AbstractHttpClientWagon.fillInputData(AbstractHttpClientWagon.java:886)
	... 8 more
Caused by: java.net.ConnectException: Connection timed out
	at java.net.PlainSocketImpl.socketConnect(Native Method)
	at java.net.AbstractPlainSocketImpl.doConnect(AbstractPlainSocketImpl.java:339)
	at java.net.AbstractPlainSocketImpl.connectToAddress(AbstractPlainSocketImpl.java:200)
	at java.net.AbstractPlainSocketImpl.connect(AbstractPlainSocketImpl.java:182)
	at java.net.SocksSocketImpl.connect(SocksSocketImpl.java:392)
	at java.net.Socket.connect(Socket.java:579)
	at sun.security.ssl.SSLSocketImpl.connect(SSLSocketImpl.java:625)
	at org.apache.maven.wagon.providers.http.httpclient.conn.ssl.SSLSocketFactory.connectSocket(SSLSocketFactory.java:549)
	at org.apache.maven.wagon.shared.http4.ConfigurableSSLSocketFactoryDecorator.connectSocket(ConfigurableSSLSocketFactoryDecorator.java:64)
	at org.apache.maven.wagon.providers.http.httpclient.impl.conn.DefaultClientConnectionOperator.openConnection(DefaultClientConnectionOperator.java:180)
	... 15 more
[ERROR] 
[ERROR] Re-run Maven using the -X switch to enable full debug logging.
[ERROR] 
[ERROR] For more information about the errors and possible solutions, please read the following
articles:
[ERROR] [Help 1] http://cwiki.apache.org/confluence/display/MAVEN/DependencyResolutionException
[ERROR] 
[ERROR] After correcting the problems, you can resume the build with the command
[ERROR]   mvn <goals> -rf :core
[JENKINS] Archiving <https://jclouds.ci.cloudbees.com/job/jclouds-karaf/ws/chef/core/pom.xml>
to org.apache.jclouds.karaf.chef/core/2.1.0-SNAPSHOT/core-2.1.0-SNAPSHOT.pom
[JENKINS] Archiving <https://jclouds.ci.cloudbees.com/job/jclouds-karaf/ws/bundles/pom.xml>
to org.apache.jclouds.karaf/bundles/2.1.0-SNAPSHOT/bundles-2.1.0-SNAPSHOT.pom
[JENKINS] Archiving <https://jclouds.ci.cloudbees.com/job/jclouds-karaf/ws/utils/pom.xml>
to org.apache.jclouds.karaf/utils/2.1.0-SNAPSHOT/utils-2.1.0-SNAPSHOT.pom
[JENKINS] Archiving <https://jclouds.ci.cloudbees.com/job/jclouds-karaf/ws/chef/commands/pom.xml>
to org.apache.jclouds.karaf.chef/commands/2.1.0-SNAPSHOT/commands-2.1.0-SNAPSHOT.pom
[JENKINS] Archiving <https://jclouds.ci.cloudbees.com/job/jclouds-karaf/ws/services/pom.xml>
to org.apache.jclouds.karaf/services/2.1.0-SNAPSHOT/services-2.1.0-SNAPSHOT.pom
[JENKINS] Archiving <https://jclouds.ci.cloudbees.com/job/jclouds-karaf/ws/feature/pom.xml>
to org.apache.jclouds.karaf/jclouds-karaf/2.1.0-SNAPSHOT/jclouds-karaf-2.1.0-SNAPSHOT.pom
[JENKINS] Archiving <https://jclouds.ci.cloudbees.com/job/jclouds-karaf/ws/feature-labs/pom.xml>
to org.apache.jclouds.karaf/jclouds-karaf-labs/2.1.0-SNAPSHOT/jclouds-karaf-labs-2.1.0-SNAPSHOT.pom
[JENKINS] Archiving <https://jclouds.ci.cloudbees.com/job/jclouds-karaf/ws/recipe/pom.xml>
to org.apache.jclouds.karaf/recipe/2.1.0-SNAPSHOT/recipe-2.1.0-SNAPSHOT.pom
[JENKINS] Archiving <https://jclouds.ci.cloudbees.com/job/jclouds-karaf/ws/urlhandler/pom.xml>
to org.apache.jclouds.karaf/urlhandler/2.1.0-SNAPSHOT/urlhandler-2.1.0-SNAPSHOT.pom
[JENKINS] Archiving <https://jclouds.ci.cloudbees.com/job/jclouds-karaf/ws/pom.xml>
to org.apache.jclouds/jclouds-karaf/2.1.0-SNAPSHOT/jclouds-karaf-2.1.0-SNAPSHOT.pom
[JENKINS] Archiving <https://jclouds.ci.cloudbees.com/job/jclouds-karaf/ws/core/pom.xml>
to org.apache.jclouds.karaf/core/2.1.0-SNAPSHOT/core-2.1.0-SNAPSHOT.pom
[JENKINS] Archiving <https://jclouds.ci.cloudbees.com/job/jclouds-karaf/ws/itests/pom.xml>
to org.apache.jclouds.karaf/itests/2.1.0-SNAPSHOT/itests-2.1.0-SNAPSHOT.pom
[JENKINS] Archiving <https://jclouds.ci.cloudbees.com/job/jclouds-karaf/ws/cache/pom.xml>
to org.apache.jclouds.karaf/cache/2.1.0-SNAPSHOT/cache-2.1.0-SNAPSHOT.pom
[JENKINS] Archiving <https://jclouds.ci.cloudbees.com/job/jclouds-karaf/ws/chef/services/pom.xml>
to org.apache.jclouds.karaf.chef/services/2.1.0-SNAPSHOT/services-2.1.0-SNAPSHOT.pom
[JENKINS] Archiving <https://jclouds.ci.cloudbees.com/job/jclouds-karaf/ws/chef/pom.xml>
to org.apache.jclouds.karaf/chef/2.1.0-SNAPSHOT/chef-2.1.0-SNAPSHOT.pom
[JENKINS] Archiving <https://jclouds.ci.cloudbees.com/job/jclouds-karaf/ws/chef/cache/pom.xml>
to org.apache.jclouds.karaf.chef/cache/2.1.0-SNAPSHOT/cache-2.1.0-SNAPSHOT.pom
[JENKINS] Archiving <https://jclouds.ci.cloudbees.com/job/jclouds-karaf/ws/bundles/jsch-agentproxy-jsch/pom.xml>
to org.apache.jclouds.karaf.bundles/jsch-agentproxy-jsch/2.1.0-SNAPSHOT/jsch-agentproxy-jsch-2.1.0-SNAPSHOT.pom
[JENKINS] Archiving <https://jclouds.ci.cloudbees.com/job/jclouds-karaf/ws/commands/pom.xml>
to org.apache.jclouds.karaf/commands/2.1.0-SNAPSHOT/commands-2.1.0-SNAPSHOT.pom
Sending e-mails to: notifications@jclouds.apache.org
channel stopped
Started calculate disk usage of build
Finished Calculation of disk usage of build in 0 seconds
Started calculate disk usage of workspace
Finished Calculation of disk usage of workspace in 0 seconds

Mime
View raw message