jclouds-notifications mailing list archives

Site index · List index
Message view « Date » · « Thread »
Top « Date » · « Thread »
From jenkins-no-re...@cloudbees.com
Subject Build failed in Jenkins: jclouds-karaf #2133
Date Tue, 04 Apr 2017 13:51:56 GMT
See <https://jclouds.ci.cloudbees.com/job/jclouds-karaf/2133/display/redirect>

------------------------------------------
[...truncated 304.45 KB...]
Downloading: https://repository-jclouds.forge.cloudbees.com/release/org/apache/maven/maven-plugin-descriptor/2.0/maven-plugin-descriptor-2.0.pom
Downloading: https://repo.cloudbees.com/content/repositories/central/org/apache/maven/maven-plugin-descriptor/2.0/maven-plugin-descriptor-2.0.pom
Downloaded: https://repo.cloudbees.com/content/repositories/central/org/apache/maven/maven-plugin-descriptor/2.0/maven-plugin-descriptor-2.0.pom
(0 B at 0.0 KB/sec)
Downloading: https://repository-jclouds.forge.cloudbees.com/release/org/apache/maven/maven-monitor/2.0/maven-monitor-2.0.pom
Downloading: https://repo.cloudbees.com/content/repositories/central/org/apache/maven/maven-monitor/2.0/maven-monitor-2.0.pom
Downloaded: https://repo.cloudbees.com/content/repositories/central/org/apache/maven/maven-monitor/2.0/maven-monitor-2.0.pom
(0 B at 0.0 KB/sec)
Downloading: https://repository-jclouds.forge.cloudbees.com/release/org/codehaus/plexus/plexus-utils/3.0.8/plexus-utils-3.0.8.pom
Downloading: https://repo.cloudbees.com/content/repositories/central/org/codehaus/plexus/plexus-utils/3.0.8/plexus-utils-3.0.8.pom
Downloaded: https://repo.cloudbees.com/content/repositories/central/org/codehaus/plexus/plexus-utils/3.0.8/plexus-utils-3.0.8.pom
(0 B at 0.0 KB/sec)
Downloading: https://repository-jclouds.forge.cloudbees.com/release/org/codehaus/plexus/plexus/3.2/plexus-3.2.pom
Downloading: https://repo.cloudbees.com/content/repositories/central/org/codehaus/plexus/plexus/3.2/plexus-3.2.pom
Downloaded: https://repo.cloudbees.com/content/repositories/central/org/codehaus/plexus/plexus/3.2/plexus-3.2.pom
(0 B at 0.0 KB/sec)
Downloading: https://repository-jclouds.forge.cloudbees.com/release/org/apache/rat/apache-rat-core/0.10/apache-rat-core-0.10.jar
Downloading: https://repository-jclouds.forge.cloudbees.com/release/commons-io/commons-io/2.2/commons-io-2.2.jar
Downloading: https://repository-jclouds.forge.cloudbees.com/release/org/apache/commons/commons-compress/1.5/commons-compress-1.5.jar
Downloading: https://repository-jclouds.forge.cloudbees.com/release/org/codehaus/plexus/plexus-interpolation/1.11/plexus-interpolation-1.11.jar
Downloading: https://repository-jclouds.forge.cloudbees.com/release/org/apache/maven/doxia/doxia-core/1.2/doxia-core-1.2.jar
Downloading: https://repository-jclouds.forge.cloudbees.com/release/org/apache/maven/doxia/doxia-logging-api/1.2/doxia-logging-api-1.2.jar
Downloading: https://repository-jclouds.forge.cloudbees.com/release/org/apache/maven/doxia/doxia-decoration-model/1.2/doxia-decoration-model-1.2.jar
Downloading: https://repository-jclouds.forge.cloudbees.com/release/org/apache/maven/doxia/doxia-sink-api/1.2/doxia-sink-api-1.2.jar
Downloading: https://repository-jclouds.forge.cloudbees.com/release/org/apache/maven/doxia/doxia-site-renderer/1.2/doxia-site-renderer-1.2.jar
Downloading: https://repository-jclouds.forge.cloudbees.com/release/org/apache/maven/doxia/doxia-module-xhtml/1.2/doxia-module-xhtml-1.2.jar
Downloading: https://repository-jclouds.forge.cloudbees.com/release/org/apache/maven/doxia/doxia-module-fml/1.2/doxia-module-fml-1.2.jar
Downloading: https://repository-jclouds.forge.cloudbees.com/release/org/apache/maven/shared/maven-plugin-testing-harness/1.1/maven-plugin-testing-harness-1.1.jar
Downloading: https://repository-jclouds.forge.cloudbees.com/release/org/codehaus/plexus/plexus-utils/3.0.8/plexus-utils-3.0.8.jar
Downloading: https://repo.cloudbees.com/content/repositories/central/org/apache/rat/apache-rat-core/0.10/apache-rat-core-0.10.jar
Downloading: https://repo.cloudbees.com/content/repositories/central/commons-io/commons-io/2.2/commons-io-2.2.jar
Downloading: https://repo.cloudbees.com/content/repositories/central/org/apache/commons/commons-compress/1.5/commons-compress-1.5.jar
Downloading: https://repo.cloudbees.com/content/repositories/central/org/codehaus/plexus/plexus-interpolation/1.11/plexus-interpolation-1.11.jar
Downloading: https://repo.cloudbees.com/content/repositories/central/org/apache/maven/doxia/doxia-core/1.2/doxia-core-1.2.jar
Downloaded: https://repo.cloudbees.com/content/repositories/central/commons-io/commons-io/2.2/commons-io-2.2.jar
(0 B at 0.0 KB/sec)
Downloading: https://repo.cloudbees.com/content/repositories/central/org/apache/maven/doxia/doxia-logging-api/1.2/doxia-logging-api-1.2.jar
Downloaded: https://repo.cloudbees.com/content/repositories/central/org/codehaus/plexus/plexus-interpolation/1.11/plexus-interpolation-1.11.jar
(0 B at 0.0 KB/sec)
Downloading: https://repo.cloudbees.com/content/repositories/central/org/apache/maven/doxia/doxia-decoration-model/1.2/doxia-decoration-model-1.2.jar
Downloaded: https://repo.cloudbees.com/content/repositories/central/org/apache/rat/apache-rat-core/0.10/apache-rat-core-0.10.jar
(0 B at 0.0 KB/sec)
Downloading: https://repo.cloudbees.com/content/repositories/central/org/apache/maven/doxia/doxia-sink-api/1.2/doxia-sink-api-1.2.jar
Downloaded: https://repo.cloudbees.com/content/repositories/central/org/apache/commons/commons-compress/1.5/commons-compress-1.5.jar
(0 B at 0.0 KB/sec)
Downloading: https://repo.cloudbees.com/content/repositories/central/org/apache/maven/doxia/doxia-site-renderer/1.2/doxia-site-renderer-1.2.jar
Downloaded: https://repo.cloudbees.com/content/repositories/central/org/apache/maven/doxia/doxia-core/1.2/doxia-core-1.2.jar
(0 B at 0.0 KB/sec)
Downloading: https://repo.cloudbees.com/content/repositories/central/org/apache/maven/doxia/doxia-module-xhtml/1.2/doxia-module-xhtml-1.2.jar
Downloaded: https://repo.cloudbees.com/content/repositories/central/org/apache/maven/doxia/doxia-logging-api/1.2/doxia-logging-api-1.2.jar
(0 B at 0.0 KB/sec)
Downloading: https://repo.cloudbees.com/content/repositories/central/org/apache/maven/doxia/doxia-module-fml/1.2/doxia-module-fml-1.2.jar
Downloaded: https://repo.cloudbees.com/content/repositories/central/org/apache/maven/doxia/doxia-decoration-model/1.2/doxia-decoration-model-1.2.jar
(0 B at 0.0 KB/sec)
Downloading: https://repo.cloudbees.com/content/repositories/central/org/apache/maven/shared/maven-plugin-testing-harness/1.1/maven-plugin-testing-harness-1.1.jar
Downloaded: https://repo.cloudbees.com/content/repositories/central/org/apache/maven/doxia/doxia-site-renderer/1.2/doxia-site-renderer-1.2.jar
(0 B at 0.0 KB/sec)
Downloading: https://repo.cloudbees.com/content/repositories/central/org/codehaus/plexus/plexus-utils/3.0.8/plexus-utils-3.0.8.jar
Downloaded: https://repo.cloudbees.com/content/repositories/central/org/apache/maven/doxia/doxia-sink-api/1.2/doxia-sink-api-1.2.jar
(0 B at 0.0 KB/sec)
Downloaded: https://repo.cloudbees.com/content/repositories/central/org/apache/maven/doxia/doxia-module-fml/1.2/doxia-module-fml-1.2.jar
(0 B at 0.0 KB/sec)
Downloaded: https://repo.cloudbees.com/content/repositories/central/org/apache/maven/doxia/doxia-module-xhtml/1.2/doxia-module-xhtml-1.2.jar
(0 B at 0.0 KB/sec)
Downloaded: https://repo.cloudbees.com/content/repositories/central/org/apache/maven/shared/maven-plugin-testing-harness/1.1/maven-plugin-testing-harness-1.1.jar
(0 B at 0.0 KB/sec)
Downloaded: https://repo.cloudbees.com/content/repositories/central/org/codehaus/plexus/plexus-utils/3.0.8/plexus-utils-3.0.8.jar
(0 B at 0.0 KB/sec)
[INFO] 63 implicit excludes (use -debug for more details).
[INFO] Exclude: **/LICENSE.txt
[INFO] Exclude: **/header.txt
[INFO] Exclude: **/NOTICE.txt
[INFO] Exclude: **/DISCLAIMER
[INFO] Exclude: **/BUILD.txt
[INFO] Exclude: **/CHANGES.txt
[INFO] Exclude: **/README.md
[INFO] Exclude: **/README.txt
[INFO] Exclude: **/DEPENDENCIES
[INFO] Exclude: **/CONTRIBUTING.md
[INFO] Exclude: .git/**
[INFO] Exclude: **/.gitignore
[INFO] Exclude: **/*.json
[INFO] Exclude: **/*.log*
[INFO] Exclude: **/TODO
[INFO] Exclude: .mailmap
[INFO] Exclude: .idea/**
[INFO] Exclude: **/*.iml
[INFO] Exclude: **/.project
[INFO] Exclude: **/.classpath
[INFO] Exclude: **/.settings/**
[INFO] Exclude: **/.checkstyle
[INFO] Exclude: **/target/**
[INFO] Exclude: .repository/**
[INFO] Exclude: **/src/main/resources/**/*.txt
[INFO] 1 resources included (use -debug for more details)
Warning:  org.apache.xerces.jaxp.SAXParserImpl$JAXPSAXParser: Property 'http://www.oracle.com/xml/jaxp/properties/entityExpansionLimit'
is not recognized.
Compiler warnings:
  WARNING:  'org.apache.xerces.jaxp.SAXParserImpl: Property 'http://javax.xml.XMLConstants/property/accessExternalDTD'
is not recognized.'
Warning:  org.apache.xerces.parsers.SAXParser: Feature 'http://javax.xml.XMLConstants/feature/secure-processing'
is not recognized.
Warning:  org.apache.xerces.parsers.SAXParser: Property 'http://javax.xml.XMLConstants/property/accessExternalDTD'
is not recognized.
Warning:  org.apache.xerces.parsers.SAXParser: Property 'http://www.oracle.com/xml/jaxp/properties/entityExpansionLimit'
is not recognized.
[INFO] Rat check: Summary of files. Unapproved: 0 unknown: 0 generated: 0 approved: 1 licence.
[INFO] 
[INFO] --- maven-install-plugin:2.5.1:install (default-install) @ jclouds-karaf ---
Downloading: https://repository-jclouds.forge.cloudbees.com/release/org/apache/maven/shared/maven-shared-utils/0.4/maven-shared-utils-0.4.pom
Downloading: https://repo.cloudbees.com/content/repositories/central/org/apache/maven/shared/maven-shared-utils/0.4/maven-shared-utils-0.4.pom
Downloaded: https://repo.cloudbees.com/content/repositories/central/org/apache/maven/shared/maven-shared-utils/0.4/maven-shared-utils-0.4.pom
(4 KB at 208.0 KB/sec)
Downloading: https://repository-jclouds.forge.cloudbees.com/release/org/apache/maven/shared/maven-shared-utils/0.4/maven-shared-utils-0.4.jar
Downloading: https://repository-jclouds.forge.cloudbees.com/release/org/codehaus/plexus/plexus-utils/3.0.15/plexus-utils-3.0.15.jar
Downloading: https://repo.cloudbees.com/content/repositories/central/org/apache/maven/shared/maven-shared-utils/0.4/maven-shared-utils-0.4.jar
Downloading: https://repo.cloudbees.com/content/repositories/central/org/codehaus/plexus/plexus-utils/3.0.15/plexus-utils-3.0.15.jar
Downloaded: https://repo.cloudbees.com/content/repositories/central/org/apache/maven/shared/maven-shared-utils/0.4/maven-shared-utils-0.4.jar
(152 KB at 5234.8 KB/sec)
Downloaded: https://repo.cloudbees.com/content/repositories/central/org/codehaus/plexus/plexus-utils/3.0.15/plexus-utils-3.0.15.jar
(234 KB at 8046.6 KB/sec)
[INFO] Installing <https://jclouds.ci.cloudbees.com/job/jclouds-karaf/ws/pom.xml> to
/home/jenkins/.m2/repository/org/apache/jclouds/jclouds-karaf/2.1.0-SNAPSHOT/jclouds-karaf-2.1.0-SNAPSHOT.pom
[INFO] 
[INFO] --- maven-deploy-plugin:2.8.1:deploy (default-deploy) @ jclouds-karaf ---
Downloading: https://repository.apache.org/content/repositories/snapshots/org/apache/jclouds/jclouds-karaf/2.1.0-SNAPSHOT/maven-metadata.xml
[WARNING] Could not transfer metadata org.apache.jclouds:jclouds-karaf:2.1.0-SNAPSHOT/maven-metadata.xml
from/to apache.snapshots.https (https://repository.apache.org/content/repositories/snapshots):
Connection to https://repository.apache.org refused
Started calculate disk usage of build
Finished Calculation of disk usage of build in 0 seconds
Started calculate disk usage of workspace
Finished Calculation of disk usage of workspace in 0 seconds
[INFO] ------------------------------------------------------------------------
[INFO] Reactor Summary:
[INFO] 
[INFO] Apache jclouds :: Karaf ........................... FAILURE [2:16.906s]
[INFO] jclouds :: Karaf :: Core .......................... SKIPPED
[INFO] jclouds :: Karaf :: Bundles ....................... SKIPPED
[INFO] jclouds :: Karaf :: JSch Agentproxy for JSch (shaded bundle)  SKIPPED
[INFO] jclouds :: Karaf :: Utils ......................... SKIPPED
[INFO] jclouds :: Karaf :: Recipe ........................ SKIPPED
[INFO] jclouds :: Karaf :: Cache ......................... SKIPPED
[INFO] jclouds :: Karaf :: Services ...................... SKIPPED
[INFO] jclouds :: Karaf :: Commands ...................... SKIPPED
[INFO] jclouds :: Karaf :: URL Handler ................... SKIPPED
[INFO] jclouds :: Karaf :: Chef .......................... SKIPPED
[INFO] jclouds :: Karaf :: Chef :: Core .................. SKIPPED
[INFO] jclouds :: Karaf :: Chef :: Services .............. SKIPPED
[INFO] jclouds :: Karaf :: Chef :: Commands .............. SKIPPED
[INFO] jclouds :: Karaf :: Chef :: Cache ................. SKIPPED
[INFO] jclouds :: Karaf :: Feature ....................... SKIPPED
[INFO] jclouds :: Karaf :: Feature Labs .................. SKIPPED
[INFO] jclouds :: Karaf :: Integration Tests ............. SKIPPED
[INFO] ------------------------------------------------------------------------
[INFO] BUILD FAILURE
[INFO] ------------------------------------------------------------------------
[INFO] Total time: 2:32.182s
[INFO] Finished at: Tue Apr 04 09:51:46 EDT 2017
[INFO] Final Memory: 30M/204M
[INFO] ------------------------------------------------------------------------
Waiting for Jenkins to finish collecting data
[ERROR] Failed to execute goal org.apache.maven.plugins:maven-deploy-plugin:2.8.1:deploy (default-deploy)
on project jclouds-karaf: Failed to retrieve remote metadata org.apache.jclouds:jclouds-karaf:2.1.0-SNAPSHOT/maven-metadata.xml:
Could not transfer metadata org.apache.jclouds:jclouds-karaf:2.1.0-SNAPSHOT/maven-metadata.xml
from/to apache.snapshots.https (https://repository.apache.org/content/repositories/snapshots):
Connection to https://repository.apache.org refused: Connection timed out -> [Help 1]
org.apache.maven.lifecycle.LifecycleExecutionException: Failed to execute goal org.apache.maven.plugins:maven-deploy-plugin:2.8.1:deploy
(default-deploy) on project jclouds-karaf: Failed to retrieve remote metadata org.apache.jclouds:jclouds-karaf:2.1.0-SNAPSHOT/maven-metadata.xml:
Could not transfer metadata org.apache.jclouds:jclouds-karaf:2.1.0-SNAPSHOT/maven-metadata.xml
from/to apache.snapshots.https (https://repository.apache.org/content/repositories/snapshots):
Connection to https://repository.apache.org refused
	at org.apache.maven.lifecycle.internal.MojoExecutor.execute(MojoExecutor.java:217)
	at org.apache.maven.lifecycle.internal.MojoExecutor.execute(MojoExecutor.java:153)
	at org.apache.maven.lifecycle.internal.MojoExecutor.execute(MojoExecutor.java:145)
	at org.apache.maven.lifecycle.internal.LifecycleModuleBuilder.buildProject(LifecycleModuleBuilder.java:84)
	at org.apache.maven.lifecycle.internal.LifecycleModuleBuilder.buildProject(LifecycleModuleBuilder.java:59)
	at org.apache.maven.lifecycle.internal.LifecycleStarter.singleThreadedBuild(LifecycleStarter.java:183)
	at org.apache.maven.lifecycle.internal.LifecycleStarter.execute(LifecycleStarter.java:161)
	at org.apache.maven.DefaultMaven.doExecute(DefaultMaven.java:320)
	at org.apache.maven.DefaultMaven.execute(DefaultMaven.java:156)
	at org.jvnet.hudson.maven3.launcher.Maven3Launcher.main(Maven3Launcher.java:117)
	at sun.reflect.NativeMethodAccessorImpl.invoke0(Native Method)
	at sun.reflect.NativeMethodAccessorImpl.invoke(NativeMethodAccessorImpl.java:57)
	at sun.reflect.DelegatingMethodAccessorImpl.invoke(DelegatingMethodAccessorImpl.java:43)
	at java.lang.reflect.Method.invoke(Method.java:606)
	at org.codehaus.plexus.classworlds.launcher.Launcher.launchStandard(Launcher.java:329)
	at org.codehaus.plexus.classworlds.launcher.Launcher.launch(Launcher.java:239)
	at org.jvnet.hudson.maven3.agent.Maven3Main.launch(Maven3Main.java:181)
	at sun.reflect.NativeMethodAccessorImpl.invoke0(Native Method)
	at sun.reflect.NativeMethodAccessorImpl.invoke(NativeMethodAccessorImpl.java:57)
	at sun.reflect.DelegatingMethodAccessorImpl.invoke(DelegatingMethodAccessorImpl.java:43)
	at java.lang.reflect.Method.invoke(Method.java:606)
	at hudson.maven.Maven3Builder.call(Maven3Builder.java:139)
	at hudson.maven.Maven3Builder.call(Maven3Builder.java:70)
	at hudson.remoting.UserRequest.perform(UserRequest.java:153)
	at hudson.remoting.UserRequest.perform(UserRequest.java:50)
	at hudson.remoting.Request$2.run(Request.java:336)
	at hudson.remoting.InterceptingExecutorService$1.call(InterceptingExecutorService.java:68)
	at java.util.concurrent.FutureTask.run(FutureTask.java:262)
	at java.util.concurrent.ThreadPoolExecutor.runWorker(ThreadPoolExecutor.java:1145)
	at java.util.concurrent.ThreadPoolExecutor$Worker.run(ThreadPoolExecutor.java:615)
	at java.lang.Thread.run(Thread.java:745)
Caused by: org.apache.maven.plugin.MojoExecutionException: Failed to retrieve remote metadata
org.apache.jclouds:jclouds-karaf:2.1.0-SNAPSHOT/maven-metadata.xml: Could not transfer metadata
org.apache.jclouds:jclouds-karaf:2.1.0-SNAPSHOT/maven-metadata.xml from/to apache.snapshots.https
(https://repository.apache.org/content/repositories/snapshots): Connection to https://repository.apache.org
refused
	at org.apache.maven.plugin.deploy.DeployMojo.deployProject(DeployMojo.java:282)
	at org.apache.maven.plugin.deploy.DeployMojo.execute(DeployMojo.java:169)
	at org.apache.maven.plugin.DefaultBuildPluginManager.executeMojo(DefaultBuildPluginManager.java:101)
	at org.apache.maven.lifecycle.internal.MojoExecutor.execute(MojoExecutor.java:209)
	... 30 more
Caused by: org.apache.maven.artifact.deployer.ArtifactDeploymentException: Failed to retrieve
remote metadata org.apache.jclouds:jclouds-karaf:2.1.0-SNAPSHOT/maven-metadata.xml: Could
not transfer metadata org.apache.jclouds:jclouds-karaf:2.1.0-SNAPSHOT/maven-metadata.xml from/to
apache.snapshots.https (https://repository.apache.org/content/repositories/snapshots): Connection
to https://repository.apache.org refused
	at org.apache.maven.artifact.deployer.DefaultArtifactDeployer.deploy(DefaultArtifactDeployer.java:141)
	at org.apache.maven.plugin.deploy.AbstractDeployMojo.deploy(AbstractDeployMojo.java:171)
	at org.apache.maven.plugin.deploy.DeployMojo.deployProject(DeployMojo.java:240)
	... 33 more
Caused by: org.sonatype.aether.deployment.DeploymentException: Failed to retrieve remote metadata
org.apache.jclouds:jclouds-karaf:2.1.0-SNAPSHOT/maven-metadata.xml: Could not transfer metadata
org.apache.jclouds:jclouds-karaf:2.1.0-SNAPSHOT/maven-metadata.xml from/to apache.snapshots.https
(https://repository.apache.org/content/repositories/snapshots): Connection to https://repository.apache.org
refused
	at org.sonatype.aether.impl.internal.DefaultDeployer.upload(DefaultDeployer.java:403)
	at org.sonatype.aether.impl.internal.DefaultDeployer.deploy(DefaultDeployer.java:256)
	at org.sonatype.aether.impl.internal.DefaultDeployer.deploy(DefaultDeployer.java:211)
	at org.sonatype.aether.impl.internal.DefaultRepositorySystem.deploy(DefaultRepositorySystem.java:443)
	at org.apache.maven.artifact.deployer.DefaultArtifactDeployer.deploy(DefaultArtifactDeployer.java:137)
	... 35 more
Caused by: org.sonatype.aether.transfer.MetadataTransferException: Could not transfer metadata
org.apache.jclouds:jclouds-karaf:2.1.0-SNAPSHOT/maven-metadata.xml from/to apache.snapshots.https
(https://repository.apache.org/content/repositories/snapshots): Connection to https://repository.apache.org
refused
	at org.sonatype.aether.connector.wagon.WagonRepositoryConnector$3.wrap(WagonRepositoryConnector.java:930)
	at org.sonatype.aether.connector.wagon.WagonRepositoryConnector$3.wrap(WagonRepositoryConnector.java:920)
	at org.sonatype.aether.connector.wagon.WagonRepositoryConnector$GetTask.run(WagonRepositoryConnector.java:669)
	at org.sonatype.aether.util.concurrency.RunnableErrorForwarder$1.run(RunnableErrorForwarder.java:60)
	... 3 more
Caused by: org.apache.maven.wagon.TransferFailedException: Connection to https://repository.apache.org
refused
	at org.apache.maven.wagon.shared.http4.AbstractHttpClientWagon.fillInputData(AbstractHttpClientWagon.java:892)
	at org.apache.maven.wagon.StreamWagon.getInputStream(StreamWagon.java:116)
	at org.apache.maven.wagon.StreamWagon.getIfNewer(StreamWagon.java:88)
	at org.apache.maven.wagon.StreamWagon.get(StreamWagon.java:61)
	at org.sonatype.aether.connector.wagon.WagonRepositoryConnector$GetTask.run(WagonRepositoryConnector.java:601)
	... 4 more
Caused by: org.apache.maven.wagon.providers.http.httpclient.conn.HttpHostConnectException:
Connection to https://repository.apache.org refused
	at org.apache.maven.wagon.providers.http.httpclient.impl.conn.DefaultClientConnectionOperator.openConnection(DefaultClientConnectionOperator.java:190)
	at org.apache.maven.wagon.providers.http.httpclient.impl.conn.ManagedClientConnectionImpl.open(ManagedClientConnectionImpl.java:294)
	at org.apache.maven.wagon.providers.http.httpclient.impl.client.DefaultRequestDirector.tryConnect(DefaultRequestDirector.java:645)
	at org.apache.maven.wagon.providers.http.httpclient.impl.client.DefaultRequestDirector.execute(DefaultRequestDirector.java:480)
	at org.apache.maven.wagon.providers.http.httpclient.impl.client.AbstractHttpClient.execute(AbstractHttpClient.java:906)
	at org.apache.maven.wagon.providers.http.httpclient.impl.client.AbstractHttpClient.execute(AbstractHttpClient.java:805)
	at org.apache.maven.wagon.shared.http4.AbstractHttpClientWagon.execute(AbstractHttpClientWagon.java:746)
	at org.apache.maven.wagon.shared.http4.AbstractHttpClientWagon.fillInputData(AbstractHttpClientWagon.java:886)
	... 8 more
Caused by: java.net.ConnectException: Connection timed out
	at java.net.PlainSocketImpl.socketConnect(Native Method)
	at java.net.AbstractPlainSocketImpl.doConnect(AbstractPlainSocketImpl.java:339)
	at java.net.AbstractPlainSocketImpl.connectToAddress(AbstractPlainSocketImpl.java:200)
	at java.net.AbstractPlainSocketImpl.connect(AbstractPlainSocketImpl.java:182)
	at java.net.SocksSocketImpl.connect(SocksSocketImpl.java:392)
	at java.net.Socket.connect(Socket.java:579)
	at sun.security.ssl.SSLSocketImpl.connect(SSLSocketImpl.java:625)
	at org.apache.maven.wagon.providers.http.httpclient.conn.ssl.SSLSocketFactory.connectSocket(SSLSocketFactory.java:549)
	at org.apache.maven.wagon.shared.http4.ConfigurableSSLSocketFactoryDecorator.connectSocket(ConfigurableSSLSocketFactoryDecorator.java:64)
	at org.apache.maven.wagon.providers.http.httpclient.impl.conn.DefaultClientConnectionOperator.openConnection(DefaultClientConnectionOperator.java:180)
	... 15 more
[ERROR] 
[ERROR] Re-run Maven using the -X switch to enable full debug logging.
[ERROR] 
[ERROR] For more information about the errors and possible solutions, please read the following
articles:
[ERROR] [Help 1] http://cwiki.apache.org/confluence/display/MAVEN/MojoExecutionException
[JENKINS] Archiving <https://jclouds.ci.cloudbees.com/job/jclouds-karaf/ws/chef/core/pom.xml>
to org.apache.jclouds.karaf.chef/core/2.1.0-SNAPSHOT/core-2.1.0-SNAPSHOT.pom
[JENKINS] Archiving <https://jclouds.ci.cloudbees.com/job/jclouds-karaf/ws/bundles/pom.xml>
to org.apache.jclouds.karaf/bundles/2.1.0-SNAPSHOT/bundles-2.1.0-SNAPSHOT.pom
[JENKINS] Archiving <https://jclouds.ci.cloudbees.com/job/jclouds-karaf/ws/utils/pom.xml>
to org.apache.jclouds.karaf/utils/2.1.0-SNAPSHOT/utils-2.1.0-SNAPSHOT.pom
[JENKINS] Archiving <https://jclouds.ci.cloudbees.com/job/jclouds-karaf/ws/chef/commands/pom.xml>
to org.apache.jclouds.karaf.chef/commands/2.1.0-SNAPSHOT/commands-2.1.0-SNAPSHOT.pom
[JENKINS] Archiving <https://jclouds.ci.cloudbees.com/job/jclouds-karaf/ws/services/pom.xml>
to org.apache.jclouds.karaf/services/2.1.0-SNAPSHOT/services-2.1.0-SNAPSHOT.pom
[JENKINS] Archiving <https://jclouds.ci.cloudbees.com/job/jclouds-karaf/ws/feature/pom.xml>
to org.apache.jclouds.karaf/jclouds-karaf/2.1.0-SNAPSHOT/jclouds-karaf-2.1.0-SNAPSHOT.pom
[JENKINS] Archiving <https://jclouds.ci.cloudbees.com/job/jclouds-karaf/ws/feature-labs/pom.xml>
to org.apache.jclouds.karaf/jclouds-karaf-labs/2.1.0-SNAPSHOT/jclouds-karaf-labs-2.1.0-SNAPSHOT.pom
[JENKINS] Archiving <https://jclouds.ci.cloudbees.com/job/jclouds-karaf/ws/recipe/pom.xml>
to org.apache.jclouds.karaf/recipe/2.1.0-SNAPSHOT/recipe-2.1.0-SNAPSHOT.pom
[JENKINS] Archiving <https://jclouds.ci.cloudbees.com/job/jclouds-karaf/ws/urlhandler/pom.xml>
to org.apache.jclouds.karaf/urlhandler/2.1.0-SNAPSHOT/urlhandler-2.1.0-SNAPSHOT.pom
[JENKINS] Archiving <https://jclouds.ci.cloudbees.com/job/jclouds-karaf/ws/pom.xml>
to org.apache.jclouds/jclouds-karaf/2.1.0-SNAPSHOT/jclouds-karaf-2.1.0-SNAPSHOT.pom
[JENKINS] Archiving <https://jclouds.ci.cloudbees.com/job/jclouds-karaf/ws/core/pom.xml>
to org.apache.jclouds.karaf/core/2.1.0-SNAPSHOT/core-2.1.0-SNAPSHOT.pom
[JENKINS] Archiving <https://jclouds.ci.cloudbees.com/job/jclouds-karaf/ws/itests/pom.xml>
to org.apache.jclouds.karaf/itests/2.1.0-SNAPSHOT/itests-2.1.0-SNAPSHOT.pom
[JENKINS] Archiving <https://jclouds.ci.cloudbees.com/job/jclouds-karaf/ws/cache/pom.xml>
to org.apache.jclouds.karaf/cache/2.1.0-SNAPSHOT/cache-2.1.0-SNAPSHOT.pom
[JENKINS] Archiving <https://jclouds.ci.cloudbees.com/job/jclouds-karaf/ws/chef/services/pom.xml>
to org.apache.jclouds.karaf.chef/services/2.1.0-SNAPSHOT/services-2.1.0-SNAPSHOT.pom
[JENKINS] Archiving <https://jclouds.ci.cloudbees.com/job/jclouds-karaf/ws/chef/pom.xml>
to org.apache.jclouds.karaf/chef/2.1.0-SNAPSHOT/chef-2.1.0-SNAPSHOT.pom
[JENKINS] Archiving <https://jclouds.ci.cloudbees.com/job/jclouds-karaf/ws/chef/cache/pom.xml>
to org.apache.jclouds.karaf.chef/cache/2.1.0-SNAPSHOT/cache-2.1.0-SNAPSHOT.pom
[JENKINS] Archiving <https://jclouds.ci.cloudbees.com/job/jclouds-karaf/ws/bundles/jsch-agentproxy-jsch/pom.xml>
to org.apache.jclouds.karaf.bundles/jsch-agentproxy-jsch/2.1.0-SNAPSHOT/jsch-agentproxy-jsch-2.1.0-SNAPSHOT.pom
[JENKINS] Archiving <https://jclouds.ci.cloudbees.com/job/jclouds-karaf/ws/commands/pom.xml>
to org.apache.jclouds.karaf/commands/2.1.0-SNAPSHOT/commands-2.1.0-SNAPSHOT.pom
Sending e-mails to: notifications@jclouds.apache.org
channel stopped
Started calculate disk usage of build
Finished Calculation of disk usage of build in 0 seconds
Started calculate disk usage of workspace
Finished Calculation of disk usage of workspace in 0 seconds

Mime
View raw message