jclouds-notifications mailing list archives

Site index · List index
Message view « Date » · « Thread »
Top « Date » · « Thread »
From jenkins-no-re...@cloudbees.com
Subject Build failed in Jenkins: jclouds-cli #1315
Date Sat, 08 Apr 2017 12:15:34 GMT
See <https://jclouds.ci.cloudbees.com/job/jclouds-cli/1315/display/redirect>

------------------------------------------
[...truncated 277.34 KB...]
Downloading: https://repository-jclouds.forge.cloudbees.com/release/org/sonatype/sisu/inject/guava-parent/0.9.9/guava-parent-0.9.9.pom
Downloading: https://repo.cloudbees.com/content/repositories/central/org/sonatype/sisu/inject/guava-parent/0.9.9/guava-parent-0.9.9.pom
Downloaded: https://repo.cloudbees.com/content/repositories/central/org/sonatype/sisu/inject/guava-parent/0.9.9/guava-parent-0.9.9.pom
(11 KB at 597.2 KB/sec)
Downloading: https://repository-jclouds.forge.cloudbees.com/release/org/apache/maven/maven-project/3.0-alpha-2/maven-project-3.0-alpha-2.pom
Downloading: https://repo.cloudbees.com/content/repositories/central/org/apache/maven/maven-project/3.0-alpha-2/maven-project-3.0-alpha-2.pom
Downloaded: https://repo.cloudbees.com/content/repositories/central/org/apache/maven/maven-project/3.0-alpha-2/maven-project-3.0-alpha-2.pom
(4 KB at 146.4 KB/sec)
Downloading: https://repository-jclouds.forge.cloudbees.com/release/org/apache/maven/maven/3.0-alpha-2/maven-3.0-alpha-2.pom
Downloading: https://repo.cloudbees.com/content/repositories/central/org/apache/maven/maven/3.0-alpha-2/maven-3.0-alpha-2.pom
Downloaded: https://repo.cloudbees.com/content/repositories/central/org/apache/maven/maven/3.0-alpha-2/maven-3.0-alpha-2.pom
(21 KB at 835.0 KB/sec)
Downloading: https://repository-jclouds.forge.cloudbees.com/release/org/apache/maven/maven-model/3.0-alpha-2/maven-model-3.0-alpha-2.pom
Downloading: https://repo.cloudbees.com/content/repositories/central/org/apache/maven/maven-model/3.0-alpha-2/maven-model-3.0-alpha-2.pom
Downloaded: https://repo.cloudbees.com/content/repositories/central/org/apache/maven/maven-model/3.0-alpha-2/maven-model-3.0-alpha-2.pom
(4 KB at 98.0 KB/sec)
Downloading: https://repository-jclouds.forge.cloudbees.com/release/org/codehaus/plexus/plexus-interpolation/1.1/plexus-interpolation-1.1.pom
Downloading: https://repo.cloudbees.com/content/repositories/central/org/codehaus/plexus/plexus-interpolation/1.1/plexus-interpolation-1.1.pom
Downloaded: https://repo.cloudbees.com/content/repositories/central/org/codehaus/plexus/plexus-interpolation/1.1/plexus-interpolation-1.1.pom
(2 KB at 52.0 KB/sec)
Downloading: https://repository-jclouds.forge.cloudbees.com/release/org/apache/maven/maven-compat/3.0-alpha-2/maven-compat-3.0-alpha-2.pom
Downloading: https://repo.cloudbees.com/content/repositories/central/org/apache/maven/maven-compat/3.0-alpha-2/maven-compat-3.0-alpha-2.pom
Downloaded: https://repo.cloudbees.com/content/repositories/central/org/apache/maven/maven-compat/3.0-alpha-2/maven-compat-3.0-alpha-2.pom
(3 KB at 69.3 KB/sec)
Downloading: https://repository-jclouds.forge.cloudbees.com/release/org/codehaus/plexus/plexus-container-default/1.0-beta-3.0.5/plexus-container-default-1.0-beta-3.0.5.pom
Downloading: https://repo.cloudbees.com/content/repositories/central/org/codehaus/plexus/plexus-container-default/1.0-beta-3.0.5/plexus-container-default-1.0-beta-3.0.5.pom
Downloaded: https://repo.cloudbees.com/content/repositories/central/org/codehaus/plexus/plexus-container-default/1.0-beta-3.0.5/plexus-container-default-1.0-beta-3.0.5.pom
(2 KB at 19.6 KB/sec)
Downloading: https://repository-jclouds.forge.cloudbees.com/release/org/codehaus/plexus/plexus-containers/1.0-beta-3.0.5/plexus-containers-1.0-beta-3.0.5.pom
Downloading: https://repo.cloudbees.com/content/repositories/central/org/codehaus/plexus/plexus-containers/1.0-beta-3.0.5/plexus-containers-1.0-beta-3.0.5.pom
Downloaded: https://repo.cloudbees.com/content/repositories/central/org/codehaus/plexus/plexus-containers/1.0-beta-3.0.5/plexus-containers-1.0-beta-3.0.5.pom
(5 KB at 87.3 KB/sec)
Downloading: https://repository-jclouds.forge.cloudbees.com/release/org/codehaus/plexus/plexus-classworlds/1.4/plexus-classworlds-1.4.pom
Downloading: https://repo.cloudbees.com/content/repositories/central/org/codehaus/plexus/plexus-classworlds/1.4/plexus-classworlds-1.4.pom
Downloaded: https://repo.cloudbees.com/content/repositories/central/org/codehaus/plexus/plexus-classworlds/1.4/plexus-classworlds-1.4.pom
(5 KB at 207.3 KB/sec)
Downloading: https://repository-jclouds.forge.cloudbees.com/release/org/codehaus/plexus/plexus/2.0.0/plexus-2.0.0.pom
Downloading: https://repo.cloudbees.com/content/repositories/central/org/codehaus/plexus/plexus/2.0.0/plexus-2.0.0.pom
Downloaded: https://repo.cloudbees.com/content/repositories/central/org/codehaus/plexus/plexus/2.0.0/plexus-2.0.0.pom
(8 KB at 138.9 KB/sec)
Downloading: https://repository-jclouds.forge.cloudbees.com/release/com/google/code/google-collections/google-collect/snapshot-20080530/google-collect-snapshot-20080530.pom
Downloading: https://repo.cloudbees.com/content/repositories/central/com/google/code/google-collections/google-collect/snapshot-20080530/google-collect-snapshot-20080530.pom
Downloaded: https://repo.cloudbees.com/content/repositories/central/com/google/code/google-collections/google-collect/snapshot-20080530/google-collect-snapshot-20080530.pom
(2 KB at 37.3 KB/sec)
Downloading: https://repository-jclouds.forge.cloudbees.com/release/org/codehaus/plexus/plexus-component-annotations/1.0-beta-3.0.5/plexus-component-annotations-1.0-beta-3.0.5.pom
Downloading: https://repo.cloudbees.com/content/repositories/central/org/codehaus/plexus/plexus-component-annotations/1.0-beta-3.0.5/plexus-component-annotations-1.0-beta-3.0.5.pom
Downloaded: https://repo.cloudbees.com/content/repositories/central/org/codehaus/plexus/plexus-component-annotations/1.0-beta-3.0.5/plexus-component-annotations-1.0-beta-3.0.5.pom
(602 B at 36.7 KB/sec)
Downloading: https://repository-jclouds.forge.cloudbees.com/release/org/apache/maven/wagon/wagon-provider-api/1.0-beta-4/wagon-provider-api-1.0-beta-4.pom
Downloading: https://repo.cloudbees.com/content/repositories/central/org/apache/maven/wagon/wagon-provider-api/1.0-beta-4/wagon-provider-api-1.0-beta-4.pom
Downloaded: https://repo.cloudbees.com/content/repositories/central/org/apache/maven/wagon/wagon-provider-api/1.0-beta-4/wagon-provider-api-1.0-beta-4.pom
(906 B at 29.5 KB/sec)
Downloading: https://repository-jclouds.forge.cloudbees.com/release/org/apache/maven/wagon/wagon/1.0-beta-4/wagon-1.0-beta-4.pom
Downloading: https://repo.cloudbees.com/content/repositories/central/org/apache/maven/wagon/wagon/1.0-beta-4/wagon-1.0-beta-4.pom
Downloaded: https://repo.cloudbees.com/content/repositories/central/org/apache/maven/wagon/wagon/1.0-beta-4/wagon-1.0-beta-4.pom
(11 KB at 602.3 KB/sec)
Downloading: https://repository-jclouds.forge.cloudbees.com/release/org/codehaus/woodstox/wstx-asl/3.2.6/wstx-asl-3.2.6.pom
Downloading: https://repo.cloudbees.com/content/repositories/central/org/codehaus/woodstox/wstx-asl/3.2.6/wstx-asl-3.2.6.pom
Downloaded: https://repo.cloudbees.com/content/repositories/central/org/codehaus/woodstox/wstx-asl/3.2.6/wstx-asl-3.2.6.pom
(2 KB at 81.6 KB/sec)
Downloading: https://repository-jclouds.forge.cloudbees.com/release/stax/stax-api/1.0.1/stax-api-1.0.1.pom
Downloading: https://repo.cloudbees.com/content/repositories/central/stax/stax-api/1.0.1/stax-api-1.0.1.pom
Downloaded: https://repo.cloudbees.com/content/repositories/central/stax/stax-api/1.0.1/stax-api-1.0.1.pom
(2 KB at 87.7 KB/sec)
Downloading: https://repository-jclouds.forge.cloudbees.com/release/org/sonatype/spice/model-builder/1.3/model-builder-1.3.pom
Downloading: https://repo.cloudbees.com/content/repositories/central/org/sonatype/spice/model-builder/1.3/model-builder-1.3.pom
Downloaded: https://repo.cloudbees.com/content/repositories/central/org/sonatype/spice/model-builder/1.3/model-builder-1.3.pom
(3 KB at 112.5 KB/sec)
Downloading: https://repository-jclouds.forge.cloudbees.com/release/org/apache/maven/maven-project-builder/3.0-alpha-2/maven-project-builder-3.0-alpha-2.pom
Downloading: https://repo.cloudbees.com/content/repositories/central/org/apache/maven/maven-project-builder/3.0-alpha-2/maven-project-builder-3.0-alpha-2.pom
Downloaded: https://repo.cloudbees.com/content/repositories/central/org/apache/maven/maven-project-builder/3.0-alpha-2/maven-project-builder-3.0-alpha-2.pom
(2 KB at 102.9 KB/sec)
Downloading: https://repository-jclouds.forge.cloudbees.com/release/org/apache/felix/maven-bundle-plugin/2.4.0/maven-bundle-plugin-2.4.0.pom
Downloading: https://repo.cloudbees.com/content/repositories/central/org/apache/felix/maven-bundle-plugin/2.4.0/maven-bundle-plugin-2.4.0.pom
Downloaded: https://repo.cloudbees.com/content/repositories/central/org/apache/felix/maven-bundle-plugin/2.4.0/maven-bundle-plugin-2.4.0.pom
(4 KB at 281.0 KB/sec)
Downloading: https://repository-jclouds.forge.cloudbees.com/release/biz/aQute/bnd/bndlib/2.3.0/bndlib-2.3.0.pom
Downloading: https://repo.cloudbees.com/content/repositories/central/biz/aQute/bnd/bndlib/2.3.0/bndlib-2.3.0.pom
Downloaded: https://repo.cloudbees.com/content/repositories/central/biz/aQute/bnd/bndlib/2.3.0/bndlib-2.3.0.pom
(2 KB at 49.6 KB/sec)
Downloading: https://repository-jclouds.forge.cloudbees.com/release/biz/aQute/bnd/parent/2.3.0/parent-2.3.0.pom
Downloading: https://repo.cloudbees.com/content/repositories/central/biz/aQute/bnd/parent/2.3.0/parent-2.3.0.pom
Downloaded: https://repo.cloudbees.com/content/repositories/central/biz/aQute/bnd/parent/2.3.0/parent-2.3.0.pom
(5 KB at 270.1 KB/sec)
Downloading: https://repository-jclouds.forge.cloudbees.com/release/org/osgi/org.osgi.core/4.3.1/org.osgi.core-4.3.1.pom
Downloading: https://repo.cloudbees.com/content/repositories/central/org/osgi/org.osgi.core/4.3.1/org.osgi.core-4.3.1.pom
Downloaded: https://repo.cloudbees.com/content/repositories/central/org/osgi/org.osgi.core/4.3.1/org.osgi.core-4.3.1.pom
(2 KB at 76.7 KB/sec)
Downloading: https://repository-jclouds.forge.cloudbees.com/release/org/easymock/easymock/3.2/easymock-3.2.pom
Downloading: https://repo.cloudbees.com/content/repositories/central/org/easymock/easymock/3.2/easymock-3.2.pom
Downloaded: https://repo.cloudbees.com/content/repositories/central/org/easymock/easymock/3.2/easymock-3.2.pom
(5 KB at 214.2 KB/sec)
Downloading: https://repository-jclouds.forge.cloudbees.com/release/org/easymock/easymock-parent/3.2/easymock-parent-3.2.pom
Downloading: https://repo.cloudbees.com/content/repositories/central/org/easymock/easymock-parent/3.2/easymock-parent-3.2.pom
Downloaded: https://repo.cloudbees.com/content/repositories/central/org/easymock/easymock-parent/3.2/easymock-parent-3.2.pom
(17 KB at 842.5 KB/sec)
Downloading: https://repository-jclouds.forge.cloudbees.com/release/org/objenesis/objenesis/1.3/objenesis-1.3.pom
Downloading: https://repo.cloudbees.com/content/repositories/central/org/objenesis/objenesis/1.3/objenesis-1.3.pom
Downloaded: https://repo.cloudbees.com/content/repositories/central/org/objenesis/objenesis/1.3/objenesis-1.3.pom
(3 KB at 77.5 KB/sec)
Downloading: https://repository-jclouds.forge.cloudbees.com/release/org/objenesis/objenesis-parent/1.3/objenesis-parent-1.3.pom
Downloading: https://repo.cloudbees.com/content/repositories/central/org/objenesis/objenesis-parent/1.3/objenesis-parent-1.3.pom
Downloaded: https://repo.cloudbees.com/content/repositories/central/org/objenesis/objenesis-parent/1.3/objenesis-parent-1.3.pom
(14 KB at 891.0 KB/sec)
Downloading: https://repository-jclouds.forge.cloudbees.com/release/org/apache/maven/maven-plugin-api/3.0-alpha-2/maven-plugin-api-3.0-alpha-2.pom
Downloading: https://repo.cloudbees.com/content/repositories/central/org/apache/maven/maven-plugin-api/3.0-alpha-2/maven-plugin-api-3.0-alpha-2.pom
Downloaded: https://repo.cloudbees.com/content/repositories/central/org/apache/maven/maven-plugin-api/3.0-alpha-2/maven-plugin-api-3.0-alpha-2.pom
(2 KB at 107.3 KB/sec)
Downloading: https://repository-jclouds.forge.cloudbees.com/release/org/osgi/org.osgi.compendium/4.3.1/org.osgi.compendium-4.3.1.pom
Downloading: https://repo.cloudbees.com/content/repositories/central/org/osgi/org.osgi.compendium/4.3.1/org.osgi.compendium-4.3.1.pom
Downloaded: https://repo.cloudbees.com/content/repositories/central/org/osgi/org.osgi.compendium/4.3.1/org.osgi.compendium-4.3.1.pom
(2 KB at 99.4 KB/sec)
Downloading: https://repository-jclouds.forge.cloudbees.com/release/org/apache/servicemix/bundles/org.apache.servicemix.bundles.ant/1.8.4_1/org.apache.servicemix.bundles.ant-1.8.4_1.pom
Downloading: https://repo.cloudbees.com/content/repositories/central/org/apache/servicemix/bundles/org.apache.servicemix.bundles.ant/1.8.4_1/org.apache.servicemix.bundles.ant-1.8.4_1.pom
Downloaded: https://repo.cloudbees.com/content/repositories/central/org/apache/servicemix/bundles/org.apache.servicemix.bundles.ant/1.8.4_1/org.apache.servicemix.bundles.ant-1.8.4_1.pom
(4 KB at 69.1 KB/sec)
Downloading: https://repository-jclouds.forge.cloudbees.com/release/org/apache/servicemix/bundles/bundles-pom/10/bundles-pom-10.pom
Downloading: https://repo.cloudbees.com/content/repositories/central/org/apache/servicemix/bundles/bundles-pom/10/bundles-pom-10.pom
Downloaded: https://repo.cloudbees.com/content/repositories/central/org/apache/servicemix/bundles/bundles-pom/10/bundles-pom-10.pom
(15 KB at 532.7 KB/sec)
Downloading: https://repository-jclouds.forge.cloudbees.com/release/org/slf4j/slf4j-jdk14/1.7.7/slf4j-jdk14-1.7.7.jar
Downloading: https://repository-jclouds.forge.cloudbees.com/release/org/sonatype/sisu/sisu-inject-bean/2.3.0/sisu-inject-bean-2.3.0.jar
Downloading: https://repository-jclouds.forge.cloudbees.com/release/org/sonatype/sisu/sisu-guice/3.1.0/sisu-guice-3.1.0-no_aop.jar
Downloading: https://repository-jclouds.forge.cloudbees.com/release/org/sonatype/sisu/sisu-guava/0.9.9/sisu-guava-0.9.9.jar
Downloading: https://repository-jclouds.forge.cloudbees.com/release/org/codehaus/plexus/plexus-interpolation/1.1/plexus-interpolation-1.1.jar
Downloading: https://repository-jclouds.forge.cloudbees.com/release/com/google/code/google-collections/google-collect/snapshot-20080530/google-collect-snapshot-20080530.jar
Downloading: https://repository-jclouds.forge.cloudbees.com/release/stax/stax-api/1.0.1/stax-api-1.0.1.jar
Downloading: https://repository-jclouds.forge.cloudbees.com/release/org/codehaus/woodstox/wstx-asl/3.2.6/wstx-asl-3.2.6.jar
Downloading: https://repository-jclouds.forge.cloudbees.com/release/org/sonatype/spice/model-builder/1.3/model-builder-1.3.jar
Downloading: https://repository-jclouds.forge.cloudbees.com/release/org/apache/maven/maven-project-builder/3.0-alpha-2/maven-project-builder-3.0-alpha-2.jar
Downloading: https://repository-jclouds.forge.cloudbees.com/release/org/apache/felix/maven-bundle-plugin/2.4.0/maven-bundle-plugin-2.4.0.jar
Downloading: https://repository-jclouds.forge.cloudbees.com/release/biz/aQute/bnd/bndlib/2.3.0/bndlib-2.3.0.jar
Downloading: https://repository-jclouds.forge.cloudbees.com/release/org/osgi/org.osgi.core/4.3.1/org.osgi.core-4.3.1.jar
Downloading: https://repository-jclouds.forge.cloudbees.com/release/org/easymock/easymock/3.2/easymock-3.2.jar
Downloading: https://repository-jclouds.forge.cloudbees.com/release/org/objenesis/objenesis/1.3/objenesis-1.3.jar
Downloading: https://repository-jclouds.forge.cloudbees.com/release/org/osgi/org.osgi.compendium/4.3.1/org.osgi.compendium-4.3.1.jar
Downloading: https://repository-jclouds.forge.cloudbees.com/release/org/apache/servicemix/bundles/org.apache.servicemix.bundles.ant/1.8.4_1/org.apache.servicemix.bundles.ant-1.8.4_1.jar
Downloading: https://repo.cloudbees.com/content/repositories/central/org/slf4j/slf4j-jdk14/1.7.7/slf4j-jdk14-1.7.7.jar
Downloading: https://repo.cloudbees.com/content/repositories/central/org/sonatype/sisu/sisu-inject-bean/2.3.0/sisu-inject-bean-2.3.0.jar
Downloading: https://repo.cloudbees.com/content/repositories/central/org/sonatype/sisu/sisu-guice/3.1.0/sisu-guice-3.1.0-no_aop.jar
Downloading: https://repo.cloudbees.com/content/repositories/central/org/sonatype/sisu/sisu-guava/0.9.9/sisu-guava-0.9.9.jar
Downloading: https://repo.cloudbees.com/content/repositories/central/org/codehaus/plexus/plexus-interpolation/1.1/plexus-interpolation-1.1.jar
Downloaded: https://repo.cloudbees.com/content/repositories/central/org/slf4j/slf4j-jdk14/1.7.7/slf4j-jdk14-1.7.7.jar
(8 KB at 453.9 KB/sec)
Downloading: https://repo.cloudbees.com/content/repositories/central/com/google/code/google-collections/google-collect/snapshot-20080530/google-collect-snapshot-20080530.jar
Downloaded: https://repo.cloudbees.com/content/repositories/central/org/codehaus/plexus/plexus-interpolation/1.1/plexus-interpolation-1.1.jar
(35 KB at 1443.7 KB/sec)
Downloading: https://repo.cloudbees.com/content/repositories/central/org/codehaus/woodstox/wstx-asl/3.2.6/wstx-asl-3.2.6.jar
Downloaded: https://repo.cloudbees.com/content/repositories/central/org/sonatype/sisu/sisu-guice/3.1.0/sisu-guice-3.1.0-no_aop.jar
(350 KB at 7123.4 KB/sec)
Downloading: https://repo.cloudbees.com/content/repositories/central/stax/stax-api/1.0.1/stax-api-1.0.1.jar
Downloaded: https://repo.cloudbees.com/content/repositories/central/org/sonatype/sisu/sisu-inject-bean/2.3.0/sisu-inject-bean-2.3.0.jar
(283 KB at 5428.7 KB/sec)
Downloading: https://repo.cloudbees.com/content/repositories/central/org/sonatype/spice/model-builder/1.3/model-builder-1.3.jar
Downloaded: https://repo.cloudbees.com/content/repositories/central/org/sonatype/spice/model-builder/1.3/model-builder-1.3.jar
(35 KB at 1579.1 KB/sec)
Downloading: https://repo.cloudbees.com/content/repositories/central/org/apache/maven/maven-project-builder/3.0-alpha-2/maven-project-builder-3.0-alpha-2.jar
Downloaded: https://repo.cloudbees.com/content/repositories/central/stax/stax-api/1.0.1/stax-api-1.0.1.jar
(26 KB at 924.7 KB/sec)
Downloading: https://repo.cloudbees.com/content/repositories/central/org/apache/felix/maven-bundle-plugin/2.4.0/maven-bundle-plugin-2.4.0.jar
Downloaded: https://repo.cloudbees.com/content/repositories/central/org/sonatype/sisu/sisu-guava/0.9.9/sisu-guava-0.9.9.jar
(1473 KB at 18403.6 KB/sec)
Downloading: https://repo.cloudbees.com/content/repositories/central/biz/aQute/bnd/bndlib/2.3.0/bndlib-2.3.0.jar
Downloaded: https://repo.cloudbees.com/content/repositories/central/org/codehaus/woodstox/wstx-asl/3.2.6/wstx-asl-3.2.6.jar
(509 KB at 8915.7 KB/sec)
Downloading: https://repo.cloudbees.com/content/repositories/central/org/osgi/org.osgi.core/4.3.1/org.osgi.core-4.3.1.jar
Downloaded: https://repo.cloudbees.com/content/repositories/central/com/google/code/google-collections/google-collect/snapshot-20080530/google-collect-snapshot-20080530.jar
(490 KB at 6280.0 KB/sec)
Downloading: https://repo.cloudbees.com/content/repositories/central/org/easymock/easymock/3.2/easymock-3.2.jar
Downloaded: https://repo.cloudbees.com/content/repositories/central/org/apache/felix/maven-bundle-plugin/2.4.0/maven-bundle-plugin-2.4.0.jar
(124 KB at 4566.3 KB/sec)
Downloading: https://repo.cloudbees.com/content/repositories/central/org/objenesis/objenesis/1.3/objenesis-1.3.jar
Downloaded: https://repo.cloudbees.com/content/repositories/central/org/apache/maven/maven-project-builder/3.0-alpha-2/maven-project-builder-3.0-alpha-2.jar
(166 KB at 5003.4 KB/sec)
Downloading: https://repo.cloudbees.com/content/repositories/central/org/osgi/org.osgi.compendium/4.3.1/org.osgi.compendium-4.3.1.jar
Downloaded: https://repo.cloudbees.com/content/repositories/central/org/osgi/org.osgi.core/4.3.1/org.osgi.core-4.3.1.jar
(342 KB at 8763.6 KB/sec)
Downloading: https://repo.cloudbees.com/content/repositories/central/org/apache/servicemix/bundles/org.apache.servicemix.bundles.ant/1.8.4_1/org.apache.servicemix.bundles.ant-1.8.4_1.jar
Downloaded: https://repo.cloudbees.com/content/repositories/central/org/easymock/easymock/3.2/easymock-3.2.jar
(117 KB at 3899.1 KB/sec)
Downloaded: https://repo.cloudbees.com/content/repositories/central/org/objenesis/objenesis/1.3/objenesis-1.3.jar
(40 KB at 1015.8 KB/sec)
Downloaded: https://repo.cloudbees.com/content/repositories/central/biz/aQute/bnd/bndlib/2.3.0/bndlib-2.3.0.jar
(1744 KB at 18752.6 KB/sec)
Downloaded: https://repo.cloudbees.com/content/repositories/central/org/osgi/org.osgi.compendium/4.3.1/org.osgi.compendium-4.3.1.jar
(750 KB at 11525.6 KB/sec)
Downloaded: https://repo.cloudbees.com/content/repositories/central/org/apache/servicemix/bundles/org.apache.servicemix.bundles.ant/1.8.4_1/org.apache.servicemix.bundles.ant-1.8.4_1.jar
(1927 KB at 16326.4 KB/sec)
[INFO] Copying bundle: org.apache.karaf.assemblies.features:standard:xml:features:2.3.11
Downloading: https://repo.cloudbees.com/content/repositories/central/org/apache/karaf/assemblies/features/standard/2.3.11/standard-2.3.11-features.xml
Downloaded: https://repo.cloudbees.com/content/repositories/central/org/apache/karaf/assemblies/features/standard/2.3.11/standard-2.3.11-features.xml
(38 KB at 825.1 KB/sec)
[INFO] Copying bundle: org.apache.karaf.assemblies.features:enterprise:xml:features:2.3.11
Downloading: https://repo.cloudbees.com/content/repositories/central/org/apache/karaf/assemblies/features/enterprise/2.3.11/enterprise-2.3.11-features.xml
Downloaded: https://repo.cloudbees.com/content/repositories/central/org/apache/karaf/assemblies/features/enterprise/2.3.11/enterprise-2.3.11-features.xml
(20 KB at 406.2 KB/sec)
[INFO] Copying bundle: org.apache.karaf.assemblies.features:enterprise:xml:features:2.3.11
[INFO] Copying bundle: org.ops4j.pax.cdi:pax-cdi-features:xml:features:0.8.0
Downloading: https://repo.cloudbees.com/content/repositories/central/org/ops4j/pax/cdi/pax-cdi-features/0.8.0/pax-cdi-features-0.8.0-features.xml
Downloaded: https://repo.cloudbees.com/content/repositories/central/org/ops4j/pax/cdi/pax-cdi-features/0.8.0/pax-cdi-features-0.8.0-features.xml
(11 KB at 276.2 KB/sec)
[INFO] Copying bundle: org.apache.karaf.assemblies.features:standard:xml:features:2.3.11
[INFO] Copying bundle: org.apache.karaf.assemblies.features:standard:xml:features:2.3.11
[INFO] Copying bundle: org.apache.jclouds.karaf:jclouds-karaf:xml:features:2.1.0-SNAPSHOT
Downloading: https://repository-jclouds.forge.cloudbees.com/snapshot/org/apache/jclouds/karaf/jclouds-karaf/2.1.0-SNAPSHOT/maven-metadata.xml
Downloading: http://repository.apache.org/snapshots/org/apache/jclouds/karaf/jclouds-karaf/2.1.0-SNAPSHOT/maven-metadata.xml
Downloading: https://repository.apache.org/content/repositories/snapshots/org/apache/jclouds/karaf/jclouds-karaf/2.1.0-SNAPSHOT/maven-metadata.xml
Downloaded: http://repository.apache.org/snapshots/org/apache/jclouds/karaf/jclouds-karaf/2.1.0-SNAPSHOT/maven-metadata.xml
(2 KB at 28.7 KB/sec)
Downloaded: https://repository.apache.org/content/repositories/snapshots/org/apache/jclouds/karaf/jclouds-karaf/2.1.0-SNAPSHOT/maven-metadata.xml
(2 KB at 28.1 KB/sec)
Started calculate disk usage of build
Finished Calculation of disk usage of build in 0 seconds
Started calculate disk usage of workspace
Finished Calculation of disk usage of workspace in 0 seconds
[INFO] ------------------------------------------------------------------------
[INFO] Reactor Summary:
[INFO] 
[INFO] Apache jclouds :: cli ............................. SUCCESS [14.829s]
[INFO] jclouds :: cli :: branding ........................ SUCCESS [4.266s]
[INFO] jclouds :: cli :: runner .......................... SUCCESS [26.392s]
[INFO] jclouds :: cli :: assembly ........................ FAILURE [19.494s]
[INFO] Apache jclouds :: cli ............................. SKIPPED
[INFO] ------------------------------------------------------------------------
[INFO] BUILD FAILURE
[INFO] ------------------------------------------------------------------------
[INFO] Total time: 1:08.263s
[INFO] Finished at: Sat Apr 08 08:15:32 EDT 2017
[INFO] Final Memory: 52M/244M
[INFO] ------------------------------------------------------------------------
Waiting for Jenkins to finish collecting data
[ERROR] Failed to execute goal org.apache.karaf.tooling:features-maven-plugin:2.3.11:add-features-to-repo
(add-features-to-repo) on project jclouds-cli-assembly: Error populating repository: Unable
to find the feature 'jclouds-api-cloudsigma2' -> [Help 1]
org.apache.maven.lifecycle.LifecycleExecutionException: Failed to execute goal org.apache.karaf.tooling:features-maven-plugin:2.3.11:add-features-to-repo
(add-features-to-repo) on project jclouds-cli-assembly: Error populating repository
	at org.apache.maven.lifecycle.internal.MojoExecutor.execute(MojoExecutor.java:217)
	at org.apache.maven.lifecycle.internal.MojoExecutor.execute(MojoExecutor.java:153)
	at org.apache.maven.lifecycle.internal.MojoExecutor.execute(MojoExecutor.java:145)
	at org.apache.maven.lifecycle.internal.LifecycleModuleBuilder.buildProject(LifecycleModuleBuilder.java:84)
	at org.apache.maven.lifecycle.internal.LifecycleModuleBuilder.buildProject(LifecycleModuleBuilder.java:59)
	at org.apache.maven.lifecycle.internal.LifecycleStarter.singleThreadedBuild(LifecycleStarter.java:183)
	at org.apache.maven.lifecycle.internal.LifecycleStarter.execute(LifecycleStarter.java:161)
	at org.apache.maven.DefaultMaven.doExecute(DefaultMaven.java:320)
	at org.apache.maven.DefaultMaven.execute(DefaultMaven.java:156)
	at org.jvnet.hudson.maven3.launcher.Maven3Launcher.main(Maven3Launcher.java:117)
	at sun.reflect.NativeMethodAccessorImpl.invoke0(Native Method)
	at sun.reflect.NativeMethodAccessorImpl.invoke(NativeMethodAccessorImpl.java:57)
	at sun.reflect.DelegatingMethodAccessorImpl.invoke(DelegatingMethodAccessorImpl.java:43)
	at java.lang.reflect.Method.invoke(Method.java:606)
	at org.codehaus.plexus.classworlds.launcher.Launcher.launchStandard(Launcher.java:329)
	at org.codehaus.plexus.classworlds.launcher.Launcher.launch(Launcher.java:239)
	at org.jvnet.hudson.maven3.agent.Maven3Main.launch(Maven3Main.java:181)
	at sun.reflect.NativeMethodAccessorImpl.invoke0(Native Method)
	at sun.reflect.NativeMethodAccessorImpl.invoke(NativeMethodAccessorImpl.java:57)
	at sun.reflect.DelegatingMethodAccessorImpl.invoke(DelegatingMethodAccessorImpl.java:43)
	at java.lang.reflect.Method.invoke(Method.java:606)
	at hudson.maven.Maven3Builder.call(Maven3Builder.java:139)
	at hudson.maven.Maven3Builder.call(Maven3Builder.java:70)
	at hudson.remoting.UserRequest.perform(UserRequest.java:153)
	at hudson.remoting.UserRequest.perform(UserRequest.java:50)
	at hudson.remoting.Request$2.run(Request.java:336)
	at hudson.remoting.InterceptingExecutorService$1.call(InterceptingExecutorService.java:68)
	at java.util.concurrent.FutureTask.run(FutureTask.java:262)
	at java.util.concurrent.ThreadPoolExecutor.runWorker(ThreadPoolExecutor.java:1145)
	at java.util.concurrent.ThreadPoolExecutor$Worker.run(ThreadPoolExecutor.java:615)
	at java.lang.Thread.run(Thread.java:745)
Caused by: org.apache.maven.plugin.MojoExecutionException: Error populating repository
	at org.apache.karaf.tooling.features.AddFeaturesToRepoMojo.execute(AddFeaturesToRepoMojo.java:226)
	at org.apache.maven.plugin.DefaultBuildPluginManager.executeMojo(DefaultBuildPluginManager.java:101)
	at org.apache.maven.lifecycle.internal.MojoExecutor.execute(MojoExecutor.java:209)
	... 30 more
Caused by: java.lang.IllegalArgumentException: Unable to find the feature 'jclouds-api-cloudsigma2'
	at org.apache.karaf.tooling.features.AddFeaturesToRepoMojo.addFeatures(AddFeaturesToRepoMojo.java:328)
	at org.apache.karaf.tooling.features.AddFeaturesToRepoMojo.execute(AddFeaturesToRepoMojo.java:165)
	... 32 more
[ERROR] 
[ERROR] Re-run Maven using the -X switch to enable full debug logging.
[ERROR] 
[ERROR] For more information about the errors and possible solutions, please read the following
articles:
[ERROR] [Help 1] http://cwiki.apache.org/confluence/display/MAVEN/MojoExecutionException
[ERROR] 
[ERROR] After correcting the problems, you can resume the build with the command
[ERROR]   mvn <goals> -rf :jclouds-cli-assembly
[JENKINS] Archiving <https://jclouds.ci.cloudbees.com/job/jclouds-cli/ws/branding/pom.xml>
to org.apache.jclouds.cli/jclouds-cli-branding/2.1.0-SNAPSHOT/jclouds-cli-branding-2.1.0-SNAPSHOT.pom
[JENKINS] Archiving <https://jclouds.ci.cloudbees.com/job/jclouds-cli/ws/branding/target/jclouds-cli-branding-2.1.0-SNAPSHOT.jar>
to org.apache.jclouds.cli/jclouds-cli-branding/2.1.0-20170408.121444-70/jclouds-cli-branding-2.1.0-20170408.121444-70.jar
[JENKINS] Archiving <https://jclouds.ci.cloudbees.com/job/jclouds-cli/ws/branding/target/jclouds-cli-branding-2.1.0-SNAPSHOT-tests.jar>
to org.apache.jclouds.cli/jclouds-cli-branding/2.1.0-20170408.121444-70/jclouds-cli-branding-2.1.0-20170408.121444-70-tests.jar
[JENKINS] Archiving <https://jclouds.ci.cloudbees.com/job/jclouds-cli/ws/branding/target/jclouds-cli-branding-2.1.0-SNAPSHOT-sources.jar>
to org.apache.jclouds.cli/jclouds-cli-branding/2.1.0-20170408.121444-70/jclouds-cli-branding-2.1.0-20170408.121444-70-sources.jar
[JENKINS] Archiving <https://jclouds.ci.cloudbees.com/job/jclouds-cli/ws/branding/target/jclouds-cli-branding-2.1.0-SNAPSHOT-test-sources.jar>
to org.apache.jclouds.cli/jclouds-cli-branding/2.1.0-20170408.121444-70/jclouds-cli-branding-2.1.0-20170408.121444-70-test-sources.jar
[JENKINS] Archiving <https://jclouds.ci.cloudbees.com/job/jclouds-cli/ws/assembly/pom.xml>
to org.apache.jclouds.cli/jclouds-cli-assembly/2.1.0-SNAPSHOT/jclouds-cli-assembly-2.1.0-SNAPSHOT.pom
[JENKINS] Archiving <https://jclouds.ci.cloudbees.com/job/jclouds-cli/ws/pom.xml> to
org.apache.jclouds.cli/jclouds-cli/2.1.0-SNAPSHOT/jclouds-cli-2.1.0-SNAPSHOT.pom
[JENKINS] Archiving <https://jclouds.ci.cloudbees.com/job/jclouds-cli/ws/runner/pom.xml>
to org.apache.jclouds.cli/jclouds-cli-runner/2.1.0-SNAPSHOT/jclouds-cli-runner-2.1.0-SNAPSHOT.pom
[JENKINS] Archiving <https://jclouds.ci.cloudbees.com/job/jclouds-cli/ws/runner/target/jclouds-cli-runner-2.1.0-SNAPSHOT.jar>
to org.apache.jclouds.cli/jclouds-cli-runner/2.1.0-20170408.121511-68/jclouds-cli-runner-2.1.0-20170408.121511-68.jar
[JENKINS] Archiving <https://jclouds.ci.cloudbees.com/job/jclouds-cli/ws/runner/target/jclouds-cli-runner-2.1.0-SNAPSHOT-tests.jar>
to org.apache.jclouds.cli/jclouds-cli-runner/2.1.0-20170408.121511-68/jclouds-cli-runner-2.1.0-20170408.121511-68-tests.jar
[JENKINS] Archiving <https://jclouds.ci.cloudbees.com/job/jclouds-cli/ws/runner/target/jclouds-cli-runner-2.1.0-SNAPSHOT-javadoc.jar>
to org.apache.jclouds.cli/jclouds-cli-runner/2.1.0-20170408.121511-68/jclouds-cli-runner-2.1.0-20170408.121511-68-javadoc.jar
[JENKINS] Archiving <https://jclouds.ci.cloudbees.com/job/jclouds-cli/ws/runner/target/jclouds-cli-runner-2.1.0-SNAPSHOT-sources.jar>
to org.apache.jclouds.cli/jclouds-cli-runner/2.1.0-20170408.121511-68/jclouds-cli-runner-2.1.0-20170408.121511-68-sources.jar
[JENKINS] Archiving <https://jclouds.ci.cloudbees.com/job/jclouds-cli/ws/runner/target/jclouds-cli-runner-2.1.0-SNAPSHOT-test-sources.jar>
to org.apache.jclouds.cli/jclouds-cli-runner/2.1.0-20170408.121511-68/jclouds-cli-runner-2.1.0-20170408.121511-68-test-sources.jar
[JENKINS] Archiving <https://jclouds.ci.cloudbees.com/job/jclouds-cli/ws/project/pom.xml>
to org.apache.jclouds.cli/jclouds-cli-project/2.1.0-SNAPSHOT/jclouds-cli-project-2.1.0-SNAPSHOT.pom
[JENKINS] Archiving <https://jclouds.ci.cloudbees.com/job/jclouds-cli/ws/project/target/jclouds-cli-project-2.1.0-SNAPSHOT-tests.jar>
to org.apache.jclouds.cli/jclouds-cli-project/2.1.0-20170408.121440-70/jclouds-cli-project-2.1.0-20170408.121440-70-tests.jar
channel stopped
Started calculate disk usage of build
Finished Calculation of disk usage of build in 0 seconds
Started calculate disk usage of workspace
Finished Calculation of disk usage of workspace in 0 seconds

Mime
View raw message