jclouds-notifications mailing list archives

Site index · List index
Message view « Date » · « Thread »
Top « Date » · « Thread »
From jenkins-no-re...@cloudbees.com
Subject Build failed in Jenkins: jclouds-labs-aws-2.0.x-branch #94
Date Thu, 06 Jul 2017 13:47:34 GMT
See <https://jclouds.ci.cloudbees.com/job/jclouds-labs-aws-2.0.x-branch/94/display/redirect?page=changes>

Changes:

[Ignasi Barrera] Apache jclouds 2.0.2-rc1 release

[Ignasi Barrera] Next development version 2.0.3-SNAPSHOT

------------------------------------------
[...truncated 334.14 KB...]
Downloaded: https://repo.cloudbees.com/content/repositories/central/org/bouncycastle/bcprov-ext-jdk15on/1.51/bcprov-ext-jdk15on-1.51.jar
(2841 KB at 10557.8 KB/sec)
Downloading: https://repo.cloudbees.com/content/repositories/central/ch/qos/logback/logback-classic/1.1.2/logback-classic-1.1.2.jar
Downloaded: https://repo.cloudbees.com/content/repositories/central/com/jcraft/jsch.agentproxy.pageant/0.0.9/jsch.agentproxy.pageant-0.0.9.jar
(8 KB at 191.6 KB/sec)
Downloading: https://repo.cloudbees.com/content/repositories/central/ch/qos/logback/logback-core/1.1.2/logback-core-1.1.2.jar
Downloaded: https://repository.apache.org/content/repositories/snapshots/org/apache/jclouds/jclouds-loadbalancer/2.0.3-SNAPSHOT/jclouds-loadbalancer-2.0.3-20170706.133718-1-tests.jar
(13 KB at 303.3 KB/sec)
Downloading: https://repo.cloudbees.com/content/repositories/central/com/squareup/okhttp/mockwebserver/2.2.0/mockwebserver-2.2.0.jar
Downloaded: https://repo.cloudbees.com/content/repositories/central/ch/qos/logback/logback-classic/1.1.2/logback-classic-1.1.2.jar
(265 KB at 7344.6 KB/sec)
Downloading: https://repo.cloudbees.com/content/repositories/central/com/squareup/okhttp/okhttp/2.2.0/okhttp-2.2.0.jar
Downloaded: https://repo.cloudbees.com/content/repositories/central/net/java/dev/jna/jna/4.1.0/jna-4.1.0.jar
(894 KB at 4135.0 KB/sec)
Downloading: https://repo.cloudbees.com/content/repositories/central/com/squareup/okio/okio/1.2.0/okio-1.2.0.jar
Downloaded: https://repo.cloudbees.com/content/repositories/central/com/squareup/okhttp/mockwebserver/2.2.0/mockwebserver-2.2.0.jar
(40 KB at 598.1 KB/sec)
Downloaded: https://repo.cloudbees.com/content/repositories/central/com/squareup/okhttp/okhttp/2.2.0/okhttp-2.2.0.jar
(304 KB at 3750.3 KB/sec)
Downloaded: https://repo.cloudbees.com/content/repositories/central/com/squareup/okio/okio/1.2.0/okio-1.2.0.jar
(54 KB at 1190.2 KB/sec)
Downloaded: https://repo.cloudbees.com/content/repositories/central/ch/qos/logback/logback-core/1.1.2/logback-core-1.1.2.jar
(418 KB at 3341.6 KB/sec)
Downloaded: https://repo.cloudbees.com/content/repositories/central/net/java/dev/jna/jna-platform/4.1.0/jna-platform-4.1.0.jar
(1431 KB at 5521.6 KB/sec)
[INFO] ------------------------------------------------------------------------
[INFO] Reactor Summary:
[INFO] 
[INFO] Apache jclouds labs aws ........................... FAILURE [28.528s]
[INFO] jcloud elb api .................................... SKIPPED
[INFO] jcloud iam api .................................... SKIPPED
[INFO] jcloud rds api .................................... SKIPPED
[INFO] Apache jclouds :: AWS :: Glacier API .............. SKIPPED
[INFO] jclouds Amazon Elastic Load Balancer provider ..... SKIPPED
[INFO] jclouds Amazon Identity and Access Management (IAM) provider  SKIPPED
[INFO] jclouds Amazon Relational Database Service provider  SKIPPED
[INFO] ------------------------------------------------------------------------
[INFO] BUILD FAILURE
[INFO] ------------------------------------------------------------------------
[INFO] Total time: 34.913s
[INFO] Finished at: Thu Jul 06 09:47:33 EDT 2017
[INFO] Final Memory: 31M/122M
[INFO] ------------------------------------------------------------------------
Waiting for Jenkins to finish collecting data
[ERROR] Failed to execute goal org.apache.maven.plugins:maven-javadoc-plugin:2.9:aggregate-jar
(javadoc) on project jclouds-labs-aws: MavenReportException: Error while creating archive:
Missing:
[ERROR] ----------
[ERROR] 1) org.apache.jclouds.provider:aws-ec2:jar:2.0.3-SNAPSHOT
[ERROR] 
[ERROR] Try downloading the file manually from the project website.
[ERROR] 
[ERROR] Then, install it using the command:
[ERROR] mvn install:install-file -DgroupId=org.apache.jclouds.provider -DartifactId=aws-ec2
-Dversion=2.0.3-SNAPSHOT -Dpackaging=jar -Dfile=/path/to/file
[ERROR] 
[ERROR] Alternatively, if you host your own repository you can deploy the file there:
[ERROR] mvn deploy:deploy-file -DgroupId=org.apache.jclouds.provider -DartifactId=aws-ec2
-Dversion=2.0.3-SNAPSHOT -Dpackaging=jar -Dfile=/path/to/file -Durl=[url] -DrepositoryId=[id]
[ERROR] 
[ERROR] Path to dependency:
[ERROR] 1) org.apache.jclouds.labs:elb:bundle:2.0.3-SNAPSHOT
[ERROR] 2) org.apache.jclouds.provider:aws-ec2:jar:2.0.3-SNAPSHOT
[ERROR] 
[ERROR] ----------
[ERROR] 1 required artifact is missing.
[ERROR] 
[ERROR] for artifact:
[ERROR] org.apache.jclouds.labs:elb:bundle:2.0.3-SNAPSHOT
[ERROR] 
[ERROR] from the specified remote repositories:
[ERROR] central (https://repo.cloudbees.com/content/repositories/central, releases=true, snapshots=false),
[ERROR] cloudbees-private-snapshot-repository (https://repository-jclouds.forge.cloudbees.com/snapshot,
releases=false, snapshots=true),
[ERROR] cloudbees-private-release-repository (https://repository-jclouds.forge.cloudbees.com/release,
releases=true, snapshots=false),
[ERROR] apache-snapshots (https://repository.apache.org/content/repositories/snapshots, releases=false,
snapshots=true),
[ERROR] sonatype-nexus-snapshots (https://oss.sonatype.org/content/repositories/snapshots,
releases=false, snapshots=true),
[ERROR] apache.snapshots (http://repository.apache.org/snapshots, releases=false, snapshots=true)
[ERROR] -> [Help 1]
org.apache.maven.lifecycle.LifecycleExecutionException: Failed to execute goal org.apache.maven.plugins:maven-javadoc-plugin:2.9:aggregate-jar
(javadoc) on project jclouds-labs-aws: MavenReportException: Error while creating archive:
Missing:
----------
1) org.apache.jclouds.provider:aws-ec2:jar:2.0.3-SNAPSHOT

  Try downloading the file manually from the project website.

  Then, install it using the command: 
      mvn install:install-file -DgroupId=org.apache.jclouds.provider -DartifactId=aws-ec2
-Dversion=2.0.3-SNAPSHOT -Dpackaging=jar -Dfile=/path/to/file

  Alternatively, if you host your own repository you can deploy the file there: 
      mvn deploy:deploy-file -DgroupId=org.apache.jclouds.provider -DartifactId=aws-ec2 -Dversion=2.0.3-SNAPSHOT
-Dpackaging=jar -Dfile=/path/to/file -Durl=[url] -DrepositoryId=[id]

  Path to dependency: 
  	1) org.apache.jclouds.labs:elb:bundle:2.0.3-SNAPSHOT
  	2) org.apache.jclouds.provider:aws-ec2:jar:2.0.3-SNAPSHOT

----------
1 required artifact is missing.

for artifact: 
  org.apache.jclouds.labs:elb:bundle:2.0.3-SNAPSHOT

from the specified remote repositories:
  central (https://repo.cloudbees.com/content/repositories/central, releases=true, snapshots=false),
  cloudbees-private-snapshot-repository (https://repository-jclouds.forge.cloudbees.com/snapshot,
releases=false, snapshots=true),
  cloudbees-private-release-repository (https://repository-jclouds.forge.cloudbees.com/release,
releases=true, snapshots=false),
  apache-snapshots (https://repository.apache.org/content/repositories/snapshots, releases=false,
snapshots=true),
  sonatype-nexus-snapshots (https://oss.sonatype.org/content/repositories/snapshots, releases=false,
snapshots=true),
  apache.snapshots (http://repository.apache.org/snapshots, releases=false, snapshots=true)

	at org.apache.maven.lifecycle.internal.MojoExecutor.execute(MojoExecutor.java:217)
	at org.apache.maven.lifecycle.internal.MojoExecutor.execute(MojoExecutor.java:153)
	at org.apache.maven.lifecycle.internal.MojoExecutor.execute(MojoExecutor.java:145)
	at org.apache.maven.lifecycle.internal.LifecycleModuleBuilder.buildProject(LifecycleModuleBuilder.java:84)
	at org.apache.maven.lifecycle.internal.LifecycleModuleBuilder.buildProject(LifecycleModuleBuilder.java:59)
	at org.apache.maven.lifecycle.internal.LifecycleStarter.singleThreadedBuild(LifecycleStarter.java:183)
	at org.apache.maven.lifecycle.internal.LifecycleStarter.execute(LifecycleStarter.java:161)
	at org.apache.maven.DefaultMaven.doExecute(DefaultMaven.java:320)
	at org.apache.maven.DefaultMaven.execute(DefaultMaven.java:156)
	at org.jvnet.hudson.maven3.launcher.Maven3Launcher.main(Maven3Launcher.java:117)
	at sun.reflect.NativeMethodAccessorImpl.invoke0(Native Method)
	at sun.reflect.NativeMethodAccessorImpl.invoke(NativeMethodAccessorImpl.java:57)
	at sun.reflect.DelegatingMethodAccessorImpl.invoke(DelegatingMethodAccessorImpl.java:43)
	at java.lang.reflect.Method.invoke(Method.java:606)
	at org.codehaus.plexus.classworlds.launcher.Launcher.launchStandard(Launcher.java:329)
	at org.codehaus.plexus.classworlds.launcher.Launcher.launch(Launcher.java:239)
	at org.jvnet.hudson.maven3.agent.Maven3Main.launch(Maven3Main.java:181)
	at sun.reflect.NativeMethodAccessorImpl.invoke0(Native Method)
	at sun.reflect.NativeMethodAccessorImpl.invoke(NativeMethodAccessorImpl.java:57)
	at sun.reflect.DelegatingMethodAccessorImpl.invoke(DelegatingMethodAccessorImpl.java:43)
	at java.lang.reflect.Method.invoke(Method.java:606)
	at hudson.maven.Maven3Builder.call(Maven3Builder.java:139)
	at hudson.maven.Maven3Builder.call(Maven3Builder.java:70)
	at hudson.remoting.UserRequest.perform(UserRequest.java:153)
	at hudson.remoting.UserRequest.perform(UserRequest.java:50)
	at hudson.remoting.Request$2.run(Request.java:336)
	at hudson.remoting.InterceptingExecutorService$1.call(InterceptingExecutorService.java:68)
	at java.util.concurrent.FutureTask.run(FutureTask.java:262)
	at java.util.concurrent.ThreadPoolExecutor.runWorker(ThreadPoolExecutor.java:1145)
	at java.util.concurrent.ThreadPoolExecutor$Worker.run(ThreadPoolExecutor.java:615)
	at java.lang.Thread.run(Thread.java:745)
Caused by: org.apache.maven.plugin.MojoExecutionException: MavenReportException: Error while
creating archive: Missing:
----------
1) org.apache.jclouds.provider:aws-ec2:jar:2.0.3-SNAPSHOT

  Try downloading the file manually from the project website.

  Then, install it using the command: 
      mvn install:install-file -DgroupId=org.apache.jclouds.provider -DartifactId=aws-ec2
-Dversion=2.0.3-SNAPSHOT -Dpackaging=jar -Dfile=/path/to/file

  Alternatively, if you host your own repository you can deploy the file there: 
      mvn deploy:deploy-file -DgroupId=org.apache.jclouds.provider -DartifactId=aws-ec2 -Dversion=2.0.3-SNAPSHOT
-Dpackaging=jar -Dfile=/path/to/file -Durl=[url] -DrepositoryId=[id]

  Path to dependency: 
  	1) org.apache.jclouds.labs:elb:bundle:2.0.3-SNAPSHOT
  	2) org.apache.jclouds.provider:aws-ec2:jar:2.0.3-SNAPSHOT

----------
1 required artifact is missing.

for artifact: 
  org.apache.jclouds.labs:elb:bundle:2.0.3-SNAPSHOT

from the specified remote repositories:
  central (https://repo.cloudbees.com/content/repositories/central, releases=true, snapshots=false),
  cloudbees-private-snapshot-repository (https://repository-jclouds.forge.cloudbees.com/snapshot,
releases=false, snapshots=true),
  cloudbees-private-release-repository (https://repository-jclouds.forge.cloudbees.com/release,
releases=true, snapshots=false),
  apache-snapshots (https://repository.apache.org/content/repositories/snapshots, releases=false,
snapshots=true),
  sonatype-nexus-snapshots (https://oss.sonatype.org/content/repositories/snapshots, releases=false,
snapshots=true),
  apache.snapshots (http://repository.apache.org/snapshots, releases=false, snapshots=true)

	at org.apache.maven.plugin.javadoc.AbstractJavadocMojo.failOnError(AbstractJavadocMojo.java:5826)
	at org.apache.maven.plugin.javadoc.JavadocJar.execute(JavadocJar.java:209)
	at org.apache.maven.plugin.DefaultBuildPluginManager.executeMojo(DefaultBuildPluginManager.java:101)
	at org.apache.maven.lifecycle.internal.MojoExecutor.execute(MojoExecutor.java:209)
	... 30 more
Caused by: org.apache.maven.reporting.MavenReportException: Missing:
----------
1) org.apache.jclouds.provider:aws-ec2:jar:2.0.3-SNAPSHOT

  Try downloading the file manually from the project website.

  Then, install it using the command: 
      mvn install:install-file -DgroupId=org.apache.jclouds.provider -DartifactId=aws-ec2
-Dversion=2.0.3-SNAPSHOT -Dpackaging=jar -Dfile=/path/to/file

  Alternatively, if you host your own repository you can deploy the file there: 
      mvn deploy:deploy-file -DgroupId=org.apache.jclouds.provider -DartifactId=aws-ec2 -Dversion=2.0.3-SNAPSHOT
-Dpackaging=jar -Dfile=/path/to/file -Durl=[url] -DrepositoryId=[id]

  Path to dependency: 
  	1) org.apache.jclouds.labs:elb:bundle:2.0.3-SNAPSHOT
  	2) org.apache.jclouds.provider:aws-ec2:jar:2.0.3-SNAPSHOT

----------
1 required artifact is missing.

for artifact: 
  org.apache.jclouds.labs:elb:bundle:2.0.3-SNAPSHOT

from the specified remote repositories:
  central (https://repo.cloudbees.com/content/repositories/central, releases=true, snapshots=false),
  cloudbees-private-snapshot-repository (https://repository-jclouds.forge.cloudbees.com/snapshot,
releases=false, snapshots=true),
  cloudbees-private-release-repository (https://repository-jclouds.forge.cloudbees.com/release,
releases=true, snapshots=false),
  apache-snapshots (https://repository.apache.org/content/repositories/snapshots, releases=false,
snapshots=true),
  sonatype-nexus-snapshots (https://oss.sonatype.org/content/repositories/snapshots, releases=false,
snapshots=true),
  apache.snapshots (http://repository.apache.org/snapshots, releases=false, snapshots=true)

	at org.apache.maven.plugin.javadoc.AbstractJavadocMojo.getClasspath(AbstractJavadocMojo.java:2438)
	at org.apache.maven.plugin.javadoc.AbstractJavadocMojo.addJavadocOptions(AbstractJavadocMojo.java:4536)
	at org.apache.maven.plugin.javadoc.AbstractJavadocMojo.executeReport(AbstractJavadocMojo.java:1937)
	at org.apache.maven.plugin.javadoc.JavadocJar.execute(JavadocJar.java:181)
	... 32 more
Caused by: org.apache.maven.artifact.resolver.MultipleArtifactsNotFoundException: Missing:
----------
1) org.apache.jclouds.provider:aws-ec2:jar:2.0.3-SNAPSHOT

  Try downloading the file manually from the project website.

  Then, install it using the command: 
      mvn install:install-file -DgroupId=org.apache.jclouds.provider -DartifactId=aws-ec2
-Dversion=2.0.3-SNAPSHOT -Dpackaging=jar -Dfile=/path/to/file

  Alternatively, if you host your own repository you can deploy the file there: 
      mvn deploy:deploy-file -DgroupId=org.apache.jclouds.provider -DartifactId=aws-ec2 -Dversion=2.0.3-SNAPSHOT
-Dpackaging=jar -Dfile=/path/to/file -Durl=[url] -DrepositoryId=[id]

  Path to dependency: 
  	1) org.apache.jclouds.labs:elb:bundle:2.0.3-SNAPSHOT
  	2) org.apache.jclouds.provider:aws-ec2:jar:2.0.3-SNAPSHOT

----------
1 required artifact is missing.

for artifact: 
  org.apache.jclouds.labs:elb:bundle:2.0.3-SNAPSHOT

from the specified remote repositories:
  central (https://repo.cloudbees.com/content/repositories/central, releases=true, snapshots=false),
  cloudbees-private-snapshot-repository (https://repository-jclouds.forge.cloudbees.com/snapshot,
releases=false, snapshots=true),
  cloudbees-private-release-repository (https://repository-jclouds.forge.cloudbees.com/release,
releases=true, snapshots=false),
  apache-snapshots (https://repository.apache.org/content/repositories/snapshots, releases=false,
snapshots=true),
  sonatype-nexus-snapshots (https://oss.sonatype.org/content/repositories/snapshots, releases=false,
snapshots=true),
  apache.snapshots (http://repository.apache.org/snapshots, releases=false, snapshots=true)

	at org.apache.maven.artifact.resolver.DefaultResolutionErrorHandler.throwErrors(DefaultResolutionErrorHandler.java:71)
	at org.apache.maven.artifact.resolver.DefaultArtifactResolver.resolveWithExceptions(DefaultArtifactResolver.java:326)
	at org.apache.maven.artifact.resolver.DefaultArtifactResolver.resolveTransitively(DefaultArtifactResolver.java:314)
	at org.apache.maven.artifact.resolver.DefaultArtifactResolver.resolveTransitively(DefaultArtifactResolver.java:293)
	at org.apache.maven.artifact.resolver.DefaultArtifactResolver.resolveTransitively(DefaultArtifactResolver.java:271)
	at org.apache.maven.artifact.resolver.DefaultArtifactResolver.resolveTransitively(DefaultArtifactResolver.java:264)
	at org.apache.maven.plugin.javadoc.AbstractJavadocMojo.getClasspath(AbstractJavadocMojo.java:2423)
	... 35 more
[ERROR] 
[ERROR] Re-run Maven using the -X switch to enable full debug logging.
[ERROR] 
[ERROR] For more information about the errors and possible solutions, please read the following
articles:
[ERROR] [Help 1] http://cwiki.apache.org/confluence/display/MAVEN/MojoExecutionException
[JENKINS] Archiving <https://jclouds.ci.cloudbees.com/job/jclouds-labs-aws-2.0.x-branch/ws/rds/pom.xml>
to org.apache.jclouds.labs/rds/2.0.3-SNAPSHOT/rds-2.0.3-SNAPSHOT.pom
[JENKINS] Archiving <https://jclouds.ci.cloudbees.com/job/jclouds-labs-aws-2.0.x-branch/ws/pom.xml>
to org.apache.jclouds.labs/jclouds-labs-aws/2.0.3-SNAPSHOT/jclouds-labs-aws-2.0.3-SNAPSHOT.pom
[JENKINS] Archiving <https://jclouds.ci.cloudbees.com/job/jclouds-labs-aws-2.0.x-branch/ws/target/jclouds-labs-aws-2.0.3-SNAPSHOT-tests.jar>
to org.apache.jclouds.labs/jclouds-labs-aws/2.0.3-SNAPSHOT/jclouds-labs-aws-2.0.3-SNAPSHOT-tests.jar
[JENKINS] Archiving <https://jclouds.ci.cloudbees.com/job/jclouds-labs-aws-2.0.x-branch/ws/elb/pom.xml>
to org.apache.jclouds.labs/elb/2.0.3-SNAPSHOT/elb-2.0.3-SNAPSHOT.pom
[JENKINS] Archiving <https://jclouds.ci.cloudbees.com/job/jclouds-labs-aws-2.0.x-branch/ws/aws-iam/pom.xml>
to org.apache.jclouds.labs/aws-iam/2.0.3-SNAPSHOT/aws-iam-2.0.3-SNAPSHOT.pom
[JENKINS] Archiving <https://jclouds.ci.cloudbees.com/job/jclouds-labs-aws-2.0.x-branch/ws/aws-rds/pom.xml>
to org.apache.jclouds.labs/aws-rds/2.0.3-SNAPSHOT/aws-rds-2.0.3-SNAPSHOT.pom
[JENKINS] Archiving <https://jclouds.ci.cloudbees.com/job/jclouds-labs-aws-2.0.x-branch/ws/iam/pom.xml>
to org.apache.jclouds.labs/iam/2.0.3-SNAPSHOT/iam-2.0.3-SNAPSHOT.pom
[JENKINS] Archiving <https://jclouds.ci.cloudbees.com/job/jclouds-labs-aws-2.0.x-branch/ws/aws-elb/pom.xml>
to org.apache.jclouds.labs/aws-elb/2.0.3-SNAPSHOT/aws-elb-2.0.3-SNAPSHOT.pom
[JENKINS] Archiving <https://jclouds.ci.cloudbees.com/job/jclouds-labs-aws-2.0.x-branch/ws/glacier/pom.xml>
to org.apache.jclouds.labs/glacier/2.0.3-SNAPSHOT/glacier-2.0.3-SNAPSHOT.pom
Sending e-mails to: notifications@jclouds.apache.org
channel stopped

Mime
View raw message