jclouds-notifications mailing list archives

Site index · List index
Message view « Date » · « Thread »
Top « Date » · « Thread »
From jenkins-no-re...@cloudbees.com
Subject Build failed in Jenkins: jclouds-labs-2.0.x-branch #112
Date Thu, 06 Jul 2017 13:32:10 GMT
See <https://jclouds.ci.cloudbees.com/job/jclouds-labs-2.0.x-branch/112/display/redirect?page=changes>

Changes:

[Ignasi Barrera] Apache jclouds 2.0.2-rc1 release

[Ignasi Barrera] Next development version 2.0.3-SNAPSHOT

------------------------------------------
Started by an SCM change
Building remotely on 5e355c40 (standard m1.large lxc-fedora17 large) in workspace <https://jclouds.ci.cloudbees.com/job/jclouds-labs-2.0.x-branch/ws/>
$ sudo /opt/jenkins/sbin/mount-webdav https://repository-jclouds.forge.cloudbees.com/private
jclouds alert
webdav mount try 1
Private webdav filestore is mounted
Cloning the remote Git repository
Cloning repository https://git-wip-us.apache.org/repos/asf/jclouds-labs.git
 > git init <https://jclouds.ci.cloudbees.com/job/jclouds-labs-2.0.x-branch/ws/>
# timeout=10
Fetching upstream changes from https://git-wip-us.apache.org/repos/asf/jclouds-labs.git
 > git --version # timeout=10
 > git -c core.askpass=true fetch --tags --progress https://git-wip-us.apache.org/repos/asf/jclouds-labs.git
+refs/heads/*:refs/remotes/origin/*
 > git config remote.origin.url https://git-wip-us.apache.org/repos/asf/jclouds-labs.git
# timeout=10
 > git config --add remote.origin.fetch +refs/heads/*:refs/remotes/origin/* # timeout=10
 > git config remote.origin.url https://git-wip-us.apache.org/repos/asf/jclouds-labs.git
# timeout=10
Fetching upstream changes from https://git-wip-us.apache.org/repos/asf/jclouds-labs.git
 > git -c core.askpass=true fetch --tags --progress https://git-wip-us.apache.org/repos/asf/jclouds-labs.git
+refs/heads/*:refs/remotes/origin/*
 > git rev-parse refs/remotes/origin/2.0.x^{commit} # timeout=10
 > git rev-parse refs/remotes/origin/origin/2.0.x^{commit} # timeout=10
Checking out Revision 3bf86dee57b01d3a50c33a920d33e474597b6e0d (refs/remotes/origin/2.0.x)
 > git config core.sparsecheckout # timeout=10
 > git checkout -f 3bf86dee57b01d3a50c33a920d33e474597b6e0d
 > git rev-list 96c37f3e7d492c0f385a51e2bf3e62442b1c406a # timeout=10
 > git tag -a -f -m Jenkins Build #112 jenkins-jclouds-labs-2.0.x-branch-112 # timeout=10
Parsing POMs
Failed to transfer Could not find metadata org.apache.jclouds:jclouds-project:2.0.3-SNAPSHOT/maven-metadata.xml
in sonatype-nexus-snapshots (https://oss.sonatype.org/content/repositories/snapshots)
Failed to transfer Could not find metadata org.apache.jclouds:jclouds-project:2.0.3-SNAPSHOT/maven-metadata.xml
in cloudbees-private-snapshot-repository (https://repository-jclouds.forge.cloudbees.com/snapshot)
Failed to transfer Could not find metadata org.apache.jclouds:jclouds-project:2.0.3-SNAPSHOT/maven-metadata.xml
in apache-snapshots (https://repository.apache.org/content/repositories/snapshots)
Failed to transfer Could not find artifact org.apache.jclouds:jclouds-project:pom:2.0.3-SNAPSHOT
in cloudbees-private-snapshot-repository (https://repository-jclouds.forge.cloudbees.com/snapshot)
Failed to transfer Could not find artifact org.apache.jclouds:jclouds-project:pom:2.0.3-SNAPSHOT
in apache-snapshots (https://repository.apache.org/content/repositories/snapshots)
Failed to transfer Could not find artifact org.apache.jclouds:jclouds-project:pom:2.0.3-SNAPSHOT
in sonatype-nexus-snapshots (https://oss.sonatype.org/content/repositories/snapshots)
ERROR: Failed to parse POMs
java.io.IOException: remote file operation failed: <https://jclouds.ci.cloudbees.com/job/jclouds-labs-2.0.x-branch/ws/>
at hudson.remoting.Channel@755102ad:5e355c40: hudson.remoting.ProxyException: hudson.maven.MavenModuleSetBuild$MavenExecutionException:
org.apache.maven.project.ProjectBuildingException: Some problems were encountered while processing
the POMs:
[FATAL] Non-resolvable parent POM: Could not find artifact org.apache.jclouds:jclouds-project:pom:2.0.3-SNAPSHOT
in cloudbees-private-snapshot-repository (https://repository-jclouds.forge.cloudbees.com/snapshot)
and 'parent.relativePath' points at wrong local POM @ line 21, column 11

	at hudson.FilePath.act(FilePath.java:992)
	at hudson.FilePath.act(FilePath.java:974)
	at hudson.maven.MavenModuleSetBuild$MavenModuleSetBuildExecution.parsePoms(MavenModuleSetBuild.java:980)
	at hudson.maven.MavenModuleSetBuild$MavenModuleSetBuildExecution.doRun(MavenModuleSetBuild.java:692)
	at hudson.model.AbstractBuild$AbstractBuildExecution.run(AbstractBuild.java:544)
	at hudson.model.Run.execute(Run.java:1728)
	at hudson.maven.MavenModuleSetBuild.run(MavenModuleSetBuild.java:544)
	at hudson.model.ResourceController.execute(ResourceController.java:98)
	at hudson.model.Executor.run(Executor.java:405)
Caused by: hudson.remoting.ProxyException: hudson.maven.MavenModuleSetBuild$MavenExecutionException:
org.apache.maven.project.ProjectBuildingException: Some problems were encountered while processing
the POMs:
[FATAL] Non-resolvable parent POM: Could not find artifact org.apache.jclouds:jclouds-project:pom:2.0.3-SNAPSHOT
in cloudbees-private-snapshot-repository (https://repository-jclouds.forge.cloudbees.com/snapshot)
and 'parent.relativePath' points at wrong local POM @ line 21, column 11

	at hudson.maven.MavenModuleSetBuild$PomParser.invoke(MavenModuleSetBuild.java:1384)
	at hudson.maven.MavenModuleSetBuild$PomParser.invoke(MavenModuleSetBuild.java:1118)
	at hudson.FilePath$FileCallableWrapper.call(FilePath.java:2731)
	at hudson.remoting.UserRequest.perform(UserRequest.java:153)
	at hudson.remoting.UserRequest.perform(UserRequest.java:50)
	at hudson.remoting.Request$2.run(Request.java:336)
	at hudson.remoting.InterceptingExecutorService$1.call(InterceptingExecutorService.java:68)
	at java.util.concurrent.FutureTask.run(FutureTask.java:266)
	at java.util.concurrent.ThreadPoolExecutor.runWorker(ThreadPoolExecutor.java:1142)
	at java.util.concurrent.ThreadPoolExecutor$Worker.run(ThreadPoolExecutor.java:617)
	at java.lang.Thread.run(Thread.java:745)
	at ......remote call to 5e355c40(Native Method)
	at hudson.remoting.Channel.attachCallSiteStackTrace(Channel.java:1545)
	at hudson.remoting.UserResponse.retrieve(UserRequest.java:253)
	at hudson.remoting.Channel.call(Channel.java:830)
	at hudson.FilePath.act(FilePath.java:985)
	... 8 more
Caused by: hudson.remoting.ProxyException: org.apache.maven.project.ProjectBuildingException:
Some problems were encountered while processing the POMs:
[FATAL] Non-resolvable parent POM: Could not find artifact org.apache.jclouds:jclouds-project:pom:2.0.3-SNAPSHOT
in cloudbees-private-snapshot-repository (https://repository-jclouds.forge.cloudbees.com/snapshot)
and 'parent.relativePath' points at wrong local POM @ line 21, column 11

	at org.apache.maven.project.DefaultProjectBuilder.build(DefaultProjectBuilder.java:364)
	at hudson.maven.MavenEmbedder.buildProjects(MavenEmbedder.java:361)
	at hudson.maven.MavenEmbedder.readProjects(MavenEmbedder.java:331)
	at hudson.maven.MavenModuleSetBuild$PomParser.invoke(MavenModuleSetBuild.java:1321)
	at hudson.maven.MavenModuleSetBuild$PomParser.invoke(MavenModuleSetBuild.java:1118)
	at hudson.FilePath$FileCallableWrapper.call(FilePath.java:2731)
	at hudson.remoting.UserRequest.perform(UserRequest.java:153)
	at hudson.remoting.UserRequest.perform(UserRequest.java:50)
	at hudson.remoting.Request$2.run(Request.java:336)
	at hudson.remoting.InterceptingExecutorService$1.call(InterceptingExecutorService.java:68)
	at java.util.concurrent.FutureTask.run(FutureTask.java:266)
	at java.util.concurrent.ThreadPoolExecutor.runWorker(ThreadPoolExecutor.java:1142)
	at java.util.concurrent.ThreadPoolExecutor$Worker.run(ThreadPoolExecutor.java:617)
	at java.lang.Thread.run(Thread.java:745)

Mime
View raw message