jclouds-notifications mailing list archives

Site index · List index
Message view « Date » · « Thread »
Top « Date » · « Thread »
From jenkins-no-re...@cloudbees.com
Subject Build failed in Jenkins: jclouds-labs-2.0.x-branch #117
Date Fri, 07 Jul 2017 17:35:22 GMT
See <https://jclouds.ci.cloudbees.com/job/jclouds-labs-2.0.x-branch/117/display/redirect?page=changes>

Changes:

[Andrew Gaul] JCLOUDS-1304: B2 native prefix and delimiter

------------------------------------------
[...truncated 796.23 KB...]
Jul 07, 2017 1:35:06 PM com.squareup.okhttp.mockwebserver.MockWebServer$3 processOneRequest
INFO: MockWebServer[36192] received request: POST /b2api/v1/b2_start_large_file HTTP/1.1 and
responded: HTTP/1.1 200 OK
Jul 07, 2017 1:35:06 PM com.squareup.okhttp.mockwebserver.MockWebServer$2 acceptConnections
INFO: MockWebServer[36192] done accepting connections: Socket closed
[pool-3-thread-4] Test testStartLargeFile(org.jclouds.b2.features.MultipartApiMockTest) succeeded:
670ms
Test suite progress: tests succeeded: 24, failed: 0, skipped: 0.
Jul 07, 2017 1:35:09 PM com.squareup.okhttp.mockwebserver.MockWebServer$3 processOneRequest
INFO: MockWebServer[60322] received request: POST /b2api/v1/b2_upload_part/4a48fe8875c6214145260818/c001_v0001007_t0042
HTTP/1.1 and responded: HTTP/1.1 200 OK
Jul 07, 2017 1:35:09 PM com.squareup.okhttp.mockwebserver.MockWebServer$2 acceptConnections
INFO: MockWebServer[60322] done accepting connections: Socket closed
[pool-3-thread-1] Test testUploadPart(org.jclouds.b2.features.MultipartApiMockTest) succeeded:
2703ms
Test suite progress: tests succeeded: 25, failed: 0, skipped: 0.
Starting test testAllContains(org.jclouds.b2.B2ProviderMetadataTest)
Starting test testOfApiContains(org.jclouds.b2.B2ProviderMetadataTest)
Starting test testTransformableToContains(org.jclouds.b2.B2ProviderMetadataTest)
Starting test testWithId(org.jclouds.b2.B2ProviderMetadataTest)
[pool-4-thread-1] Test testAllContains(org.jclouds.b2.B2ProviderMetadataTest) succeeded: 2ms
Test suite progress: tests succeeded: 26, failed: 0, skipped: 0.
[pool-4-thread-2] Test testOfApiContains(org.jclouds.b2.B2ProviderMetadataTest) succeeded:
3ms
Test suite progress: tests succeeded: 27, failed: 0, skipped: 0.
[pool-4-thread-3] Test testTransformableToContains(org.jclouds.b2.B2ProviderMetadataTest)
succeeded: 2ms
Test suite progress: tests succeeded: 28, failed: 0, skipped: 0.
[pool-4-thread-4] Test testWithId(org.jclouds.b2.B2ProviderMetadataTest) succeeded: 2ms
Test suite progress: tests succeeded: 29, failed: 0, skipped: 0.
Tests run: 29, Failures: 0, Errors: 0, Skipped: 0, Time elapsed: 5.006 sec - in TestSuite

Results :

Tests run: 29, Failures: 0, Errors: 0, Skipped: 0

[JENKINS] Recording test results
[INFO] 
[INFO] --- animal-sniffer-maven-plugin:1.11:check (default) @ b2 ---
[INFO] Checking unresolved references to org.codehaus.mojo.signature:java16:1.1
[INFO] 
[INFO] --- maven-bundle-plugin:2.3.7:bundle (default-bundle) @ b2 ---
[INFO] 
[INFO] --- maven-site-plugin:3.3:attach-descriptor (attach-descriptor) @ b2 ---
[INFO] 
[INFO] --- apache-rat-plugin:0.10:check (default) @ b2 ---
[INFO] 51 implicit excludes (use -debug for more details).
[INFO] Exclude: **/src/test/resources/**/*.sh
[INFO] Exclude: **/src/test/resources/**/*.bat
[INFO] Exclude: **/src/test/resources/**/*.cmd
[INFO] Exclude: **/src/test/resources/**/*.txt
[INFO] Exclude: **/src/test/resources/**/*.gz
[INFO] Exclude: **/src/test/resources/**/*.xml
[INFO] Exclude: **/src/test/resources/**/*.html
[INFO] Exclude: **/src/test/resources/**/*.iso
[INFO] Exclude: **/src/test/resources/**/ssh*.pub
[INFO] Exclude: **/LICENSE.txt
[INFO] Exclude: **/header.txt
[INFO] Exclude: **/NOTICE.txt
[INFO] Exclude: **/DISCLAIMER
[INFO] Exclude: **/BUILD.txt
[INFO] Exclude: **/CHANGES.txt
[INFO] Exclude: **/README.md
[INFO] Exclude: **/README.txt
[INFO] Exclude: **/DEPENDENCIES
[INFO] Exclude: **/CONTRIBUTING.md
[INFO] Exclude: **/*json
[INFO] Exclude: **/*readme
[INFO] Exclude: **/*ProviderMetadata
[INFO] Exclude: **/*ApiMetadata
[INFO] Exclude: **/*LoggingModule
[INFO] Exclude: **/*ViewMBeanFactory
[INFO] Exclude: **/target/**
[INFO] Exclude: **/test-output/**
[INFO] Exclude: **/bin/**
[INFO] Exclude: **/.settings/**
[INFO] Exclude: **/.classpath
[INFO] Exclude: **/.dir-locals.el
[INFO] Exclude: **/.project
[INFO] Exclude: **/.idea/**
[INFO] Exclude: **/*.iml
[INFO] Exclude: **/*.eml
[INFO] Exclude: **/*.ipr
[INFO] Exclude: **/*.iws
[INFO] Exclude: **/*.DS_STORE
[INFO] Exclude: **/TAGS
[INFO] Exclude: **/.metadata/**
[INFO] Exclude: **/atlassian-ide-plugin.xml
[INFO] Exclude: **/.DS_Store
[INFO] Exclude: .mailmap
[INFO] Exclude: .git/**
[INFO] Exclude: **/.gitignore
[INFO] Exclude: **/.gitattributes
[INFO] Exclude: .repository/**
[INFO] Exclude: .java-version
[INFO] Exclude: nb-configuration.xml
[INFO] Exclude: nbactions.xml
[INFO] Exclude: **/.factorypath
[INFO] Exclude: **/.apt_generated/**
[INFO] Exclude: .repository/**
[INFO] Exclude: gc.log
[INFO] 51 resources included (use -debug for more details)
Warning:  org.apache.xerces.jaxp.SAXParserImpl$JAXPSAXParser: Property 'http://www.oracle.com/xml/jaxp/properties/entityExpansionLimit'
is not recognized.
Compiler warnings:
  WARNING:  'org.apache.xerces.jaxp.SAXParserImpl: Property 'http://javax.xml.XMLConstants/property/accessExternalDTD'
is not recognized.'
Warning:  org.apache.xerces.parsers.SAXParser: Feature 'http://javax.xml.XMLConstants/feature/secure-processing'
is not recognized.
Warning:  org.apache.xerces.parsers.SAXParser: Property 'http://javax.xml.XMLConstants/property/accessExternalDTD'
is not recognized.
Warning:  org.apache.xerces.parsers.SAXParser: Property 'http://www.oracle.com/xml/jaxp/properties/entityExpansionLimit'
is not recognized.
[INFO] Rat check: Summary of files. Unapproved: 0 unknown: 0 generated: 0 approved: 51 licence.
[INFO] 
[INFO] --- maven-jar-plugin:2.4:test-jar (default) @ b2 ---
[INFO] Building jar: <https://jclouds.ci.cloudbees.com/job/jclouds-labs-2.0.x-branch/ws/b2/target/b2-2.0.3-SNAPSHOT-tests.jar>
[INFO] 
[INFO] --- maven-javadoc-plugin:2.9:aggregate-jar (javadoc) @ b2 ---
[INFO] 
[INFO] --- maven-javadoc-plugin:2.9:jar (javadoc) @ b2 ---
[INFO] Building jar: <https://jclouds.ci.cloudbees.com/job/jclouds-labs-2.0.x-branch/ws/b2/target/b2-2.0.3-SNAPSHOT-javadoc.jar>
[INFO] 
[INFO] --- maven-source-plugin:2.2:jar-no-fork (attach-sources) @ b2 ---
[INFO] Building jar: <https://jclouds.ci.cloudbees.com/job/jclouds-labs-2.0.x-branch/ws/b2/target/b2-2.0.3-SNAPSHOT-sources.jar>
[INFO] 
[INFO] --- maven-source-plugin:2.2:test-jar-no-fork (attach-sources) @ b2 ---
[INFO] Building jar: <https://jclouds.ci.cloudbees.com/job/jclouds-labs-2.0.x-branch/ws/b2/target/b2-2.0.3-SNAPSHOT-test-sources.jar>
[INFO] 
[INFO] --- maven-surefire-plugin:2.17:test (integration) @ b2 ---
[JENKINS] Recording test results[INFO] 
[INFO] --- duplicate-finder-maven-plugin:1.1.1:check (default) @ b2 ---

[WARNING] <ignoreResources> has been deprecated and replaced with <ignoreResourcePatterns>.
It will go away in version 1.2.0. Please update your POM accordingly!
[INFO] Checking compile classpath
[INFO] Checking runtime classpath
[INFO] Checking test classpath
[INFO] 
[INFO] --- maven-checkstyle-plugin:2.15:check (default) @ b2 ---
[WARNING] src/main/java/org/jclouds/b2/blobstore/B2BlobStore.java[86:8] (imports) UnusedImports:
Unused import - com.google.common.collect.Sets.
[INFO] ------------------------------------------------------------------------
[INFO] Reactor Summary:
[INFO] 
[INFO] Apache jclouds labs ............................... SUCCESS [1:20.679s]
[INFO] jclouds Azure Compute ARM API ..................... SUCCESS [40.444s]
[INFO] jclouds azure compute API ......................... SUCCESS [26.204s]
[INFO] Apache jclouds B2 API ............................. FAILURE [19.443s]
[INFO] jclouds cdmi api .................................. SKIPPED
[INFO] jclouds CloudSigma v2 API ......................... SKIPPED
[INFO] jclouds CloudSigma v2 Honolulu Provider ........... SKIPPED
[INFO] jclouds CloudSigma v2 Las Vegas Provider .......... SKIPPED
[INFO] jclouds CloudSigma v2 Miami Provider .............. SKIPPED
[INFO] jclouds CloudSigma v2 San Jose Provider ........... SKIPPED
[INFO] jclouds CloudSigma v2 Washington DC Provider ...... SKIPPED
[INFO] jclouds CloudSigma v2 Zurich Provider ............. SKIPPED
[INFO] jclouds Dimension Data CloudControl API ........... SKIPPED
[INFO] jclouds jdbc core ................................. SKIPPED
[INFO] jclouds h2 jdbc provider .......................... SKIPPED
[INFO] jclouds joyent-cloudapi api ....................... SKIPPED
[INFO] jclouds joyentcloud provider ...................... SKIPPED
[INFO] jclouds Abiquo api ................................ SKIPPED
[INFO] jclouds ProfitBricks REST api ..................... SKIPPED
[INFO] jclouds OneAndOne REST api ........................ SKIPPED
[INFO] jclouds Packet compute API ........................ SKIPPED
[INFO] jclouds Vagrant provider .......................... SKIPPED
[INFO] ------------------------------------------------------------------------
[INFO] BUILD FAILURE
[INFO] ------------------------------------------------------------------------
[INFO] Total time: 2:52.549s
[INFO] Finished at: Fri Jul 07 13:35:17 EDT 2017
[INFO] Final Memory: 103M/296M
[INFO] ------------------------------------------------------------------------
Waiting for Jenkins to finish collecting data
[ERROR] Failed to execute goal org.apache.maven.plugins:maven-checkstyle-plugin:2.15:check
(default) on project b2: You have 1 Checkstyle violation. -> [Help 1]
org.apache.maven.lifecycle.LifecycleExecutionException: Failed to execute goal org.apache.maven.plugins:maven-checkstyle-plugin:2.15:check
(default) on project b2: You have 1 Checkstyle violation.
	at org.apache.maven.lifecycle.internal.MojoExecutor.execute(MojoExecutor.java:213)
	at org.apache.maven.lifecycle.internal.MojoExecutor.execute(MojoExecutor.java:153)
	at org.apache.maven.lifecycle.internal.MojoExecutor.execute(MojoExecutor.java:145)
	at org.apache.maven.lifecycle.internal.LifecycleModuleBuilder.buildProject(LifecycleModuleBuilder.java:84)
	at org.apache.maven.lifecycle.internal.LifecycleModuleBuilder.buildProject(LifecycleModuleBuilder.java:59)
	at org.apache.maven.lifecycle.internal.LifecycleStarter.singleThreadedBuild(LifecycleStarter.java:183)
	at org.apache.maven.lifecycle.internal.LifecycleStarter.execute(LifecycleStarter.java:161)
	at org.apache.maven.DefaultMaven.doExecute(DefaultMaven.java:320)
	at org.apache.maven.DefaultMaven.execute(DefaultMaven.java:156)
	at org.jvnet.hudson.maven3.launcher.Maven3Launcher.main(Maven3Launcher.java:117)
	at sun.reflect.NativeMethodAccessorImpl.invoke0(Native Method)
	at sun.reflect.NativeMethodAccessorImpl.invoke(NativeMethodAccessorImpl.java:57)
	at sun.reflect.DelegatingMethodAccessorImpl.invoke(DelegatingMethodAccessorImpl.java:43)
	at java.lang.reflect.Method.invoke(Method.java:606)
	at org.codehaus.plexus.classworlds.launcher.Launcher.launchStandard(Launcher.java:329)
	at org.codehaus.plexus.classworlds.launcher.Launcher.launch(Launcher.java:239)
	at org.jvnet.hudson.maven3.agent.Maven3Main.launch(Maven3Main.java:181)
	at sun.reflect.NativeMethodAccessorImpl.invoke0(Native Method)
	at sun.reflect.NativeMethodAccessorImpl.invoke(NativeMethodAccessorImpl.java:57)
	at sun.reflect.DelegatingMethodAccessorImpl.invoke(DelegatingMethodAccessorImpl.java:43)
	at java.lang.reflect.Method.invoke(Method.java:606)
	at hudson.maven.Maven3Builder.call(Maven3Builder.java:139)
	at hudson.maven.Maven3Builder.call(Maven3Builder.java:70)
	at hudson.remoting.UserRequest.perform(UserRequest.java:153)
	at hudson.remoting.UserRequest.perform(UserRequest.java:50)
	at hudson.remoting.Request$2.run(Request.java:336)
	at hudson.remoting.InterceptingExecutorService$1.call(InterceptingExecutorService.java:68)
	at java.util.concurrent.FutureTask.run(FutureTask.java:262)
	at java.util.concurrent.ThreadPoolExecutor.runWorker(ThreadPoolExecutor.java:1145)
	at java.util.concurrent.ThreadPoolExecutor$Worker.run(ThreadPoolExecutor.java:615)
	at java.lang.Thread.run(Thread.java:745)
Caused by: org.apache.maven.plugin.MojoFailureException: You have 1 Checkstyle violation.
	at org.apache.maven.plugin.checkstyle.CheckstyleViolationCheckMojo.execute(CheckstyleViolationCheckMojo.java:580)
	at org.apache.maven.plugin.DefaultBuildPluginManager.executeMojo(DefaultBuildPluginManager.java:101)
	at org.apache.maven.lifecycle.internal.MojoExecutor.execute(MojoExecutor.java:209)
	... 30 more
[ERROR] 
[ERROR] Re-run Maven using the -X switch to enable full debug logging.
[ERROR] 
[ERROR] For more information about the errors and possible solutions, please read the following
articles:
[ERROR] [Help 1] http://cwiki.apache.org/confluence/display/MAVEN/MojoFailureException
[ERROR] 
[ERROR] After correcting the problems, you can resume the build with the command
[ERROR]   mvn <goals> -rf :b2
[JENKINS] Archiving <https://jclouds.ci.cloudbees.com/job/jclouds-labs-2.0.x-branch/ws/joyentcloud/pom.xml>
to org.apache.jclouds.labs/joyentcloud/2.0.3-SNAPSHOT/joyentcloud-2.0.3-SNAPSHOT.pom
[JENKINS] Archiving <https://jclouds.ci.cloudbees.com/job/jclouds-labs-2.0.x-branch/ws/joyent-cloudapi/pom.xml>
to org.apache.jclouds.labs/joyent-cloudapi/2.0.3-SNAPSHOT/joyent-cloudapi-2.0.3-SNAPSHOT.pom
[JENKINS] Archiving <https://jclouds.ci.cloudbees.com/job/jclouds-labs-2.0.x-branch/ws/cloudsigma2-wdc/pom.xml>
to org.apache.jclouds.labs/cloudsigma2-wdc/2.0.3-SNAPSHOT/cloudsigma2-wdc-2.0.3-SNAPSHOT.pom
[JENKINS] Archiving <https://jclouds.ci.cloudbees.com/job/jclouds-labs-2.0.x-branch/ws/dimensiondata/pom.xml>
to org.apache.jclouds.labs/dimensiondata-cloudcontrol/2.0.3-SNAPSHOT/dimensiondata-cloudcontrol-2.0.3-SNAPSHOT.pom
[JENKINS] Archiving <https://jclouds.ci.cloudbees.com/job/jclouds-labs-2.0.x-branch/ws/cloudsigma2/pom.xml>
to org.apache.jclouds.labs/cloudsigma2/2.0.3-SNAPSHOT/cloudsigma2-2.0.3-SNAPSHOT.pom
[JENKINS] Archiving <https://jclouds.ci.cloudbees.com/job/jclouds-labs-2.0.x-branch/ws/profitbricks-rest/pom.xml>
to org.apache.jclouds.labs/profitbricks-rest/2.0.3-SNAPSHOT/profitbricks-rest-2.0.3-SNAPSHOT.pom
[JENKINS] Archiving <https://jclouds.ci.cloudbees.com/job/jclouds-labs-2.0.x-branch/ws/packet/pom.xml>
to org.apache.jclouds.labs/packet/2.0.3-SNAPSHOT/packet-2.0.3-SNAPSHOT.pom
[JENKINS] Archiving <https://jclouds.ci.cloudbees.com/job/jclouds-labs-2.0.x-branch/ws/cloudsigma2-zrh/pom.xml>
to org.apache.jclouds.labs/cloudsigma2-zrh/2.0.3-SNAPSHOT/cloudsigma2-zrh-2.0.3-SNAPSHOT.pom
[JENKINS] Archiving <https://jclouds.ci.cloudbees.com/job/jclouds-labs-2.0.x-branch/ws/vagrant/pom.xml>
to org.apache.jclouds.labs/vagrant/2.0.3-SNAPSHOT/vagrant-2.0.3-SNAPSHOT.pom
[JENKINS] Archiving <https://jclouds.ci.cloudbees.com/job/jclouds-labs-2.0.x-branch/ws/pom.xml>
to org.apache.jclouds.labs/jclouds-labs/2.0.3-SNAPSHOT/jclouds-labs-2.0.3-SNAPSHOT.pom
[JENKINS] Archiving <https://jclouds.ci.cloudbees.com/job/jclouds-labs-2.0.x-branch/ws/target/jclouds-labs-2.0.3-SNAPSHOT-tests.jar>
to org.apache.jclouds.labs/jclouds-labs/2.0.3-20170707.173348-4/jclouds-labs-2.0.3-20170707.173348-4-tests.jar
[JENKINS] Archiving <https://jclouds.ci.cloudbees.com/job/jclouds-labs-2.0.x-branch/ws/target/jclouds-labs-2.0.3-SNAPSHOT-javadoc.jar>
to org.apache.jclouds.labs/jclouds-labs/2.0.3-20170707.173348-4/jclouds-labs-2.0.3-20170707.173348-4-javadoc.jar
[JENKINS] Archiving <https://jclouds.ci.cloudbees.com/job/jclouds-labs-2.0.x-branch/ws/oneandone/pom.xml>
to org.apache.jclouds.labs/oneandone/2.0.3-SNAPSHOT/oneandone-2.0.3-SNAPSHOT.pom
[JENKINS] Archiving <https://jclouds.ci.cloudbees.com/job/jclouds-labs-2.0.x-branch/ws/cloudsigma2-hnl/pom.xml>
to org.apache.jclouds.labs/cloudsigma2-hnl/2.0.3-SNAPSHOT/cloudsigma2-hnl-2.0.3-SNAPSHOT.pom
[JENKINS] Archiving <https://jclouds.ci.cloudbees.com/job/jclouds-labs-2.0.x-branch/ws/b2/pom.xml>
to org.apache.jclouds.labs/b2/2.0.3-SNAPSHOT/b2-2.0.3-SNAPSHOT.pom
[JENKINS] Archiving <https://jclouds.ci.cloudbees.com/job/jclouds-labs-2.0.x-branch/ws/b2/target/b2-2.0.3-SNAPSHOT.jar>
to org.apache.jclouds.labs/b2/2.0.3-SNAPSHOT/b2-2.0.3-SNAPSHOT.jar
[JENKINS] Archiving <https://jclouds.ci.cloudbees.com/job/jclouds-labs-2.0.x-branch/ws/b2/target/b2-2.0.3-SNAPSHOT-tests.jar>
to org.apache.jclouds.labs/b2/2.0.3-SNAPSHOT/b2-2.0.3-SNAPSHOT-tests.jar
[JENKINS] Archiving <https://jclouds.ci.cloudbees.com/job/jclouds-labs-2.0.x-branch/ws/b2/target/b2-2.0.3-SNAPSHOT-javadoc.jar>
to org.apache.jclouds.labs/b2/2.0.3-SNAPSHOT/b2-2.0.3-SNAPSHOT-javadoc.jar
[JENKINS] Archiving <https://jclouds.ci.cloudbees.com/job/jclouds-labs-2.0.x-branch/ws/b2/target/b2-2.0.3-SNAPSHOT-sources.jar>
to org.apache.jclouds.labs/b2/2.0.3-SNAPSHOT/b2-2.0.3-SNAPSHOT-sources.jar
[JENKINS] Archiving <https://jclouds.ci.cloudbees.com/job/jclouds-labs-2.0.x-branch/ws/b2/target/b2-2.0.3-SNAPSHOT-test-sources.jar>
to org.apache.jclouds.labs/b2/2.0.3-SNAPSHOT/b2-2.0.3-SNAPSHOT-test-sources.jar
[JENKINS] Archiving <https://jclouds.ci.cloudbees.com/job/jclouds-labs-2.0.x-branch/ws/cloudsigma2-mia/pom.xml>
to org.apache.jclouds.labs/cloudsigma2-mia/2.0.3-SNAPSHOT/cloudsigma2-mia-2.0.3-SNAPSHOT.pom
[JENKINS] Archiving <https://jclouds.ci.cloudbees.com/job/jclouds-labs-2.0.x-branch/ws/azurecompute/pom.xml>
to org.apache.jclouds.labs/azurecompute/2.0.3-SNAPSHOT/azurecompute-2.0.3-SNAPSHOT.pom
[JENKINS] Archiving <https://jclouds.ci.cloudbees.com/job/jclouds-labs-2.0.x-branch/ws/azurecompute/target/azurecompute-2.0.3-SNAPSHOT.jar>
to org.apache.jclouds.labs/azurecompute/2.0.3-20170707.173455-4/azurecompute-2.0.3-20170707.173455-4.jar
[JENKINS] Archiving <https://jclouds.ci.cloudbees.com/job/jclouds-labs-2.0.x-branch/ws/azurecompute/target/azurecompute-2.0.3-SNAPSHOT-tests.jar>
to org.apache.jclouds.labs/azurecompute/2.0.3-20170707.173455-4/azurecompute-2.0.3-20170707.173455-4-tests.jar
[JENKINS] Archiving <https://jclouds.ci.cloudbees.com/job/jclouds-labs-2.0.x-branch/ws/azurecompute/target/azurecompute-2.0.3-SNAPSHOT-javadoc.jar>
to org.apache.jclouds.labs/azurecompute/2.0.3-20170707.173455-4/azurecompute-2.0.3-20170707.173455-4-javadoc.jar
[JENKINS] Archiving <https://jclouds.ci.cloudbees.com/job/jclouds-labs-2.0.x-branch/ws/azurecompute/target/azurecompute-2.0.3-SNAPSHOT-sources.jar>
to org.apache.jclouds.labs/azurecompute/2.0.3-20170707.173455-4/azurecompute-2.0.3-20170707.173455-4-sources.jar
[JENKINS] Archiving <https://jclouds.ci.cloudbees.com/job/jclouds-labs-2.0.x-branch/ws/azurecompute/target/azurecompute-2.0.3-SNAPSHOT-test-sources.jar>
to org.apache.jclouds.labs/azurecompute/2.0.3-20170707.173455-4/azurecompute-2.0.3-20170707.173455-4-test-sources.jar
[JENKINS] Archiving <https://jclouds.ci.cloudbees.com/job/jclouds-labs-2.0.x-branch/ws/cloudsigma2-sjc/pom.xml>
to org.apache.jclouds.labs/cloudsigma2-sjc/2.0.3-SNAPSHOT/cloudsigma2-sjc-2.0.3-SNAPSHOT.pom
[JENKINS] Archiving <https://jclouds.ci.cloudbees.com/job/jclouds-labs-2.0.x-branch/ws/azurecompute-arm/pom.xml>
to org.apache.jclouds.labs/azurecompute-arm/2.0.3-SNAPSHOT/azurecompute-arm-2.0.3-SNAPSHOT.pom
[JENKINS] Archiving <https://jclouds.ci.cloudbees.com/job/jclouds-labs-2.0.x-branch/ws/azurecompute-arm/target/azurecompute-arm-2.0.3-SNAPSHOT.jar>
to org.apache.jclouds.labs/azurecompute-arm/2.0.3-20170707.173429-4/azurecompute-arm-2.0.3-20170707.173429-4.jar
[JENKINS] Archiving <https://jclouds.ci.cloudbees.com/job/jclouds-labs-2.0.x-branch/ws/azurecompute-arm/target/azurecompute-arm-2.0.3-SNAPSHOT-tests.jar>
to org.apache.jclouds.labs/azurecompute-arm/2.0.3-20170707.173429-4/azurecompute-arm-2.0.3-20170707.173429-4-tests.jar
[JENKINS] Archiving <https://jclouds.ci.cloudbees.com/job/jclouds-labs-2.0.x-branch/ws/azurecompute-arm/target/azurecompute-arm-2.0.3-SNAPSHOT-javadoc.jar>
to org.apache.jclouds.labs/azurecompute-arm/2.0.3-20170707.173429-4/azurecompute-arm-2.0.3-20170707.173429-4-javadoc.jar
[JENKINS] Archiving <https://jclouds.ci.cloudbees.com/job/jclouds-labs-2.0.x-branch/ws/azurecompute-arm/target/azurecompute-arm-2.0.3-SNAPSHOT-sources.jar>
to org.apache.jclouds.labs/azurecompute-arm/2.0.3-20170707.173429-4/azurecompute-arm-2.0.3-20170707.173429-4-sources.jar
[JENKINS] Archiving <https://jclouds.ci.cloudbees.com/job/jclouds-labs-2.0.x-branch/ws/azurecompute-arm/target/azurecompute-arm-2.0.3-SNAPSHOT-test-sources.jar>
to org.apache.jclouds.labs/azurecompute-arm/2.0.3-20170707.173429-4/azurecompute-arm-2.0.3-20170707.173429-4-test-sources.jar
[JENKINS] Archiving <https://jclouds.ci.cloudbees.com/job/jclouds-labs-2.0.x-branch/ws/jdbc/pom.xml>
to org.apache.jclouds.labs/jdbc/2.0.3-SNAPSHOT/jdbc-2.0.3-SNAPSHOT.pom
[JENKINS] Archiving <https://jclouds.ci.cloudbees.com/job/jclouds-labs-2.0.x-branch/ws/cdmi/pom.xml>
to org.apache.jclouds.labs/cdmi/2.0.3-SNAPSHOT/cdmi-2.0.3-SNAPSHOT.pom
[JENKINS] Archiving <https://jclouds.ci.cloudbees.com/job/jclouds-labs-2.0.x-branch/ws/cloudsigma2-lvs/pom.xml>
to org.apache.jclouds.labs/cloudsigma2-lvs/2.0.3-SNAPSHOT/cloudsigma2-lvs-2.0.3-SNAPSHOT.pom
[JENKINS] Archiving <https://jclouds.ci.cloudbees.com/job/jclouds-labs-2.0.x-branch/ws/abiquo/pom.xml>
to org.apache.jclouds.labs/abiquo/2.0.3-SNAPSHOT/abiquo-2.0.3-SNAPSHOT.pom
[JENKINS] Archiving <https://jclouds.ci.cloudbees.com/job/jclouds-labs-2.0.x-branch/ws/h2-jdbc/pom.xml>
to org.apache.jclouds.labs/h2-jdbc/2.0.3-SNAPSHOT/h2-jdbc-2.0.3-SNAPSHOT.pom
Sending e-mails to: notifications@jclouds.apache.org
channel stopped

Mime
View raw message