jclouds-notifications mailing list archives

Site index · List index
Message view « Date » · « Thread »
Top « Date » · « Thread »
From jenkins-no-re...@cloudbees.com
Subject Build failed in Jenkins: jclouds-cli #1511
Date Sat, 11 Nov 2017 16:51:19 GMT
See <https://jclouds.ci.cloudbees.com/job/jclouds-cli/1511/display/redirect>

------------------------------------------
[...truncated 636.79 KB...]
[INFO] Installing <https://jclouds.ci.cloudbees.com/job/jclouds-cli/ws/assembly/target/jclouds-cli-assembly-2.1.0-SNAPSHOT.jar>
to /home/jenkins/.m2/repository/org/apache/jclouds/cli/jclouds-cli-assembly/2.1.0-SNAPSHOT/jclouds-cli-assembly-2.1.0-SNAPSHOT.jar
[INFO] Installing <https://jclouds.ci.cloudbees.com/job/jclouds-cli/ws/assembly/pom.xml>
to /home/jenkins/.m2/repository/org/apache/jclouds/cli/jclouds-cli-assembly/2.1.0-SNAPSHOT/jclouds-cli-assembly-2.1.0-SNAPSHOT.pom
[INFO] Installing <https://jclouds.ci.cloudbees.com/job/jclouds-cli/ws/assembly/target/jclouds-cli-assembly-2.1.0-SNAPSHOT-tests.jar>
to /home/jenkins/.m2/repository/org/apache/jclouds/cli/jclouds-cli-assembly/2.1.0-SNAPSHOT/jclouds-cli-assembly-2.1.0-SNAPSHOT-tests.jar
[INFO] Installing <https://jclouds.ci.cloudbees.com/job/jclouds-cli/ws/assembly/target/jclouds-cli-assembly-2.1.0-SNAPSHOT-sources.jar>
to /home/jenkins/.m2/repository/org/apache/jclouds/cli/jclouds-cli-assembly/2.1.0-SNAPSHOT/jclouds-cli-assembly-2.1.0-SNAPSHOT-sources.jar
[INFO] Installing <https://jclouds.ci.cloudbees.com/job/jclouds-cli/ws/assembly/target/jclouds-cli-assembly-2.1.0-SNAPSHOT-test-sources.jar>
to /home/jenkins/.m2/repository/org/apache/jclouds/cli/jclouds-cli-assembly/2.1.0-SNAPSHOT/jclouds-cli-assembly-2.1.0-SNAPSHOT-test-sources.jar
[INFO] Installing <https://jclouds.ci.cloudbees.com/job/jclouds-cli/ws/assembly/target/jclouds-cli-2.1.0-SNAPSHOT.tar.gz>
to /home/jenkins/.m2/repository/org/apache/jclouds/cli/jclouds-cli-assembly/2.1.0-SNAPSHOT/jclouds-cli-assembly-2.1.0-SNAPSHOT.tar.gz
[INFO] Installing <https://jclouds.ci.cloudbees.com/job/jclouds-cli/ws/assembly/target/jclouds-cli-2.1.0-SNAPSHOT.zip>
to /home/jenkins/.m2/repository/org/apache/jclouds/cli/jclouds-cli-assembly/2.1.0-SNAPSHOT/jclouds-cli-assembly-2.1.0-SNAPSHOT.zip
[INFO] 
[INFO] --- maven-deploy-plugin:2.7:deploy (default-deploy) @ jclouds-cli-assembly ---
Downloading: https://repository.apache.org/content/repositories/snapshots/org/apache/jclouds/cli/jclouds-cli-assembly/2.1.0-SNAPSHOT/maven-metadata.xml
Downloaded: https://repository.apache.org/content/repositories/snapshots/org/apache/jclouds/cli/jclouds-cli-assembly/2.1.0-SNAPSHOT/maven-metadata.xml
(2 KB at 5.7 KB/sec)
Uploading: https://repository.apache.org/content/repositories/snapshots/org/apache/jclouds/cli/jclouds-cli-assembly/2.1.0-SNAPSHOT/jclouds-cli-assembly-2.1.0-20171111.165101-209.jar
Uploaded: https://repository.apache.org/content/repositories/snapshots/org/apache/jclouds/cli/jclouds-cli-assembly/2.1.0-SNAPSHOT/jclouds-cli-assembly-2.1.0-20171111.165101-209.jar
(26 KB at 240.8 KB/sec)
Uploading: https://repository.apache.org/content/repositories/snapshots/org/apache/jclouds/cli/jclouds-cli-assembly/2.1.0-SNAPSHOT/jclouds-cli-assembly-2.1.0-20171111.165101-209.pom
Uploaded: https://repository.apache.org/content/repositories/snapshots/org/apache/jclouds/cli/jclouds-cli-assembly/2.1.0-SNAPSHOT/jclouds-cli-assembly-2.1.0-20171111.165101-209.pom
(10 KB at 9.9 KB/sec)
Downloading: https://repository.apache.org/content/repositories/snapshots/org/apache/jclouds/cli/jclouds-cli-assembly/maven-metadata.xml
Downloaded: https://repository.apache.org/content/repositories/snapshots/org/apache/jclouds/cli/jclouds-cli-assembly/maven-metadata.xml
(643 B at 1.0 KB/sec)
Uploading: https://repository.apache.org/content/repositories/snapshots/org/apache/jclouds/cli/jclouds-cli-assembly/2.1.0-SNAPSHOT/maven-metadata.xml
Uploaded: https://repository.apache.org/content/repositories/snapshots/org/apache/jclouds/cli/jclouds-cli-assembly/2.1.0-SNAPSHOT/maven-metadata.xml
(2 KB at 5.0 KB/sec)
Uploading: https://repository.apache.org/content/repositories/snapshots/org/apache/jclouds/cli/jclouds-cli-assembly/maven-metadata.xml
Uploaded: https://repository.apache.org/content/repositories/snapshots/org/apache/jclouds/cli/jclouds-cli-assembly/maven-metadata.xml
(643 B at 8.6 KB/sec)
Uploading: https://repository.apache.org/content/repositories/snapshots/org/apache/jclouds/cli/jclouds-cli-assembly/2.1.0-SNAPSHOT/jclouds-cli-assembly-2.1.0-20171111.165101-209-tests.jar
Uploaded: https://repository.apache.org/content/repositories/snapshots/org/apache/jclouds/cli/jclouds-cli-assembly/2.1.0-SNAPSHOT/jclouds-cli-assembly-2.1.0-20171111.165101-209-tests.jar
(11 KB at 10.5 KB/sec)
Uploading: https://repository.apache.org/content/repositories/snapshots/org/apache/jclouds/cli/jclouds-cli-assembly/2.1.0-SNAPSHOT/maven-metadata.xml
Uploaded: https://repository.apache.org/content/repositories/snapshots/org/apache/jclouds/cli/jclouds-cli-assembly/2.1.0-SNAPSHOT/maven-metadata.xml
(2 KB at 3.6 KB/sec)
Uploading: https://repository.apache.org/content/repositories/snapshots/org/apache/jclouds/cli/jclouds-cli-assembly/2.1.0-SNAPSHOT/jclouds-cli-assembly-2.1.0-20171111.165101-209-sources.jar
Uploaded: https://repository.apache.org/content/repositories/snapshots/org/apache/jclouds/cli/jclouds-cli-assembly/2.1.0-SNAPSHOT/jclouds-cli-assembly-2.1.0-20171111.165101-209-sources.jar
(23 KB at 73.2 KB/sec)
Uploading: https://repository.apache.org/content/repositories/snapshots/org/apache/jclouds/cli/jclouds-cli-assembly/2.1.0-SNAPSHOT/maven-metadata.xml
Uploaded: https://repository.apache.org/content/repositories/snapshots/org/apache/jclouds/cli/jclouds-cli-assembly/2.1.0-SNAPSHOT/maven-metadata.xml
(2 KB at 3.2 KB/sec)
Uploading: https://repository.apache.org/content/repositories/snapshots/org/apache/jclouds/cli/jclouds-cli-assembly/2.1.0-SNAPSHOT/jclouds-cli-assembly-2.1.0-20171111.165101-209-test-sources.jar
Uploaded: https://repository.apache.org/content/repositories/snapshots/org/apache/jclouds/cli/jclouds-cli-assembly/2.1.0-SNAPSHOT/jclouds-cli-assembly-2.1.0-20171111.165101-209-test-sources.jar
(8 KB at 23.0 KB/sec)
Uploading: https://repository.apache.org/content/repositories/snapshots/org/apache/jclouds/cli/jclouds-cli-assembly/2.1.0-SNAPSHOT/maven-metadata.xml
Uploaded: https://repository.apache.org/content/repositories/snapshots/org/apache/jclouds/cli/jclouds-cli-assembly/2.1.0-SNAPSHOT/maven-metadata.xml
(2 KB at 3.2 KB/sec)
Uploading: https://repository.apache.org/content/repositories/snapshots/org/apache/jclouds/cli/jclouds-cli-assembly/2.1.0-SNAPSHOT/jclouds-cli-assembly-2.1.0-20171111.165101-209.tar.gz
Uploaded: https://repository.apache.org/content/repositories/snapshots/org/apache/jclouds/cli/jclouds-cli-assembly/2.1.0-SNAPSHOT/jclouds-cli-assembly-2.1.0-20171111.165101-209.tar.gz
(33044 KB at 14958.4 KB/sec)
Uploading: https://repository.apache.org/content/repositories/snapshots/org/apache/jclouds/cli/jclouds-cli-assembly/2.1.0-SNAPSHOT/maven-metadata.xml
Uploaded: https://repository.apache.org/content/repositories/snapshots/org/apache/jclouds/cli/jclouds-cli-assembly/2.1.0-SNAPSHOT/maven-metadata.xml
(2 KB at 2.8 KB/sec)
Uploading: https://repository.apache.org/content/repositories/snapshots/org/apache/jclouds/cli/jclouds-cli-assembly/2.1.0-SNAPSHOT/jclouds-cli-assembly-2.1.0-20171111.165101-209.zip
Uploaded: https://repository.apache.org/content/repositories/snapshots/org/apache/jclouds/cli/jclouds-cli-assembly/2.1.0-SNAPSHOT/jclouds-cli-assembly-2.1.0-20171111.165101-209.zip
(33357 KB at 15944.6 KB/sec)
Uploading: https://repository.apache.org/content/repositories/snapshots/org/apache/jclouds/cli/jclouds-cli-assembly/2.1.0-SNAPSHOT/maven-metadata.xml
Uploaded: https://repository.apache.org/content/repositories/snapshots/org/apache/jclouds/cli/jclouds-cli-assembly/2.1.0-SNAPSHOT/maven-metadata.xml
(2 KB at 5.6 KB/sec)
[INFO]                                                                         
[INFO] ------------------------------------------------------------------------
[INFO] Building Apache jclouds :: cli 2.1.0-SNAPSHOT
[INFO] ------------------------------------------------------------------------
[INFO] 
[INFO] --- maven-clean-plugin:2.5:clean (default-clean) @ jclouds-cli ---
[INFO] 
[INFO] --- maven-enforcer-plugin:1.1.1:enforce (enforce-banned-dependencies) @ jclouds-cli
---
[INFO] 
[INFO] --- maven-enforcer-plugin:1.1.1:enforce (enforce-java) @ jclouds-cli ---
[INFO] 
[INFO] --- maven-toolchains-plugin:1.1:toolchain (default) @ jclouds-cli ---
[INFO] Required toolchain: jdk [ vendor='oracle' version='1.7' ]
[INFO] Found matching toolchain for type jdk: JDK[/opt/jdk/jdk1.7.latest]
[INFO] 
[INFO] --- maven-remote-resources-plugin:1.5:process (default) @ jclouds-cli ---
[INFO] 
[INFO] --- maven-bundle-plugin:2.3.7:manifest (bundle-manifest) @ jclouds-cli ---
[WARNING] Ignoring project type pom - supportedProjectTypes = [jar, war, bundle]
[INFO] 
[INFO] --- animal-sniffer-maven-plugin:1.11:check (default) @ jclouds-cli ---
[INFO] Checking unresolved references to org.codehaus.mojo.signature:java16:1.1
[INFO] 
[INFO] --- maven-site-plugin:3.3:attach-descriptor (attach-descriptor) @ jclouds-cli ---
[INFO] 
[INFO] --- apache-rat-plugin:0.10:check (default) @ jclouds-cli ---
[INFO] 55 implicit excludes (use -debug for more details).
[INFO] Exclude: **/LICENSE.txt
[INFO] Exclude: **/header.txt
[INFO] Exclude: **/NOTICE.txt
[INFO] Exclude: **/DISCLAIMER
[INFO] Exclude: **/BUILD.txt
[INFO] Exclude: **/CHANGES.txt
[INFO] Exclude: **/README.md
[INFO] Exclude: **/README.txt
[INFO] Exclude: **/DEPENDENCIES
[INFO] Exclude: **/CONTRIBUTING.md
[INFO] Exclude: .git/**
[INFO] Exclude: **/.gitignore
[INFO] Exclude: **/*.json
[INFO] Exclude: **/*.log*
[INFO] Exclude: **/TODO
[INFO] Exclude: .mailmap
[INFO] Exclude: .idea/**
[INFO] Exclude: **/*.iml
[INFO] Exclude: **/.project
[INFO] Exclude: **/.classpath
[INFO] Exclude: **/.settings/**
[INFO] Exclude: **/.checkstyle
[INFO] Exclude: **/target/**
[INFO] Exclude: .repository/**
[INFO] 1 resources included (use -debug for more details)
Warning:  org.apache.xerces.jaxp.SAXParserImpl$JAXPSAXParser: Property 'http://www.oracle.com/xml/jaxp/properties/entityExpansionLimit'
is not recognized.
Compiler warnings:
  WARNING:  'org.apache.xerces.jaxp.SAXParserImpl: Property 'http://javax.xml.XMLConstants/property/accessExternalDTD'
is not recognized.'
Warning:  org.apache.xerces.parsers.SAXParser: Feature 'http://javax.xml.XMLConstants/feature/secure-processing'
is not recognized.
Warning:  org.apache.xerces.parsers.SAXParser: Property 'http://javax.xml.XMLConstants/property/accessExternalDTD'
is not recognized.
Warning:  org.apache.xerces.parsers.SAXParser: Property 'http://www.oracle.com/xml/jaxp/properties/entityExpansionLimit'
is not recognized.
[INFO] Rat check: Summary of files. Unapproved: 0 unknown: 0 generated: 0 approved: 1 licence.
[INFO] 
[INFO] --- maven-jar-plugin:2.4:test-jar (default) @ jclouds-cli ---
[WARNING] JAR will be empty - no content was marked for inclusion!
[INFO] Building jar: <https://jclouds.ci.cloudbees.com/job/jclouds-cli/ws/target/jclouds-cli-2.1.0-SNAPSHOT-tests.jar>
[INFO] 
[INFO] --- maven-javadoc-plugin:2.9:jar (javadoc) @ jclouds-cli ---
[INFO] Not executing Javadoc as the project is not a Java classpath-capable package
[INFO] 
[INFO] --- maven-source-plugin:2.2:jar-no-fork (attach-sources) @ jclouds-cli ---
[INFO] 
[INFO] --- maven-source-plugin:2.2:test-jar-no-fork (attach-sources) @ jclouds-cli ---
[INFO] 
[INFO] --- maven-surefire-plugin:2.17:test (integration) @ jclouds-cli ---
[INFO] Toolchain in surefire-plugin: JDK[/opt/jdk/jdk1.7.latest]
[INFO] No tests to run.
[JENKINS] Recording test results
[INFO] 
[INFO] --- duplicate-finder-maven-plugin:1.1.2:check (default) @ jclouds-cli ---
[INFO] Skipping duplicate-finder execution!
[INFO] 
[INFO] --- maven-checkstyle-plugin:2.15:check (default) @ jclouds-cli ---
[INFO] 
[INFO] --- modernizer-maven-plugin:1.4.0:modernizer (modernizer) @ jclouds-cli ---
[INFO] 
[INFO] --- maven-install-plugin:2.4:install (default-install) @ jclouds-cli ---
[INFO] Installing <https://jclouds.ci.cloudbees.com/job/jclouds-cli/ws/pom.xml> to /home/jenkins/.m2/repository/org/apache/jclouds/cli/jclouds-cli/2.1.0-SNAPSHOT/jclouds-cli-2.1.0-SNAPSHOT.pom
[INFO] Installing <https://jclouds.ci.cloudbees.com/job/jclouds-cli/ws/target/jclouds-cli-2.1.0-SNAPSHOT-tests.jar>
to /home/jenkins/.m2/repository/org/apache/jclouds/cli/jclouds-cli/2.1.0-SNAPSHOT/jclouds-cli-2.1.0-SNAPSHOT-tests.jar
[INFO] 
[INFO] --- maven-deploy-plugin:2.7:deploy (default-deploy) @ jclouds-cli ---
Downloading: https://repository.apache.org/content/repositories/snapshots/org/apache/jclouds/cli/jclouds-cli/2.1.0-SNAPSHOT/maven-metadata.xml
Downloaded: https://repository.apache.org/content/repositories/snapshots/org/apache/jclouds/cli/jclouds-cli/2.1.0-SNAPSHOT/maven-metadata.xml
(828 B at 14.2 KB/sec)
Uploading: https://repository.apache.org/content/repositories/snapshots/org/apache/jclouds/cli/jclouds-cli/2.1.0-SNAPSHOT/jclouds-cli-2.1.0-20171111.165114-208.pom
Uploaded: https://repository.apache.org/content/repositories/snapshots/org/apache/jclouds/cli/jclouds-cli/2.1.0-SNAPSHOT/jclouds-cli-2.1.0-20171111.165114-208.pom
(4 KB at 10.4 KB/sec)
Downloading: https://repository.apache.org/content/repositories/snapshots/org/apache/jclouds/cli/jclouds-cli/maven-metadata.xml
Downloaded: https://repository.apache.org/content/repositories/snapshots/org/apache/jclouds/cli/jclouds-cli/maven-metadata.xml
(674 B at 2.3 KB/sec)
Uploading: https://repository.apache.org/content/repositories/snapshots/org/apache/jclouds/cli/jclouds-cli/2.1.0-SNAPSHOT/maven-metadata.xml
Uploaded: https://repository.apache.org/content/repositories/snapshots/org/apache/jclouds/cli/jclouds-cli/2.1.0-SNAPSHOT/maven-metadata.xml
(828 B at 10.8 KB/sec)
Uploading: https://repository.apache.org/content/repositories/snapshots/org/apache/jclouds/cli/jclouds-cli/maven-metadata.xml
Uploaded: https://repository.apache.org/content/repositories/snapshots/org/apache/jclouds/cli/jclouds-cli/maven-metadata.xml
(674 B at 1.3 KB/sec)
Uploading: https://repository.apache.org/content/repositories/snapshots/org/apache/jclouds/cli/jclouds-cli/2.1.0-SNAPSHOT/jclouds-cli-2.1.0-20171111.165114-208-tests.jar
Uploaded: https://repository.apache.org/content/repositories/snapshots/org/apache/jclouds/cli/jclouds-cli/2.1.0-SNAPSHOT/jclouds-cli-2.1.0-20171111.165114-208-tests.jar
(3 KB at 7.8 KB/sec)
Uploading: https://repository.apache.org/content/repositories/snapshots/org/apache/jclouds/cli/jclouds-cli/2.1.0-SNAPSHOT/maven-metadata.xml
Uploaded: https://repository.apache.org/content/repositories/snapshots/org/apache/jclouds/cli/jclouds-cli/2.1.0-SNAPSHOT/maven-metadata.xml
(828 B at 1.0 KB/sec)
[INFO] ------------------------------------------------------------------------
[INFO] Reactor Summary:
[INFO] 
[INFO] Apache jclouds :: cli :: project .................. SUCCESS [21.129s]
[INFO] Apache jclouds :: cli :: branding ................. SUCCESS [9.856s]
[INFO] Apache jclouds :: cli :: runner ................... SUCCESS [48.811s]
[INFO] Apache jclouds :: cli :: assembly ................. SUCCESS [1:12.717s]
[INFO] Apache jclouds :: cli ............................. SUCCESS [3.954s]
[INFO] ------------------------------------------------------------------------
[INFO] BUILD SUCCESS
[INFO] ------------------------------------------------------------------------
[INFO] Total time: 2:42.718s
[INFO] Finished at: Sat Nov 11 11:51:16 EST 2017
[INFO] Final Memory: 50M/241M
[INFO] ------------------------------------------------------------------------
Waiting for Jenkins to finish collecting data
[JENKINS] Archiving <https://jclouds.ci.cloudbees.com/job/jclouds-cli/ws/branding/pom.xml>
to org.apache.jclouds.cli/jclouds-cli-branding/2.1.0-SNAPSHOT/jclouds-cli-branding-2.1.0-SNAPSHOT.pom
[JENKINS] Archiving <https://jclouds.ci.cloudbees.com/job/jclouds-cli/ws/branding/target/jclouds-cli-branding-2.1.0-SNAPSHOT.jar>
to org.apache.jclouds.cli/jclouds-cli-branding/2.1.0-20171111.164904-264/jclouds-cli-branding-2.1.0-20171111.164904-264.jar
[JENKINS] Archiving <https://jclouds.ci.cloudbees.com/job/jclouds-cli/ws/branding/target/jclouds-cli-branding-2.1.0-SNAPSHOT-tests.jar>
to org.apache.jclouds.cli/jclouds-cli-branding/2.1.0-20171111.164904-264/jclouds-cli-branding-2.1.0-20171111.164904-264-tests.jar
[JENKINS] Archiving <https://jclouds.ci.cloudbees.com/job/jclouds-cli/ws/branding/target/jclouds-cli-branding-2.1.0-SNAPSHOT-sources.jar>
to org.apache.jclouds.cli/jclouds-cli-branding/2.1.0-20171111.164904-264/jclouds-cli-branding-2.1.0-20171111.164904-264-sources.jar
[JENKINS] Archiving <https://jclouds.ci.cloudbees.com/job/jclouds-cli/ws/branding/target/jclouds-cli-branding-2.1.0-SNAPSHOT-test-sources.jar>
to org.apache.jclouds.cli/jclouds-cli-branding/2.1.0-20171111.164904-264/jclouds-cli-branding-2.1.0-20171111.164904-264-test-sources.jar
[JENKINS] Archiving <https://jclouds.ci.cloudbees.com/job/jclouds-cli/ws/assembly/pom.xml>
to org.apache.jclouds.cli/jclouds-cli-assembly/2.1.0-SNAPSHOT/jclouds-cli-assembly-2.1.0-SNAPSHOT.pom
[JENKINS] Archiving <https://jclouds.ci.cloudbees.com/job/jclouds-cli/ws/assembly/target/jclouds-cli-assembly-2.1.0-SNAPSHOT.jar>
to org.apache.jclouds.cli/jclouds-cli-assembly/2.1.0-20171111.165101-209/jclouds-cli-assembly-2.1.0-20171111.165101-209.jar
[JENKINS] Archiving <https://jclouds.ci.cloudbees.com/job/jclouds-cli/ws/assembly/target/jclouds-cli-assembly-2.1.0-SNAPSHOT-tests.jar>
to org.apache.jclouds.cli/jclouds-cli-assembly/2.1.0-20171111.165101-209/jclouds-cli-assembly-2.1.0-20171111.165101-209-tests.jar
[JENKINS] Archiving <https://jclouds.ci.cloudbees.com/job/jclouds-cli/ws/assembly/target/jclouds-cli-assembly-2.1.0-SNAPSHOT-sources.jar>
to org.apache.jclouds.cli/jclouds-cli-assembly/2.1.0-20171111.165101-209/jclouds-cli-assembly-2.1.0-20171111.165101-209-sources.jar
[JENKINS] Archiving <https://jclouds.ci.cloudbees.com/job/jclouds-cli/ws/assembly/target/jclouds-cli-assembly-2.1.0-SNAPSHOT-test-sources.jar>
to org.apache.jclouds.cli/jclouds-cli-assembly/2.1.0-20171111.165101-209/jclouds-cli-assembly-2.1.0-20171111.165101-209-test-sources.jar
[JENKINS] Archiving <https://jclouds.ci.cloudbees.com/job/jclouds-cli/ws/assembly/target/jclouds-cli-2.1.0-SNAPSHOT.tar.gz>
to org.apache.jclouds.cli/jclouds-cli-assembly/2.1.0-20171111.165101-209/jclouds-cli-assembly-2.1.0-20171111.165101-209.tar.gz
[JENKINS] Archiving <https://jclouds.ci.cloudbees.com/job/jclouds-cli/ws/assembly/target/jclouds-cli-2.1.0-SNAPSHOT.zip>
to org.apache.jclouds.cli/jclouds-cli-assembly/2.1.0-20171111.165101-209/jclouds-cli-assembly-2.1.0-20171111.165101-209.zip
Build timed out (after 3 minutes). Marking the build as aborted.
Deleting 1 temporary files
ERROR: Failed to parse POMs
java.io.IOException: java.lang.InterruptedException
	at java.lang.Object.wait(Native Method)
	at hudson.remoting.FastPipedInputStream.read(FastPipedInputStream.java:175)
Caused: java.io.IOException
	at hudson.remoting.FastPipedInputStream.read(FastPipedInputStream.java:177)
	at hudson.util.HeadBufferingStream.read(HeadBufferingStream.java:61)
	at com.jcraft.jzlib.InflaterInputStream.fill(InflaterInputStream.java:175)
	at com.jcraft.jzlib.InflaterInputStream.read(InflaterInputStream.java:106)
	at org.apache.commons.compress.archivers.tar.TarArchiveInputStream.read(TarArchiveInputStream.java:614)
	at java.io.InputStream.read(InputStream.java:101)
	at org.apache.commons.io.IOUtils.copyLarge(IOUtils.java:1792)
	at org.apache.commons.io.IOUtils.copyLarge(IOUtils.java:1769)
	at org.apache.commons.io.IOUtils.copy(IOUtils.java:1744)
	at hudson.util.IOUtils.copy(IOUtils.java:40)
	at hudson.FilePath.readFromTar(FilePath.java:2297)
Caused: java.io.IOException: Failed to extract <https://jclouds.ci.cloudbees.com/job/jclouds-cli/ws/assembly/transfer>
of 7 files
	at hudson.FilePath.readFromTar(FilePath.java:2307)
	at hudson.FilePath.copyRecursiveTo(FilePath.java:2217)
	at jenkins.model.StandardArtifactManager.archive(StandardArtifactManager.java:61)
	at hudson.maven.MavenBuild$ProxyImpl.performArchiving(MavenBuild.java:486)
	at hudson.maven.MavenModuleSetBuild$MavenModuleSetBuildExecution.doRun(MavenModuleSetBuild.java:880)
	at hudson.model.AbstractBuild$AbstractBuildExecution.run(AbstractBuild.java:506)
	at hudson.model.Run.execute(Run.java:1737)
	at hudson.maven.MavenModuleSetBuild.run(MavenModuleSetBuild.java:542)
	at hudson.model.ResourceController.execute(ResourceController.java:97)
	at hudson.model.Executor.run(Executor.java:421)

	at hudson.FilePath.copyRecursiveTo(FilePath.java:2224)
	at jenkins.model.StandardArtifactManager.archive(StandardArtifactManager.java:61)
	at hudson.maven.MavenBuild$ProxyImpl.performArchiving(MavenBuild.java:486)
	at hudson.maven.MavenModuleSetBuild$MavenModuleSetBuildExecution.doRun(MavenModuleSetBuild.java:880)
	at hudson.model.AbstractBuild$AbstractBuildExecution.run(AbstractBuild.java:506)
	at hudson.model.Run.execute(Run.java:1737)
	at hudson.maven.MavenModuleSetBuild.run(MavenModuleSetBuild.java:542)
	at hudson.model.ResourceController.execute(ResourceController.java:97)
	at hudson.model.Executor.run(Executor.java:421)
Caused by: java.util.concurrent.ExecutionException: java.io.IOException: This archives contains
unclosed entries.
	at hudson.remoting.Channel$2.adapt(Channel.java:942)
	at hudson.remoting.Channel$2.adapt(Channel.java:937)
	at hudson.remoting.FutureAdapter.get(FutureAdapter.java:59)
	at hudson.FilePath.copyRecursiveTo(FilePath.java:2220)
	... 8 more
Caused by: java.io.IOException: This archives contains unclosed entries.
	at org.apache.commons.compress.archivers.tar.TarArchiveOutputStream.finish(TarArchiveOutputStream.java:225)
	at org.apache.commons.compress.archivers.tar.TarArchiveOutputStream.close(TarArchiveOutputStream.java:241)
	at hudson.util.io.TarArchiver.close(TarArchiver.java:124)
	at hudson.FilePath.writeToTar(FilePath.java:2271)
	at hudson.FilePath.access$2100(FilePath.java:197)
	at hudson.FilePath$45.invoke(FilePath.java:2212)
	at hudson.FilePath$45.invoke(FilePath.java:2208)
	at hudson.FilePath$FileCallableWrapper.call(FilePath.java:2750)
	at hudson.remoting.UserRequest.perform(UserRequest.java:205)
	at hudson.remoting.UserRequest.perform(UserRequest.java:52)
	at hudson.remoting.Request$2.run(Request.java:356)
	at hudson.remoting.InterceptingExecutorService$1.call(InterceptingExecutorService.java:72)
	at java.util.concurrent.FutureTask.run(FutureTask.java:266)
	at java.util.concurrent.ThreadPoolExecutor.runWorker(ThreadPoolExecutor.java:1142)
	at java.util.concurrent.ThreadPoolExecutor$Worker.run(ThreadPoolExecutor.java:617)
	at java.lang.Thread.run(Thread.java:745)
	Suppressed: hudson.remoting.Channel$CallSiteStackTrace: Remote call to 50507207
		at hudson.remoting.Channel.attachCallSiteStackTrace(Channel.java:1655)
		at hudson.remoting.UserResponse.retrieve(UserRequest.java:308)
		at hudson.remoting.Channel$2.adapt(Channel.java:940)
		at hudson.remoting.Channel$2.adapt(Channel.java:937)
		at hudson.remoting.FutureAdapter.get(FutureAdapter.java:59)
		at hudson.FilePath.copyRecursiveTo(FilePath.java:2220)
		at jenkins.model.StandardArtifactManager.archive(StandardArtifactManager.java:61)
		at hudson.maven.MavenBuild$ProxyImpl.performArchiving(MavenBuild.java:486)
		at hudson.maven.MavenModuleSetBuild$MavenModuleSetBuildExecution.doRun(MavenModuleSetBuild.java:880)
		at hudson.model.AbstractBuild$AbstractBuildExecution.run(AbstractBuild.java:506)
		at hudson.model.Run.execute(Run.java:1737)
		at hudson.maven.MavenModuleSetBuild.run(MavenModuleSetBuild.java:542)
		at hudson.model.ResourceController.execute(ResourceController.java:97)
		at hudson.model.Executor.run(Executor.java:421)
channel stopped

Mime
View raw message