jclouds-notifications mailing list archives

Site index · List index
Message view « Date » · « Thread »
Top « Date » · « Thread »
From jenkins-no-re...@cloudbees.com
Subject Build failed in Jenkins: jclouds-labs #1695
Date Wed, 21 Feb 2018 15:17:08 GMT
See <https://jclouds.ci.cloudbees.com/job/jclouds-labs/1695/display/redirect?page=changes>

Changes:

[andreaturli] Apache jclouds 2.1.0-rc3 release

[andreaturli] Next development version 2.2.0-SNAPSHOST

------------------------------------------
Started by an SCM change
Building remotely on 61c75c0d (standard m1.large lxc-fedora17 large) in workspace <https://jclouds.ci.cloudbees.com/job/jclouds-labs/ws/>
$ sudo /opt/jenkins/sbin/mount-webdav https://repository-jclouds.forge.cloudbees.com/private
jclouds alert
Cloning the remote Git repository
Cloning repository https://git-wip-us.apache.org/repos/asf/jclouds-labs.git
 > git init <https://jclouds.ci.cloudbees.com/job/jclouds-labs/ws/> # timeout=10
Fetching upstream changes from https://git-wip-us.apache.org/repos/asf/jclouds-labs.git
 > git --version # timeout=10
 > git fetch --tags --progress https://git-wip-us.apache.org/repos/asf/jclouds-labs.git
+refs/heads/*:refs/remotes/origin/*
 > git config remote.origin.url https://git-wip-us.apache.org/repos/asf/jclouds-labs.git
# timeout=10
 > git config --add remote.origin.fetch +refs/heads/*:refs/remotes/origin/* # timeout=10
 > git config remote.origin.url https://git-wip-us.apache.org/repos/asf/jclouds-labs.git
# timeout=10
Fetching upstream changes from https://git-wip-us.apache.org/repos/asf/jclouds-labs.git
 > git fetch --tags --progress https://git-wip-us.apache.org/repos/asf/jclouds-labs.git
+refs/heads/*:refs/remotes/origin/*
 > git rev-parse refs/remotes/origin/master^{commit} # timeout=10
 > git rev-parse refs/remotes/origin/origin/master^{commit} # timeout=10
Checking out Revision cc58112107b873e66b6292cbdb54e3b8f7be6f97 (refs/remotes/origin/master)
Commit message: "Next development version 2.2.0-SNAPSHOST"
 > git config core.sparsecheckout # timeout=10
 > git checkout -f cc58112107b873e66b6292cbdb54e3b8f7be6f97
 > git rev-list ac03bac4d24bc00b74f194b4eb7ee84ba7eb409e # timeout=10
 > git tag -a -f -m Jenkins Build #1695 jenkins-jclouds-labs-1695 # timeout=10
provisioning config files...
copy managed file [JDK toolchains] to file:<https://jclouds.ci.cloudbees.com/job/jclouds-labs/ws/@tmp/config8967024196229640313tmp>
Parsing POMs
Failed to transfer Could not find artifact org.apache.jclouds:jclouds-project:pom:2.2.0-SNAPSHOST
in central (https://repo.cloudbees.com/content/repositories/central)
Failed to transfer Could not find artifact org.apache.jclouds:jclouds-project:pom:2.2.0-SNAPSHOST
in cloudbees-private-release-repository (https://repository-jclouds.forge.cloudbees.com/release)
Deleting 1 temporary files
ERROR: Failed to parse POMs
java.io.IOException: remote file operation failed: <https://jclouds.ci.cloudbees.com/job/jclouds-labs/ws/>
at hudson.remoting.Channel@106306f6:61c75c0d: hudson.remoting.ProxyException: hudson.maven.MavenModuleSetBuild$MavenExecutionException:
org.apache.maven.project.ProjectBuildingException: Some problems were encountered while processing
the POMs:
[FATAL] Non-resolvable parent POM: Could not find artifact org.apache.jclouds:jclouds-project:pom:2.2.0-SNAPSHOST
in central (https://repo.cloudbees.com/content/repositories/central) and 'parent.relativePath'
points at wrong local POM @ line 21, column 11

	at hudson.FilePath.act(FilePath.java:994)
	at hudson.FilePath.act(FilePath.java:976)
	at hudson.maven.MavenModuleSetBuild$MavenModuleSetBuildExecution.parsePoms(MavenModuleSetBuild.java:985)
	at hudson.maven.MavenModuleSetBuild$MavenModuleSetBuildExecution.doRun(MavenModuleSetBuild.java:690)
	at hudson.model.AbstractBuild$AbstractBuildExecution.run(AbstractBuild.java:506)
	at hudson.model.Run.execute(Run.java:1737)
	at hudson.maven.MavenModuleSetBuild.run(MavenModuleSetBuild.java:542)
	at hudson.model.ResourceController.execute(ResourceController.java:97)
	at hudson.model.Executor.run(Executor.java:421)
Caused by: hudson.remoting.ProxyException: hudson.maven.MavenModuleSetBuild$MavenExecutionException:
org.apache.maven.project.ProjectBuildingException: Some problems were encountered while processing
the POMs:
[FATAL] Non-resolvable parent POM: Could not find artifact org.apache.jclouds:jclouds-project:pom:2.2.0-SNAPSHOST
in central (https://repo.cloudbees.com/content/repositories/central) and 'parent.relativePath'
points at wrong local POM @ line 21, column 11

	at hudson.maven.MavenModuleSetBuild$PomParser.invoke(MavenModuleSetBuild.java:1389)
	at hudson.maven.MavenModuleSetBuild$PomParser.invoke(MavenModuleSetBuild.java:1123)
	at hudson.FilePath$FileCallableWrapper.call(FilePath.java:2750)
	at hudson.remoting.UserRequest.perform(UserRequest.java:205)
	at hudson.remoting.UserRequest.perform(UserRequest.java:52)
	at hudson.remoting.Request$2.run(Request.java:356)
	at hudson.remoting.InterceptingExecutorService$1.call(InterceptingExecutorService.java:72)
	at java.util.concurrent.FutureTask.run(FutureTask.java:266)
	at java.util.concurrent.ThreadPoolExecutor.runWorker(ThreadPoolExecutor.java:1142)
	at java.util.concurrent.ThreadPoolExecutor$Worker.run(ThreadPoolExecutor.java:617)
	at java.lang.Thread.run(Thread.java:745)
	Suppressed: hudson.remoting.Channel$CallSiteStackTrace: Remote call to 61c75c0d
		at hudson.remoting.Channel.attachCallSiteStackTrace(Channel.java:1655)
		at hudson.remoting.UserResponse.retrieve(UserRequest.java:308)
		at hudson.remoting.Channel.call(Channel.java:904)
		at hudson.FilePath.act(FilePath.java:987)
		at hudson.FilePath.act(FilePath.java:976)
		at hudson.maven.MavenModuleSetBuild$MavenModuleSetBuildExecution.parsePoms(MavenModuleSetBuild.java:985)
		at hudson.maven.MavenModuleSetBuild$MavenModuleSetBuildExecution.doRun(MavenModuleSetBuild.java:690)
		at hudson.model.AbstractBuild$AbstractBuildExecution.run(AbstractBuild.java:506)
		at hudson.model.Run.execute(Run.java:1737)
		at hudson.maven.MavenModuleSetBuild.run(MavenModuleSetBuild.java:542)
		at hudson.model.ResourceController.execute(ResourceController.java:97)
		at hudson.model.Executor.run(Executor.java:421)
Caused by: hudson.remoting.ProxyException: org.apache.maven.project.ProjectBuildingException:
Some problems were encountered while processing the POMs:
[FATAL] Non-resolvable parent POM: Could not find artifact org.apache.jclouds:jclouds-project:pom:2.2.0-SNAPSHOST
in central (https://repo.cloudbees.com/content/repositories/central) and 'parent.relativePath'
points at wrong local POM @ line 21, column 11

	at org.apache.maven.project.DefaultProjectBuilder.build(DefaultProjectBuilder.java:364)
	at hudson.maven.MavenEmbedder.buildProjects(MavenEmbedder.java:361)
	at hudson.maven.MavenEmbedder.readProjects(MavenEmbedder.java:331)
	at hudson.maven.MavenModuleSetBuild$PomParser.invoke(MavenModuleSetBuild.java:1326)
	... 10 more

Mime
View raw message