jclouds-notifications mailing list archives

Site index · List index
Message view « Date » · « Thread »
Top « Date » · « Thread »
From Apache Jenkins Server <jenk...@builds.apache.org>
Subject Build failed in Jenkins: 2.1.x » jclouds-labs-2.1.x #32
Date Wed, 06 Feb 2019 20:16:50 GMT
See <https://builds.apache.org/job/jclouds-2.1.x/job/jclouds-labs-2.1.x/32/display/redirect?page=changes>

Changes:

[andrew] Apache jclouds 2.1.2-rc1 release

[andrew] Next development version 2.1.3-SNAPSHOT

------------------------------------------
Started by an SCM change
[EnvInject] - Loading node environment variables.
Building remotely on H37 (ubuntu xenial) in workspace <https://builds.apache.org/job/jclouds-2.1.x/job/jclouds-labs-2.1.x/ws/>
 > git rev-parse --is-inside-work-tree # timeout=10
Fetching changes from the remote Git repository
 > git config remote.origin.url https://gitbox.apache.org/repos/asf/jclouds-labs.git #
timeout=10
Fetching upstream changes from https://gitbox.apache.org/repos/asf/jclouds-labs.git
 > git --version # timeout=10
 > git fetch --tags --progress https://gitbox.apache.org/repos/asf/jclouds-labs.git +refs/heads/*:refs/remotes/origin/*
 > git rev-parse refs/remotes/origin/2.1.x^{commit} # timeout=10
 > git rev-parse refs/remotes/origin/origin/2.1.x^{commit} # timeout=10
Checking out Revision 4fed047d61efbc8f5ea48a93a37f179e873642e2 (refs/remotes/origin/2.1.x)
 > git config core.sparsecheckout # timeout=10
 > git checkout -f 4fed047d61efbc8f5ea48a93a37f179e873642e2
Commit message: "Next development version 2.1.3-SNAPSHOT"
 > git rev-list --no-walk 30b2ee9016a9f296a7e7ff5e219972f32db385dd # timeout=10
Parsing POMs
Failed to transfer Could not find metadata org.apache.jclouds:jclouds-project:2.1.3-SNAPSHOT/maven-metadata.xml
in apache-snapshots (https://repository.apache.org/content/repositories/snapshots)
Failed to transfer Could not find artifact org.apache.jclouds:jclouds-project:pom:2.1.3-SNAPSHOT
in apache-snapshots (https://repository.apache.org/content/repositories/snapshots)
ERROR: Failed to parse POMs
hudson.remoting.ProxyException: hudson.maven.MavenModuleSetBuild$MavenExecutionException:
org.apache.maven.project.ProjectBuildingException: Some problems were encountered while processing
the POMs:
[FATAL] Non-resolvable parent POM: Could not find artifact org.apache.jclouds:jclouds-project:pom:2.1.3-SNAPSHOT
in apache-snapshots (https://repository.apache.org/content/repositories/snapshots) and 'parent.relativePath'
points at wrong local POM @ line 21, column 11

	at hudson.maven.MavenModuleSetBuild$PomParser.invoke(MavenModuleSetBuild.java:1391)
	at hudson.maven.MavenModuleSetBuild$PomParser.invoke(MavenModuleSetBuild.java:1125)
	at hudson.FilePath$FileCallableWrapper.call(FilePath.java:3086)
	at hudson.remoting.UserRequest.perform(UserRequest.java:212)
	at hudson.remoting.UserRequest.perform(UserRequest.java:54)
	at hudson.remoting.Request$2.run(Request.java:369)
	at hudson.remoting.InterceptingExecutorService$1.call(InterceptingExecutorService.java:72)
	at java.util.concurrent.FutureTask.run(FutureTask.java:266)
	at java.util.concurrent.ThreadPoolExecutor.runWorker(ThreadPoolExecutor.java:1142)
	at java.util.concurrent.ThreadPoolExecutor$Worker.run(ThreadPoolExecutor.java:617)
	at java.lang.Thread.run(Thread.java:748)
	Suppressed: hudson.remoting.Channel$CallSiteStackTrace: Remote call to H37
		at hudson.remoting.Channel.attachCallSiteStackTrace(Channel.java:1741)
		at hudson.remoting.UserRequest$ExceptionResponse.retrieve(UserRequest.java:357)
		at hudson.remoting.Channel.call(Channel.java:955)
		at hudson.FilePath.act(FilePath.java:1072)
		at hudson.FilePath.act(FilePath.java:1061)
		at hudson.maven.MavenModuleSetBuild$MavenModuleSetBuildExecution.parsePoms(MavenModuleSetBuild.java:986)
		at hudson.maven.MavenModuleSetBuild$MavenModuleSetBuildExecution.doRun(MavenModuleSetBuild.java:691)
		at hudson.model.AbstractBuild$AbstractBuildExecution.run(AbstractBuild.java:504)
		at hudson.model.Run.execute(Run.java:1810)
		at hudson.maven.MavenModuleSetBuild.run(MavenModuleSetBuild.java:543)
		at hudson.model.ResourceController.execute(ResourceController.java:97)
		at hudson.model.Executor.run(Executor.java:429)
Caused by: hudson.remoting.ProxyException: org.apache.maven.project.ProjectBuildingException:
Some problems were encountered while processing the POMs:
[FATAL] Non-resolvable parent POM: Could not find artifact org.apache.jclouds:jclouds-project:pom:2.1.3-SNAPSHOT
in apache-snapshots (https://repository.apache.org/content/repositories/snapshots) and 'parent.relativePath'
points at wrong local POM @ line 21, column 11

	at org.apache.maven.project.DefaultProjectBuilder.build(DefaultProjectBuilder.java:364)
	at hudson.maven.MavenEmbedder.buildProjects(MavenEmbedder.java:361)
	at hudson.maven.MavenEmbedder.readProjects(MavenEmbedder.java:331)
	at hudson.maven.MavenModuleSetBuild$PomParser.invoke(MavenModuleSetBuild.java:1328)
	... 10 more

Mime
View raw message