jclouds-notifications mailing list archives

Site index · List index
Message view « Date » · « Thread »
Top « Date » · « Thread »
From Apache Jenkins Server <jenk...@builds.apache.org>
Subject Build failed in Jenkins: jclouds-karaf #68
Date Sun, 14 Apr 2019 06:26:32 GMT
See <https://builds.apache.org/job/jclouds-karaf/68/display/redirect>

------------------------------------------
Started by upstream project "jclouds-labs" build number 44
originally caused by:
 Started by an SCM change
[EnvInject] - Loading node environment variables.
Building remotely on H31 (ubuntu xenial) in workspace /home/jenkins/jenkins-slave/workspace/jclouds-karaf
No credentials specified
 > git rev-parse --is-inside-work-tree # timeout=10
Fetching changes from the remote Git repository
 > git config remote.origin.url https://gitbox.apache.org/repos/asf/jclouds-karaf.git #
timeout=10
Fetching upstream changes from https://gitbox.apache.org/repos/asf/jclouds-karaf.git
 > git --version # timeout=10
 > git fetch --tags --progress https://gitbox.apache.org/repos/asf/jclouds-karaf.git +refs/heads/*:refs/remotes/origin/*
 > git rev-parse refs/remotes/origin/master^{commit} # timeout=10
 > git rev-parse refs/remotes/origin/origin/master^{commit} # timeout=10
Checking out Revision c148470a2d45ef631f2a41678a6ed9aa9d7c0520 (refs/remotes/origin/master)
 > git config core.sparsecheckout # timeout=10
 > git checkout -f c148470a2d45ef631f2a41678a6ed9aa9d7c0520
Commit message: "Update scm to use gitbox"
 > git rev-list --no-walk c148470a2d45ef631f2a41678a6ed9aa9d7c0520 # timeout=10
Parsing POMs
ERROR: Processing failed due to a bug in the code. Please report this to the issue tracker
(https://jenkins.io/redirect/report-an-issue).
hudson.remoting.RequestAbortedException: java.io.IOException: Unexpected termination of the
channel
	at hudson.remoting.Request.abort(Request.java:340)
	at hudson.remoting.Channel.terminate(Channel.java:1038)
	at hudson.remoting.SynchronousCommandTransport$ReaderThread.run(SynchronousCommandTransport.java:94)
	Suppressed: hudson.remoting.Channel$CallSiteStackTrace: Remote call to H31
		at hudson.remoting.Channel.attachCallSiteStackTrace(Channel.java:1741)
		at hudson.remoting.Request.call(Request.java:202)
		at hudson.remoting.Channel.call(Channel.java:954)
		at hudson.FilePath.act(FilePath.java:1072)
		at hudson.FilePath.act(FilePath.java:1061)
		at hudson.maven.MavenModuleSetBuild$MavenModuleSetBuildExecution.parsePoms(MavenModuleSetBuild.java:986)
		at hudson.maven.MavenModuleSetBuild$MavenModuleSetBuildExecution.doRun(MavenModuleSetBuild.java:691)
		at hudson.model.AbstractBuild$AbstractBuildExecution.run(AbstractBuild.java:504)
		at hudson.model.Run.execute(Run.java:1810)
		at hudson.maven.MavenModuleSetBuild.run(MavenModuleSetBuild.java:543)
		at hudson.model.ResourceController.execute(ResourceController.java:97)
		at hudson.model.Executor.run(Executor.java:429)
Caused by: java.io.IOException: Unexpected termination of the channel
	at hudson.remoting.SynchronousCommandTransport$ReaderThread.run(SynchronousCommandTransport.java:77)
Caused by: java.io.EOFException
	at java.io.ObjectInputStream$PeekInputStream.readFully(ObjectInputStream.java:2681)
	at java.io.ObjectInputStream$BlockDataInputStream.readShort(ObjectInputStream.java:3156)
	at java.io.ObjectInputStream.readStreamHeader(ObjectInputStream.java:862)
	at java.io.ObjectInputStream.<init>(ObjectInputStream.java:358)
	at hudson.remoting.ObjectInputStreamEx.<init>(ObjectInputStreamEx.java:49)
	at hudson.remoting.Command.readFrom(Command.java:140)
	at hudson.remoting.Command.readFrom(Command.java:126)
	at hudson.remoting.AbstractSynchronousByteArrayCommandTransport.read(AbstractSynchronousByteArrayCommandTransport.java:36)
	at hudson.remoting.SynchronousCommandTransport$ReaderThread.run(SynchronousCommandTransport.java:63)
project=hudson.maven.MavenModuleSet@7c305a06[jclouds-karaf]
project.getModules()=[hudson.maven.MavenModule@454efc41[jclouds-karaf/org.apache.jclouds:jclouds-karaf][jclouds-karaf/org.apache.jclouds:jclouds-karaf][relativePath:],
hudson.maven.MavenModule@1faa1492[jclouds-karaf/org.apache.jclouds.karaf:bundles][jclouds-karaf/org.apache.jclouds.karaf:bundles][relativePath:bundles],
hudson.maven.MavenModule@2a2c430c[jclouds-karaf/org.apache.jclouds.karaf:cache][jclouds-karaf/org.apache.jclouds.karaf:cache][relativePath:cache],
hudson.maven.MavenModule@1dbd5471[jclouds-karaf/org.apache.jclouds.karaf:chef][jclouds-karaf/org.apache.jclouds.karaf:chef][relativePath:chef],
hudson.maven.MavenModule@11d3bb0a[jclouds-karaf/org.apache.jclouds.karaf:commands][jclouds-karaf/org.apache.jclouds.karaf:commands][relativePath:commands],
hudson.maven.MavenModule@19db7b0f[jclouds-karaf/org.apache.jclouds.karaf:core][jclouds-karaf/org.apache.jclouds.karaf:core][relativePath:core],
hudson.maven.MavenModule@e97facc[jclouds-karaf/org.apache.jclouds.karaf:itests][jclouds-karaf/org.apache.jclouds.karaf:itests][relativePath:itests],
hudson.maven.MavenModule@4df1fa3d[jclouds-karaf/org.apache.jclouds.karaf:jclouds-karaf][jclouds-karaf/org.apache.jclouds.karaf:jclouds-karaf][relativePath:feature],
hudson.maven.MavenModule@592086d3[jclouds-karaf/org.apache.jclouds.karaf:jclouds-karaf-labs][jclouds-karaf/org.apache.jclouds.karaf:jclouds-karaf-labs][relativePath:feature-labs],
hudson.maven.MavenModule@6ef64212[jclouds-karaf/org.apache.jclouds.karaf:recipe][jclouds-karaf/org.apache.jclouds.karaf:recipe][relativePath:recipe],
hudson.maven.MavenModule@3f39c13c[jclouds-karaf/org.apache.jclouds.karaf:services][jclouds-karaf/org.apache.jclouds.karaf:services][relativePath:services],
hudson.maven.MavenModule@55e34a3a[jclouds-karaf/org.apache.jclouds.karaf:urlhandler][jclouds-karaf/org.apache.jclouds.karaf:urlhandler][relativePath:urlhandler],
hudson.maven.MavenModule@774149ec[jclouds-karaf/org.apache.jclouds.karaf:utils][jclouds-karaf/org.apache.jclouds.karaf:utils][relativePath:utils],
hudson.maven.MavenModule@7a9472a4[jclouds-karaf/org.apache.jclouds.karaf.bundles:jsch-agentproxy-jsch][jclouds-karaf/org.apache.jclouds.karaf.bundles:jsch-agentproxy-jsch][relativePath:bundles/jsch-agentproxy-jsch],
hudson.maven.MavenModule@2a59baa8[jclouds-karaf/org.apache.jclouds.karaf.chef:cache][jclouds-karaf/org.apache.jclouds.karaf.chef:cache][relativePath:chef/cache],
hudson.maven.MavenModule@683f5c2a[jclouds-karaf/org.apache.jclouds.karaf.chef:commands][jclouds-karaf/org.apache.jclouds.karaf.chef:commands][relativePath:chef/commands],
hudson.maven.MavenModule@445d0820[jclouds-karaf/org.apache.jclouds.karaf.chef:core][jclouds-karaf/org.apache.jclouds.karaf.chef:core][relativePath:chef/core],
hudson.maven.MavenModule@3c84610f[jclouds-karaf/org.apache.jclouds.karaf.chef:services][jclouds-karaf/org.apache.jclouds.karaf.chef:services][relativePath:chef/services]]
project.getRootModule()=hudson.maven.MavenModule@454efc41[jclouds-karaf/org.apache.jclouds:jclouds-karaf][jclouds-karaf/org.apache.jclouds:jclouds-karaf][relativePath:]
FATAL: java.io.IOException: Unexpected termination of the channel
java.io.EOFException
	at java.io.ObjectInputStream$PeekInputStream.readFully(ObjectInputStream.java:2681)
	at java.io.ObjectInputStream$BlockDataInputStream.readShort(ObjectInputStream.java:3156)
	at java.io.ObjectInputStream.readStreamHeader(ObjectInputStream.java:862)
	at java.io.ObjectInputStream.<init>(ObjectInputStream.java:358)
	at hudson.remoting.ObjectInputStreamEx.<init>(ObjectInputStreamEx.java:49)
	at hudson.remoting.Command.readFrom(Command.java:140)
	at hudson.remoting.Command.readFrom(Command.java:126)
	at hudson.remoting.AbstractSynchronousByteArrayCommandTransport.read(AbstractSynchronousByteArrayCommandTransport.java:36)
	at hudson.remoting.SynchronousCommandTransport$ReaderThread.run(SynchronousCommandTransport.java:63)
Caused: java.io.IOException: Unexpected termination of the channel
	at hudson.remoting.SynchronousCommandTransport$ReaderThread.run(SynchronousCommandTransport.java:77)
Also:   hudson.remoting.Channel$CallSiteStackTrace: Remote call to H31
		at hudson.remoting.Channel.attachCallSiteStackTrace(Channel.java:1741)
		at hudson.remoting.Request.call(Request.java:202)
		at hudson.remoting.Channel.call(Channel.java:954)
		at hudson.FilePath.act(FilePath.java:1072)
		at hudson.FilePath.act(FilePath.java:1061)
		at hudson.maven.MavenModuleSetBuild$MavenModuleSetBuildExecution.parsePoms(MavenModuleSetBuild.java:986)
		at hudson.maven.MavenModuleSetBuild$MavenModuleSetBuildExecution.doRun(MavenModuleSetBuild.java:691)
		at hudson.model.AbstractBuild$AbstractBuildExecution.run(AbstractBuild.java:504)
		at hudson.model.Run.execute(Run.java:1810)
		at hudson.maven.MavenModuleSetBuild.run(MavenModuleSetBuild.java:543)
		at hudson.model.ResourceController.execute(ResourceController.java:97)
		at hudson.model.Executor.run(Executor.java:429)
Caused: hudson.remoting.RequestAbortedException
	at hudson.remoting.Request.abort(Request.java:340)
	at hudson.remoting.Channel.terminate(Channel.java:1038)
	at hudson.remoting.SynchronousCommandTransport$ReaderThread.run(SynchronousCommandTransport.java:94)
ERROR: H31 is offline; cannot locate JDK 1.8 (latest)
ERROR: H31 is offline; cannot locate Maven 3.5.4
ERROR: H31 is offline; cannot locate JDK 1.8 (latest)
ERROR: H31 is offline; cannot locate Maven 3.5.4
ERROR: H31 is offline; cannot locate JDK 1.8 (latest)
ERROR: H31 is offline; cannot locate Maven 3.5.4

Mime
View raw message