jclouds-notifications mailing list archives

Site index · List index
Message view « Date » · « Thread »
Top « Date » · « Thread »
From Apache Jenkins Server <jenk...@builds.apache.org>
Subject Build failed in Jenkins: jclouds-labs-openstack #34
Date Tue, 07 May 2019 09:44:34 GMT
See <https://builds.apache.org/job/jclouds-labs-openstack/34/display/redirect>

------------------------------------------
[...truncated 58.68 KB...]
    at java.util.concurrent.ThreadPoolExecutor.runWorker (ThreadPoolExecutor.java:1149)
    at java.util.concurrent.ThreadPoolExecutor$Worker.run (ThreadPoolExecutor.java:624)
    at java.lang.Thread.run (Thread.java:748)
Caused by: com.puppycrawl.tools.checkstyle.api.CheckstyleException: cannot initialize module
SuppressionFilter - Cannot set property 'file' in module SuppressionFilter to 'resources/checkstyle-suppressions.xml':
unable to find resources/checkstyle-suppressions.xml
    at com.puppycrawl.tools.checkstyle.Checker.setupChild (Checker.java:179)
    at com.puppycrawl.tools.checkstyle.api.AutomaticBean.configure (AutomaticBean.java:184)
    at org.apache.maven.plugin.checkstyle.exec.DefaultCheckstyleExecutor.executeCheckstyle
(DefaultCheckstyleExecutor.java:219)
    at org.apache.maven.plugin.checkstyle.CheckstyleViolationCheckMojo.execute (CheckstyleViolationCheckMojo.java:530)
    at org.apache.maven.plugin.DefaultBuildPluginManager.executeMojo (DefaultBuildPluginManager.java:137)
    at org.apache.maven.lifecycle.internal.MojoExecutor.execute (MojoExecutor.java:208)
    at org.apache.maven.lifecycle.internal.MojoExecutor.execute (MojoExecutor.java:154)
    at org.apache.maven.lifecycle.internal.MojoExecutor.execute (MojoExecutor.java:146)
    at org.apache.maven.lifecycle.internal.LifecycleModuleBuilder.buildProject (LifecycleModuleBuilder.java:117)
    at org.apache.maven.lifecycle.internal.LifecycleModuleBuilder.buildProject (LifecycleModuleBuilder.java:81)
    at org.apache.maven.lifecycle.internal.builder.singlethreaded.SingleThreadedBuilder.build
(SingleThreadedBuilder.java:56)
    at org.apache.maven.lifecycle.internal.LifecycleStarter.execute (LifecycleStarter.java:128)
    at org.apache.maven.DefaultMaven.doExecute (DefaultMaven.java:305)
    at org.apache.maven.DefaultMaven.doExecute (DefaultMaven.java:192)
    at org.apache.maven.DefaultMaven.execute (DefaultMaven.java:105)
    at org.jvnet.hudson.maven3.launcher.Maven35Launcher.main (Maven35Launcher.java:130)
    at sun.reflect.NativeMethodAccessorImpl.invoke0 (Native Method)
    at sun.reflect.NativeMethodAccessorImpl.invoke (NativeMethodAccessorImpl.java:62)
    at sun.reflect.DelegatingMethodAccessorImpl.invoke (DelegatingMethodAccessorImpl.java:43)
    at java.lang.reflect.Method.invoke (Method.java:498)
    at org.codehaus.plexus.classworlds.launcher.Launcher.launchEnhanced (Launcher.java:289)
    at org.codehaus.plexus.classworlds.launcher.Launcher.launch (Launcher.java:229)
    at jenkins.maven3.agent.Maven35Main.launch (Maven35Main.java:176)
    at sun.reflect.NativeMethodAccessorImpl.invoke0 (Native Method)
    at sun.reflect.NativeMethodAccessorImpl.invoke (NativeMethodAccessorImpl.java:62)
    at sun.reflect.DelegatingMethodAccessorImpl.invoke (DelegatingMethodAccessorImpl.java:43)
    at java.lang.reflect.Method.invoke (Method.java:498)
    at hudson.maven.Maven3Builder.call (Maven3Builder.java:139)
    at hudson.maven.Maven3Builder.call (Maven3Builder.java:70)
    at hudson.remoting.UserRequest.perform (UserRequest.java:212)
    at hudson.remoting.UserRequest.perform (UserRequest.java:54)
    at hudson.remoting.Request$2.run (Request.java:369)
    at hudson.remoting.InterceptingExecutorService$1.call (InterceptingExecutorService.java:72)
    at java.util.concurrent.FutureTask.run (FutureTask.java:266)
    at java.util.concurrent.ThreadPoolExecutor.runWorker (ThreadPoolExecutor.java:1149)
    at java.util.concurrent.ThreadPoolExecutor$Worker.run (ThreadPoolExecutor.java:624)
    at java.lang.Thread.run (Thread.java:748)
Caused by: com.puppycrawl.tools.checkstyle.api.CheckstyleException: Cannot set property 'file'
in module SuppressionFilter to 'resources/checkstyle-suppressions.xml': unable to find resources/checkstyle-suppressions.xml
    at com.puppycrawl.tools.checkstyle.api.AutomaticBean.configure (AutomaticBean.java:152)
    at com.puppycrawl.tools.checkstyle.Checker.setupChild (Checker.java:158)
    at com.puppycrawl.tools.checkstyle.api.AutomaticBean.configure (AutomaticBean.java:184)
    at org.apache.maven.plugin.checkstyle.exec.DefaultCheckstyleExecutor.executeCheckstyle
(DefaultCheckstyleExecutor.java:219)
    at org.apache.maven.plugin.checkstyle.CheckstyleViolationCheckMojo.execute (CheckstyleViolationCheckMojo.java:530)
    at org.apache.maven.plugin.DefaultBuildPluginManager.executeMojo (DefaultBuildPluginManager.java:137)
    at org.apache.maven.lifecycle.internal.MojoExecutor.execute (MojoExecutor.java:208)
    at org.apache.maven.lifecycle.internal.MojoExecutor.execute (MojoExecutor.java:154)
    at org.apache.maven.lifecycle.internal.MojoExecutor.execute (MojoExecutor.java:146)
    at org.apache.maven.lifecycle.internal.LifecycleModuleBuilder.buildProject (LifecycleModuleBuilder.java:117)
    at org.apache.maven.lifecycle.internal.LifecycleModuleBuilder.buildProject (LifecycleModuleBuilder.java:81)
    at org.apache.maven.lifecycle.internal.builder.singlethreaded.SingleThreadedBuilder.build
(SingleThreadedBuilder.java:56)
    at org.apache.maven.lifecycle.internal.LifecycleStarter.execute (LifecycleStarter.java:128)
    at org.apache.maven.DefaultMaven.doExecute (DefaultMaven.java:305)
    at org.apache.maven.DefaultMaven.doExecute (DefaultMaven.java:192)
    at org.apache.maven.DefaultMaven.execute (DefaultMaven.java:105)
    at org.jvnet.hudson.maven3.launcher.Maven35Launcher.main (Maven35Launcher.java:130)
    at sun.reflect.NativeMethodAccessorImpl.invoke0 (Native Method)
    at sun.reflect.NativeMethodAccessorImpl.invoke (NativeMethodAccessorImpl.java:62)
    at sun.reflect.DelegatingMethodAccessorImpl.invoke (DelegatingMethodAccessorImpl.java:43)
    at java.lang.reflect.Method.invoke (Method.java:498)
    at org.codehaus.plexus.classworlds.launcher.Launcher.launchEnhanced (Launcher.java:289)
    at org.codehaus.plexus.classworlds.launcher.Launcher.launch (Launcher.java:229)
    at jenkins.maven3.agent.Maven35Main.launch (Maven35Main.java:176)
    at sun.reflect.NativeMethodAccessorImpl.invoke0 (Native Method)
    at sun.reflect.NativeMethodAccessorImpl.invoke (NativeMethodAccessorImpl.java:62)
    at sun.reflect.DelegatingMethodAccessorImpl.invoke (DelegatingMethodAccessorImpl.java:43)
    at java.lang.reflect.Method.invoke (Method.java:498)
    at hudson.maven.Maven3Builder.call (Maven3Builder.java:139)
    at hudson.maven.Maven3Builder.call (Maven3Builder.java:70)
    at hudson.remoting.UserRequest.perform (UserRequest.java:212)
    at hudson.remoting.UserRequest.perform (UserRequest.java:54)
    at hudson.remoting.Request$2.run (Request.java:369)
    at hudson.remoting.InterceptingExecutorService$1.call (InterceptingExecutorService.java:72)
    at java.util.concurrent.FutureTask.run (FutureTask.java:266)
    at java.util.concurrent.ThreadPoolExecutor.runWorker (ThreadPoolExecutor.java:1149)
    at java.util.concurrent.ThreadPoolExecutor$Worker.run (ThreadPoolExecutor.java:624)
    at java.lang.Thread.run (Thread.java:748)
Caused by: java.lang.reflect.InvocationTargetException
    at sun.reflect.NativeMethodAccessorImpl.invoke0 (Native Method)
    at sun.reflect.NativeMethodAccessorImpl.invoke (NativeMethodAccessorImpl.java:62)
    at sun.reflect.DelegatingMethodAccessorImpl.invoke (DelegatingMethodAccessorImpl.java:43)
    at java.lang.reflect.Method.invoke (Method.java:498)
    at org.apache.commons.beanutils.PropertyUtilsBean.invokeMethod (PropertyUtilsBean.java:1773)
    at org.apache.commons.beanutils.PropertyUtilsBean.setSimpleProperty (PropertyUtilsBean.java:1759)
    at org.apache.commons.beanutils.BeanUtilsBean.copyProperty (BeanUtilsBean.java:447)
    at com.puppycrawl.tools.checkstyle.api.AutomaticBean.configure (AutomaticBean.java:149)
    at com.puppycrawl.tools.checkstyle.Checker.setupChild (Checker.java:158)
    at com.puppycrawl.tools.checkstyle.api.AutomaticBean.configure (AutomaticBean.java:184)
    at org.apache.maven.plugin.checkstyle.exec.DefaultCheckstyleExecutor.executeCheckstyle
(DefaultCheckstyleExecutor.java:219)
    at org.apache.maven.plugin.checkstyle.CheckstyleViolationCheckMojo.execute (CheckstyleViolationCheckMojo.java:530)
    at org.apache.maven.plugin.DefaultBuildPluginManager.executeMojo (DefaultBuildPluginManager.java:137)
    at org.apache.maven.lifecycle.internal.MojoExecutor.execute (MojoExecutor.java:208)
    at org.apache.maven.lifecycle.internal.MojoExecutor.execute (MojoExecutor.java:154)
    at org.apache.maven.lifecycle.internal.MojoExecutor.execute (MojoExecutor.java:146)
    at org.apache.maven.lifecycle.internal.LifecycleModuleBuilder.buildProject (LifecycleModuleBuilder.java:117)
    at org.apache.maven.lifecycle.internal.LifecycleModuleBuilder.buildProject (LifecycleModuleBuilder.java:81)
    at org.apache.maven.lifecycle.internal.builder.singlethreaded.SingleThreadedBuilder.build
(SingleThreadedBuilder.java:56)
    at org.apache.maven.lifecycle.internal.LifecycleStarter.execute (LifecycleStarter.java:128)
    at org.apache.maven.DefaultMaven.doExecute (DefaultMaven.java:305)
    at org.apache.maven.DefaultMaven.doExecute (DefaultMaven.java:192)
    at org.apache.maven.DefaultMaven.execute (DefaultMaven.java:105)
    at org.jvnet.hudson.maven3.launcher.Maven35Launcher.main (Maven35Launcher.java:130)
    at sun.reflect.NativeMethodAccessorImpl.invoke0 (Native Method)
    at sun.reflect.NativeMethodAccessorImpl.invoke (NativeMethodAccessorImpl.java:62)
    at sun.reflect.DelegatingMethodAccessorImpl.invoke (DelegatingMethodAccessorImpl.java:43)
    at java.lang.reflect.Method.invoke (Method.java:498)
    at org.codehaus.plexus.classworlds.launcher.Launcher.launchEnhanced (Launcher.java:289)
    at org.codehaus.plexus.classworlds.launcher.Launcher.launch (Launcher.java:229)
    at jenkins.maven3.agent.Maven35Main.launch (Maven35Main.java:176)
    at sun.reflect.NativeMethodAccessorImpl.invoke0 (Native Method)
    at sun.reflect.NativeMethodAccessorImpl.invoke (NativeMethodAccessorImpl.java:62)
    at sun.reflect.DelegatingMethodAccessorImpl.invoke (DelegatingMethodAccessorImpl.java:43)
    at java.lang.reflect.Method.invoke (Method.java:498)
    at hudson.maven.Maven3Builder.call (Maven3Builder.java:139)
    at hudson.maven.Maven3Builder.call (Maven3Builder.java:70)
    at hudson.remoting.UserRequest.perform (UserRequest.java:212)
    at hudson.remoting.UserRequest.perform (UserRequest.java:54)
    at hudson.remoting.Request$2.run (Request.java:369)
    at hudson.remoting.InterceptingExecutorService$1.call (InterceptingExecutorService.java:72)
    at java.util.concurrent.FutureTask.run (FutureTask.java:266)
    at java.util.concurrent.ThreadPoolExecutor.runWorker (ThreadPoolExecutor.java:1149)
    at java.util.concurrent.ThreadPoolExecutor$Worker.run (ThreadPoolExecutor.java:624)
    at java.lang.Thread.run (Thread.java:748)
Caused by: com.puppycrawl.tools.checkstyle.api.CheckstyleException: unable to find resources/checkstyle-suppressions.xml
    at com.puppycrawl.tools.checkstyle.filters.SuppressionsLoader.loadSuppressions (SuppressionsLoader.java:178)
    at com.puppycrawl.tools.checkstyle.filters.SuppressionFilter.setFile (SuppressionFilter.java:49)
    at sun.reflect.NativeMethodAccessorImpl.invoke0 (Native Method)
    at sun.reflect.NativeMethodAccessorImpl.invoke (NativeMethodAccessorImpl.java:62)
    at sun.reflect.DelegatingMethodAccessorImpl.invoke (DelegatingMethodAccessorImpl.java:43)
    at java.lang.reflect.Method.invoke (Method.java:498)
    at org.apache.commons.beanutils.PropertyUtilsBean.invokeMethod (PropertyUtilsBean.java:1773)
    at org.apache.commons.beanutils.PropertyUtilsBean.setSimpleProperty (PropertyUtilsBean.java:1759)
    at org.apache.commons.beanutils.BeanUtilsBean.copyProperty (BeanUtilsBean.java:447)
    at com.puppycrawl.tools.checkstyle.api.AutomaticBean.configure (AutomaticBean.java:149)
    at com.puppycrawl.tools.checkstyle.Checker.setupChild (Checker.java:158)
    at com.puppycrawl.tools.checkstyle.api.AutomaticBean.configure (AutomaticBean.java:184)
    at org.apache.maven.plugin.checkstyle.exec.DefaultCheckstyleExecutor.executeCheckstyle
(DefaultCheckstyleExecutor.java:219)
    at org.apache.maven.plugin.checkstyle.CheckstyleViolationCheckMojo.execute (CheckstyleViolationCheckMojo.java:530)
    at org.apache.maven.plugin.DefaultBuildPluginManager.executeMojo (DefaultBuildPluginManager.java:137)
    at org.apache.maven.lifecycle.internal.MojoExecutor.execute (MojoExecutor.java:208)
    at org.apache.maven.lifecycle.internal.MojoExecutor.execute (MojoExecutor.java:154)
    at org.apache.maven.lifecycle.internal.MojoExecutor.execute (MojoExecutor.java:146)
    at org.apache.maven.lifecycle.internal.LifecycleModuleBuilder.buildProject (LifecycleModuleBuilder.java:117)
    at org.apache.maven.lifecycle.internal.LifecycleModuleBuilder.buildProject (LifecycleModuleBuilder.java:81)
    at org.apache.maven.lifecycle.internal.builder.singlethreaded.SingleThreadedBuilder.build
(SingleThreadedBuilder.java:56)
    at org.apache.maven.lifecycle.internal.LifecycleStarter.execute (LifecycleStarter.java:128)
    at org.apache.maven.DefaultMaven.doExecute (DefaultMaven.java:305)
    at org.apache.maven.DefaultMaven.doExecute (DefaultMaven.java:192)
    at org.apache.maven.DefaultMaven.execute (DefaultMaven.java:105)
    at org.jvnet.hudson.maven3.launcher.Maven35Launcher.main (Maven35Launcher.java:130)
    at sun.reflect.NativeMethodAccessorImpl.invoke0 (Native Method)
    at sun.reflect.NativeMethodAccessorImpl.invoke (NativeMethodAccessorImpl.java:62)
    at sun.reflect.DelegatingMethodAccessorImpl.invoke (DelegatingMethodAccessorImpl.java:43)
    at java.lang.reflect.Method.invoke (Method.java:498)
    at org.codehaus.plexus.classworlds.launcher.Launcher.launchEnhanced (Launcher.java:289)
    at org.codehaus.plexus.classworlds.launcher.Launcher.launch (Launcher.java:229)
    at jenkins.maven3.agent.Maven35Main.launch (Maven35Main.java:176)
    at sun.reflect.NativeMethodAccessorImpl.invoke0 (Native Method)
    at sun.reflect.NativeMethodAccessorImpl.invoke (NativeMethodAccessorImpl.java:62)
    at sun.reflect.DelegatingMethodAccessorImpl.invoke (DelegatingMethodAccessorImpl.java:43)
    at java.lang.reflect.Method.invoke (Method.java:498)
    at hudson.maven.Maven3Builder.call (Maven3Builder.java:139)
    at hudson.maven.Maven3Builder.call (Maven3Builder.java:70)
    at hudson.remoting.UserRequest.perform (UserRequest.java:212)
    at hudson.remoting.UserRequest.perform (UserRequest.java:54)
    at hudson.remoting.Request$2.run (Request.java:369)
    at hudson.remoting.InterceptingExecutorService$1.call (InterceptingExecutorService.java:72)
    at java.util.concurrent.FutureTask.run (FutureTask.java:266)
    at java.util.concurrent.ThreadPoolExecutor.runWorker (ThreadPoolExecutor.java:1149)
    at java.util.concurrent.ThreadPoolExecutor$Worker.run (ThreadPoolExecutor.java:624)
    at java.lang.Thread.run (Thread.java:748)
Caused by: java.io.FileNotFoundException: resources/checkstyle-suppressions.xml
    at com.puppycrawl.tools.checkstyle.filters.SuppressionsLoader.loadSuppressions (SuppressionsLoader.java:165)
    at com.puppycrawl.tools.checkstyle.filters.SuppressionFilter.setFile (SuppressionFilter.java:49)
    at sun.reflect.NativeMethodAccessorImpl.invoke0 (Native Method)
    at sun.reflect.NativeMethodAccessorImpl.invoke (NativeMethodAccessorImpl.java:62)
    at sun.reflect.DelegatingMethodAccessorImpl.invoke (DelegatingMethodAccessorImpl.java:43)
    at java.lang.reflect.Method.invoke (Method.java:498)
    at org.apache.commons.beanutils.PropertyUtilsBean.invokeMethod (PropertyUtilsBean.java:1773)
    at org.apache.commons.beanutils.PropertyUtilsBean.setSimpleProperty (PropertyUtilsBean.java:1759)
    at org.apache.commons.beanutils.BeanUtilsBean.copyProperty (BeanUtilsBean.java:447)
    at com.puppycrawl.tools.checkstyle.api.AutomaticBean.configure (AutomaticBean.java:149)
    at com.puppycrawl.tools.checkstyle.Checker.setupChild (Checker.java:158)
    at com.puppycrawl.tools.checkstyle.api.AutomaticBean.configure (AutomaticBean.java:184)
    at org.apache.maven.plugin.checkstyle.exec.DefaultCheckstyleExecutor.executeCheckstyle
(DefaultCheckstyleExecutor.java:219)
    at org.apache.maven.plugin.checkstyle.CheckstyleViolationCheckMojo.execute (CheckstyleViolationCheckMojo.java:530)
    at org.apache.maven.plugin.DefaultBuildPluginManager.executeMojo (DefaultBuildPluginManager.java:137)
    at org.apache.maven.lifecycle.internal.MojoExecutor.execute (MojoExecutor.java:208)
    at org.apache.maven.lifecycle.internal.MojoExecutor.execute (MojoExecutor.java:154)
    at org.apache.maven.lifecycle.internal.MojoExecutor.execute (MojoExecutor.java:146)
    at org.apache.maven.lifecycle.internal.LifecycleModuleBuilder.buildProject (LifecycleModuleBuilder.java:117)
    at org.apache.maven.lifecycle.internal.LifecycleModuleBuilder.buildProject (LifecycleModuleBuilder.java:81)
    at org.apache.maven.lifecycle.internal.builder.singlethreaded.SingleThreadedBuilder.build
(SingleThreadedBuilder.java:56)
    at org.apache.maven.lifecycle.internal.LifecycleStarter.execute (LifecycleStarter.java:128)
    at org.apache.maven.DefaultMaven.doExecute (DefaultMaven.java:305)
    at org.apache.maven.DefaultMaven.doExecute (DefaultMaven.java:192)
    at org.apache.maven.DefaultMaven.execute (DefaultMaven.java:105)
    at org.jvnet.hudson.maven3.launcher.Maven35Launcher.main (Maven35Launcher.java:130)
    at sun.reflect.NativeMethodAccessorImpl.invoke0 (Native Method)
    at sun.reflect.NativeMethodAccessorImpl.invoke (NativeMethodAccessorImpl.java:62)
    at sun.reflect.DelegatingMethodAccessorImpl.invoke (DelegatingMethodAccessorImpl.java:43)
    at java.lang.reflect.Method.invoke (Method.java:498)
    at org.codehaus.plexus.classworlds.launcher.Launcher.launchEnhanced (Launcher.java:289)
    at org.codehaus.plexus.classworlds.launcher.Launcher.launch (Launcher.java:229)
    at jenkins.maven3.agent.Maven35Main.launch (Maven35Main.java:176)
    at sun.reflect.NativeMethodAccessorImpl.invoke0 (Native Method)
    at sun.reflect.NativeMethodAccessorImpl.invoke (NativeMethodAccessorImpl.java:62)
    at sun.reflect.DelegatingMethodAccessorImpl.invoke (DelegatingMethodAccessorImpl.java:43)
    at java.lang.reflect.Method.invoke (Method.java:498)
    at hudson.maven.Maven3Builder.call (Maven3Builder.java:139)
    at hudson.maven.Maven3Builder.call (Maven3Builder.java:70)
    at hudson.remoting.UserRequest.perform (UserRequest.java:212)
    at hudson.remoting.UserRequest.perform (UserRequest.java:54)
    at hudson.remoting.Request$2.run (Request.java:369)
    at hudson.remoting.InterceptingExecutorService$1.call (InterceptingExecutorService.java:72)
    at java.util.concurrent.FutureTask.run (FutureTask.java:266)
    at java.util.concurrent.ThreadPoolExecutor.runWorker (ThreadPoolExecutor.java:1149)
    at java.util.concurrent.ThreadPoolExecutor$Worker.run (ThreadPoolExecutor.java:624)
    at java.lang.Thread.run (Thread.java:748)
[ERROR] 
[ERROR] Re-run Maven using the -X switch to enable full debug logging.
[ERROR] 
[ERROR] For more information about the errors and possible solutions, please read the following
articles:
[ERROR] [Help 1] http://cwiki.apache.org/confluence/display/MAVEN/MojoExecutionException
[JENKINS] Archiving <https://builds.apache.org/job/jclouds-labs-openstack/ws/rackspace-autoscale-us/pom.xml>
to org.apache.jclouds.labs/rackspace-autoscale-us/2.2.0-SNAPSHOT/rackspace-autoscale-us-2.2.0-SNAPSHOT.pom
[JENKINS] Archiving <https://builds.apache.org/job/jclouds-labs-openstack/ws/rackspace-autoscale/pom.xml>
to org.apache.jclouds.labs/rackspace-autoscale/2.2.0-SNAPSHOT/rackspace-autoscale-2.2.0-SNAPSHOT.pom
[JENKINS] Archiving <https://builds.apache.org/job/jclouds-labs-openstack/ws/rackspace-cdn-uk/pom.xml>
to org.apache.jclouds.labs/rackspace-cdn-uk/2.2.0-SNAPSHOT/rackspace-cdn-uk-2.2.0-SNAPSHOT.pom
[JENKINS] Archiving <https://builds.apache.org/job/jclouds-labs-openstack/ws/rackspace-cloudbigdata-us/pom.xml>
to org.apache.jclouds.labs/rackspace-cloudbigdata-us/2.2.0-SNAPSHOT/rackspace-cloudbigdata-us-2.2.0-SNAPSHOT.pom
[JENKINS] Archiving <https://builds.apache.org/job/jclouds-labs-openstack/ws/rackspace-autoscale-uk/pom.xml>
to org.apache.jclouds.labs/rackspace-autoscale-uk/2.2.0-SNAPSHOT/rackspace-autoscale-uk-2.2.0-SNAPSHOT.pom
[JENKINS] Archiving <https://builds.apache.org/job/jclouds-labs-openstack/ws/rackspace-cloudqueues-us/pom.xml>
to org.apache.jclouds.labs/rackspace-cloudqueues-us/2.2.0-SNAPSHOT/rackspace-cloudqueues-us-2.2.0-SNAPSHOT.pom
[JENKINS] Archiving <https://builds.apache.org/job/jclouds-labs-openstack/ws/rackspace-cloudbigdata/pom.xml>
to org.apache.jclouds.labs/rackspace-cloudbigdata/2.2.0-SNAPSHOT/rackspace-cloudbigdata-2.2.0-SNAPSHOT.pom
[JENKINS] Archiving <https://builds.apache.org/job/jclouds-labs-openstack/ws/rackspace-orchestration-us/pom.xml>
to org.apache.jclouds.labs/rackspace-orchestration-us/2.2.0-SNAPSHOT/rackspace-orchestration-us-2.2.0-SNAPSHOT.pom
[JENKINS] Archiving <https://builds.apache.org/job/jclouds-labs-openstack/ws/rackspace-cdn-us/pom.xml>
to org.apache.jclouds.labs/rackspace-cdn-us/2.2.0-SNAPSHOT/rackspace-cdn-us-2.2.0-SNAPSHOT.pom
[JENKINS] Archiving <https://builds.apache.org/job/jclouds-labs-openstack/ws/openstack-heat/pom.xml>
to org.apache.jclouds.labs/openstack-heat/2.2.0-SNAPSHOT/openstack-heat-2.2.0-SNAPSHOT.pom
[JENKINS] Archiving <https://builds.apache.org/job/jclouds-labs-openstack/ws/openstack-poppy/pom.xml>
to org.apache.jclouds.labs/openstack-poppy/2.2.0-SNAPSHOT/openstack-poppy-2.2.0-SNAPSHOT.pom
[JENKINS] Archiving <https://builds.apache.org/job/jclouds-labs-openstack/ws/rackspace-cloudqueues-uk/pom.xml>
to org.apache.jclouds.labs/rackspace-cloudqueues-uk/2.2.0-SNAPSHOT/rackspace-cloudqueues-uk-2.2.0-SNAPSHOT.pom
[JENKINS] Archiving <https://builds.apache.org/job/jclouds-labs-openstack/ws/rackspace-orchestration-uk/pom.xml>
to org.apache.jclouds.labs/rackspace-orchestration-uk/2.2.0-SNAPSHOT/rackspace-orchestration-uk-2.2.0-SNAPSHOT.pom
[JENKINS] Archiving <https://builds.apache.org/job/jclouds-labs-openstack/ws/pom.xml>
to org.apache.jclouds.labs/jclouds-labs-openstack/2.2.0-SNAPSHOT/jclouds-labs-openstack-2.2.0-SNAPSHOT.pom
[JENKINS] Archiving <https://builds.apache.org/job/jclouds-labs-openstack/ws/openstack-marconi/pom.xml>
to org.apache.jclouds.labs/openstack-marconi/2.2.0-SNAPSHOT/openstack-marconi-2.2.0-SNAPSHOT.pom
[JENKINS] Archiving <https://builds.apache.org/job/jclouds-labs-openstack/ws/openstack-glance/pom.xml>
to org.apache.jclouds.labs/openstack-glance/2.2.0-SNAPSHOT/openstack-glance-2.2.0-SNAPSHOT.pom
[JENKINS] Archiving <https://builds.apache.org/job/jclouds-labs-openstack/ws/openstack-glance/target/openstack-glance-2.2.0-SNAPSHOT.jar>
to org.apache.jclouds.labs/openstack-glance/2.2.0-SNAPSHOT/openstack-glance-2.2.0-SNAPSHOT.jar
[JENKINS] Archiving <https://builds.apache.org/job/jclouds-labs-openstack/ws/openstack-glance/target/openstack-glance-2.2.0-SNAPSHOT-tests.jar>
to org.apache.jclouds.labs/openstack-glance/2.2.0-SNAPSHOT/openstack-glance-2.2.0-SNAPSHOT-tests.jar
[JENKINS] Archiving <https://builds.apache.org/job/jclouds-labs-openstack/ws/openstack-glance/target/openstack-glance-2.2.0-SNAPSHOT-javadoc.jar>
to org.apache.jclouds.labs/openstack-glance/2.2.0-SNAPSHOT/openstack-glance-2.2.0-SNAPSHOT-javadoc.jar
[JENKINS] Archiving <https://builds.apache.org/job/jclouds-labs-openstack/ws/openstack-glance/target/openstack-glance-2.2.0-SNAPSHOT-sources.jar>
to org.apache.jclouds.labs/openstack-glance/2.2.0-SNAPSHOT/openstack-glance-2.2.0-SNAPSHOT-sources.jar
[JENKINS] Archiving <https://builds.apache.org/job/jclouds-labs-openstack/ws/openstack-glance/target/openstack-glance-2.2.0-SNAPSHOT-test-sources.jar>
to org.apache.jclouds.labs/openstack-glance/2.2.0-SNAPSHOT/openstack-glance-2.2.0-SNAPSHOT-test-sources.jar
channel stopped

Mime
View raw message