jclouds-notifications mailing list archives

Site index · List index
Message view « Date » · « Thread »
Top « Date » · « Thread »
From Apache Jenkins Server <jenk...@builds.apache.org>
Subject Build failed in Jenkins: jclouds-with-credentials » jclouds-packet-live-tests #66
Date Tue, 04 Feb 2020 08:21:30 GMT
See <https://builds.apache.org/job/jclouds-with-credentials/job/jclouds-packet-live-tests/66/display/redirect>

Changes:


------------------------------------------
[...truncated 50.38 KB...]
[WARNING] 
[WARNING] Some problems were encountered while building the effective model for org.apache.jclouds.provider:dynect:bundle:2.3.0-SNAPSHOT
[WARNING] 'reporting.plugins.plugin.version' for org.apache.maven.plugins:maven-checkstyle-plugin
is missing. @ org.apache.jclouds:jclouds-project:2.3.0-SNAPSHOT, <https://builds.apache.org/job/jclouds-with-credentials/job/jclouds-packet-live-tests/ws/project/pom.xml,>
line 1194, column 15
[WARNING] 
[WARNING] Some problems were encountered while building the effective model for org.apache.jclouds.provider:elastichosts-ams-e:bundle:2.3.0-SNAPSHOT
[WARNING] 'reporting.plugins.plugin.version' for org.apache.maven.plugins:maven-checkstyle-plugin
is missing. @ org.apache.jclouds:jclouds-project:2.3.0-SNAPSHOT, <https://builds.apache.org/job/jclouds-with-credentials/job/jclouds-packet-live-tests/ws/project/pom.xml,>
line 1194, column 15
[WARNING] 
[WARNING] Some problems were encountered while building the effective model for org.apache.jclouds.provider:elastichosts-dal-a:bundle:2.3.0-SNAPSHOT
[WARNING] 'reporting.plugins.plugin.version' for org.apache.maven.plugins:maven-checkstyle-plugin
is missing. @ org.apache.jclouds:jclouds-project:2.3.0-SNAPSHOT, <https://builds.apache.org/job/jclouds-with-credentials/job/jclouds-packet-live-tests/ws/project/pom.xml,>
line 1194, column 15
[WARNING] 
[WARNING] Some problems were encountered while building the effective model for org.apache.jclouds.provider:elastichosts-hkg-e:bundle:2.3.0-SNAPSHOT
[WARNING] 'reporting.plugins.plugin.version' for org.apache.maven.plugins:maven-checkstyle-plugin
is missing. @ org.apache.jclouds:jclouds-project:2.3.0-SNAPSHOT, <https://builds.apache.org/job/jclouds-with-credentials/job/jclouds-packet-live-tests/ws/project/pom.xml,>
line 1194, column 15
[WARNING] 
[WARNING] Some problems were encountered while building the effective model for org.apache.jclouds.provider:elastichosts-lax-p:bundle:2.3.0-SNAPSHOT
[WARNING] 'reporting.plugins.plugin.version' for org.apache.maven.plugins:maven-checkstyle-plugin
is missing. @ org.apache.jclouds:jclouds-project:2.3.0-SNAPSHOT, <https://builds.apache.org/job/jclouds-with-credentials/job/jclouds-packet-live-tests/ws/project/pom.xml,>
line 1194, column 15
[WARNING] 
[WARNING] Some problems were encountered while building the effective model for org.apache.jclouds.provider:elastichosts-lon-b:bundle:2.3.0-SNAPSHOT
[WARNING] 'reporting.plugins.plugin.version' for org.apache.maven.plugins:maven-checkstyle-plugin
is missing. @ org.apache.jclouds:jclouds-project:2.3.0-SNAPSHOT, <https://builds.apache.org/job/jclouds-with-credentials/job/jclouds-packet-live-tests/ws/project/pom.xml,>
line 1194, column 15
[WARNING] 
[WARNING] Some problems were encountered while building the effective model for org.apache.jclouds.provider:elastichosts-lon-p:bundle:2.3.0-SNAPSHOT
[WARNING] 'reporting.plugins.plugin.version' for org.apache.maven.plugins:maven-checkstyle-plugin
is missing. @ org.apache.jclouds:jclouds-project:2.3.0-SNAPSHOT, <https://builds.apache.org/job/jclouds-with-credentials/job/jclouds-packet-live-tests/ws/project/pom.xml,>
line 1194, column 15
[WARNING] 
[WARNING] Some problems were encountered while building the effective model for org.apache.jclouds.provider:elastichosts-mmi-a:bundle:2.3.0-SNAPSHOT
[WARNING] 'reporting.plugins.plugin.version' for org.apache.maven.plugins:maven-checkstyle-plugin
is missing. @ org.apache.jclouds:jclouds-project:2.3.0-SNAPSHOT, <https://builds.apache.org/job/jclouds-with-credentials/job/jclouds-packet-live-tests/ws/project/pom.xml,>
line 1194, column 15
[WARNING] 
[WARNING] Some problems were encountered while building the effective model for org.apache.jclouds.provider:elastichosts-sat-p:bundle:2.3.0-SNAPSHOT
[WARNING] 'reporting.plugins.plugin.version' for org.apache.maven.plugins:maven-checkstyle-plugin
is missing. @ org.apache.jclouds:jclouds-project:2.3.0-SNAPSHOT, <https://builds.apache.org/job/jclouds-with-credentials/job/jclouds-packet-live-tests/ws/project/pom.xml,>
line 1194, column 15
[WARNING] 
[WARNING] Some problems were encountered while building the effective model for org.apache.jclouds.provider:elastichosts-sjc-c:bundle:2.3.0-SNAPSHOT
[WARNING] 'reporting.plugins.plugin.version' for org.apache.maven.plugins:maven-checkstyle-plugin
is missing. @ org.apache.jclouds:jclouds-project:2.3.0-SNAPSHOT, <https://builds.apache.org/job/jclouds-with-credentials/job/jclouds-packet-live-tests/ws/project/pom.xml,>
line 1194, column 15
[WARNING] 
[WARNING] Some problems were encountered while building the effective model for org.apache.jclouds.provider:elastichosts-syd-v:bundle:2.3.0-SNAPSHOT
[WARNING] 'reporting.plugins.plugin.version' for org.apache.maven.plugins:maven-checkstyle-plugin
is missing. @ org.apache.jclouds:jclouds-project:2.3.0-SNAPSHOT, <https://builds.apache.org/job/jclouds-with-credentials/job/jclouds-packet-live-tests/ws/project/pom.xml,>
line 1194, column 15
[WARNING] 
[WARNING] Some problems were encountered while building the effective model for org.apache.jclouds.provider:elastichosts-tor-p:bundle:2.3.0-SNAPSHOT
[WARNING] 'reporting.plugins.plugin.version' for org.apache.maven.plugins:maven-checkstyle-plugin
is missing. @ org.apache.jclouds:jclouds-project:2.3.0-SNAPSHOT, <https://builds.apache.org/job/jclouds-with-credentials/job/jclouds-packet-live-tests/ws/project/pom.xml,>
line 1194, column 15
[WARNING] 
[WARNING] Some problems were encountered while building the effective model for org.apache.jclouds.provider:glesys:bundle:2.3.0-SNAPSHOT
[WARNING] 'reporting.plugins.plugin.version' for org.apache.maven.plugins:maven-checkstyle-plugin
is missing. @ org.apache.jclouds:jclouds-project:2.3.0-SNAPSHOT, <https://builds.apache.org/job/jclouds-with-credentials/job/jclouds-packet-live-tests/ws/project/pom.xml,>
line 1194, column 15
[WARNING] 
[WARNING] Some problems were encountered while building the effective model for org.apache.jclouds.provider:go2cloud-jhb1:bundle:2.3.0-SNAPSHOT
[WARNING] 'reporting.plugins.plugin.version' for org.apache.maven.plugins:maven-checkstyle-plugin
is missing. @ org.apache.jclouds:jclouds-project:2.3.0-SNAPSHOT, <https://builds.apache.org/job/jclouds-with-credentials/job/jclouds-packet-live-tests/ws/project/pom.xml,>
line 1194, column 15
[WARNING] 
[WARNING] Some problems were encountered while building the effective model for org.apache.jclouds.provider:gogrid:bundle:2.3.0-SNAPSHOT
[WARNING] 'reporting.plugins.plugin.version' for org.apache.maven.plugins:maven-checkstyle-plugin
is missing. @ org.apache.jclouds:jclouds-project:2.3.0-SNAPSHOT, <https://builds.apache.org/job/jclouds-with-credentials/job/jclouds-packet-live-tests/ws/project/pom.xml,>
line 1194, column 15
[WARNING] 
[WARNING] Some problems were encountered while building the effective model for org.apache.jclouds.provider:google-cloud-storage:bundle:2.3.0-SNAPSHOT
[WARNING] 'reporting.plugins.plugin.version' for org.apache.maven.plugins:maven-checkstyle-plugin
is missing. @ org.apache.jclouds:jclouds-project:2.3.0-SNAPSHOT, <https://builds.apache.org/job/jclouds-with-credentials/job/jclouds-packet-live-tests/ws/project/pom.xml,>
line 1194, column 15
[WARNING] 
[WARNING] Some problems were encountered while building the effective model for org.apache.jclouds.provider:google-compute-engine:bundle:2.3.0-SNAPSHOT
[WARNING] 'reporting.plugins.plugin.version' for org.apache.maven.plugins:maven-checkstyle-plugin
is missing. @ org.apache.jclouds:jclouds-project:2.3.0-SNAPSHOT, <https://builds.apache.org/job/jclouds-with-credentials/job/jclouds-packet-live-tests/ws/project/pom.xml,>
line 1194, column 15
[WARNING] 
[WARNING] Some problems were encountered while building the effective model for org.apache.jclouds.provider:openhosting-east1:bundle:2.3.0-SNAPSHOT
[WARNING] 'reporting.plugins.plugin.version' for org.apache.maven.plugins:maven-checkstyle-plugin
is missing. @ org.apache.jclouds:jclouds-project:2.3.0-SNAPSHOT, <https://builds.apache.org/job/jclouds-with-credentials/job/jclouds-packet-live-tests/ws/project/pom.xml,>
line 1194, column 15
[WARNING] 
[WARNING] Some problems were encountered while building the effective model for org.apache.jclouds.provider:packet:bundle:2.3.0-SNAPSHOT
[WARNING] 'reporting.plugins.plugin.version' for org.apache.maven.plugins:maven-checkstyle-plugin
is missing. @ org.apache.jclouds:jclouds-project:2.3.0-SNAPSHOT, <https://builds.apache.org/job/jclouds-with-credentials/job/jclouds-packet-live-tests/ws/project/pom.xml,>
line 1194, column 15
[WARNING] 
[WARNING] Some problems were encountered while building the effective model for org.apache.jclouds.provider:profitbricks:bundle:2.3.0-SNAPSHOT
[WARNING] 'reporting.plugins.plugin.version' for org.apache.maven.plugins:maven-checkstyle-plugin
is missing. @ org.apache.jclouds:jclouds-project:2.3.0-SNAPSHOT, <https://builds.apache.org/job/jclouds-with-credentials/job/jclouds-packet-live-tests/ws/project/pom.xml,>
line 1194, column 15
[WARNING] 
[WARNING] Some problems were encountered while building the effective model for org.apache.jclouds.provider:rackspace-cloudblockstorage-uk:bundle:2.3.0-SNAPSHOT
[WARNING] 'reporting.plugins.plugin.version' for org.apache.maven.plugins:maven-checkstyle-plugin
is missing. @ org.apache.jclouds:jclouds-project:2.3.0-SNAPSHOT, <https://builds.apache.org/job/jclouds-with-credentials/job/jclouds-packet-live-tests/ws/project/pom.xml,>
line 1194, column 15
[WARNING] 
[WARNING] Some problems were encountered while building the effective model for org.apache.jclouds.provider:rackspace-cloudblockstorage-us:bundle:2.3.0-SNAPSHOT
[WARNING] 'reporting.plugins.plugin.version' for org.apache.maven.plugins:maven-checkstyle-plugin
is missing. @ org.apache.jclouds:jclouds-project:2.3.0-SNAPSHOT, <https://builds.apache.org/job/jclouds-with-credentials/job/jclouds-packet-live-tests/ws/project/pom.xml,>
line 1194, column 15
[WARNING] 
[WARNING] Some problems were encountered while building the effective model for org.apache.jclouds.provider:rackspace-clouddatabases-uk:bundle:2.3.0-SNAPSHOT
[WARNING] 'reporting.plugins.plugin.version' for org.apache.maven.plugins:maven-checkstyle-plugin
is missing. @ org.apache.jclouds:jclouds-project:2.3.0-SNAPSHOT, <https://builds.apache.org/job/jclouds-with-credentials/job/jclouds-packet-live-tests/ws/project/pom.xml,>
line 1194, column 15
[WARNING] 
[WARNING] Some problems were encountered while building the effective model for org.apache.jclouds.provider:rackspace-clouddatabases-us:bundle:2.3.0-SNAPSHOT
[WARNING] 'reporting.plugins.plugin.version' for org.apache.maven.plugins:maven-checkstyle-plugin
is missing. @ org.apache.jclouds:jclouds-project:2.3.0-SNAPSHOT, <https://builds.apache.org/job/jclouds-with-credentials/job/jclouds-packet-live-tests/ws/project/pom.xml,>
line 1194, column 15
[WARNING] 
[WARNING] Some problems were encountered while building the effective model for org.apache.jclouds.provider:rackspace-clouddns-uk:bundle:2.3.0-SNAPSHOT
[WARNING] 'reporting.plugins.plugin.version' for org.apache.maven.plugins:maven-checkstyle-plugin
is missing. @ org.apache.jclouds:jclouds-project:2.3.0-SNAPSHOT, <https://builds.apache.org/job/jclouds-with-credentials/job/jclouds-packet-live-tests/ws/project/pom.xml,>
line 1194, column 15
[WARNING] 
[WARNING] Some problems were encountered while building the effective model for org.apache.jclouds.provider:rackspace-clouddns-us:bundle:2.3.0-SNAPSHOT
[WARNING] 'reporting.plugins.plugin.version' for org.apache.maven.plugins:maven-checkstyle-plugin
is missing. @ org.apache.jclouds:jclouds-project:2.3.0-SNAPSHOT, <https://builds.apache.org/job/jclouds-with-credentials/job/jclouds-packet-live-tests/ws/project/pom.xml,>
line 1194, column 15
[WARNING] 
[WARNING] Some problems were encountered while building the effective model for org.apache.jclouds.provider:rackspace-cloudfiles-uk:bundle:2.3.0-SNAPSHOT
[WARNING] 'reporting.plugins.plugin.version' for org.apache.maven.plugins:maven-checkstyle-plugin
is missing. @ org.apache.jclouds:jclouds-project:2.3.0-SNAPSHOT, <https://builds.apache.org/job/jclouds-with-credentials/job/jclouds-packet-live-tests/ws/project/pom.xml,>
line 1194, column 15
[WARNING] 
[WARNING] Some problems were encountered while building the effective model for org.apache.jclouds.provider:rackspace-cloudfiles-us:bundle:2.3.0-SNAPSHOT
[WARNING] 'reporting.plugins.plugin.version' for org.apache.maven.plugins:maven-checkstyle-plugin
is missing. @ org.apache.jclouds:jclouds-project:2.3.0-SNAPSHOT, <https://builds.apache.org/job/jclouds-with-credentials/job/jclouds-packet-live-tests/ws/project/pom.xml,>
line 1194, column 15
[WARNING] 
[WARNING] Some problems were encountered while building the effective model for org.apache.jclouds.provider:rackspace-cloudloadbalancers-uk:bundle:2.3.0-SNAPSHOT
[WARNING] 'reporting.plugins.plugin.version' for org.apache.maven.plugins:maven-checkstyle-plugin
is missing. @ org.apache.jclouds:jclouds-project:2.3.0-SNAPSHOT, <https://builds.apache.org/job/jclouds-with-credentials/job/jclouds-packet-live-tests/ws/project/pom.xml,>
line 1194, column 15
[WARNING] 
[WARNING] Some problems were encountered while building the effective model for org.apache.jclouds.provider:rackspace-cloudloadbalancers-us:bundle:2.3.0-SNAPSHOT
[WARNING] 'reporting.plugins.plugin.version' for org.apache.maven.plugins:maven-checkstyle-plugin
is missing. @ org.apache.jclouds:jclouds-project:2.3.0-SNAPSHOT, <https://builds.apache.org/job/jclouds-with-credentials/job/jclouds-packet-live-tests/ws/project/pom.xml,>
line 1194, column 15
[WARNING] 
[WARNING] Some problems were encountered while building the effective model for org.apache.jclouds.provider:rackspace-cloudnetworks-uk:bundle:2.3.0-SNAPSHOT
[WARNING] 'reporting.plugins.plugin.version' for org.apache.maven.plugins:maven-checkstyle-plugin
is missing. @ org.apache.jclouds:jclouds-project:2.3.0-SNAPSHOT, <https://builds.apache.org/job/jclouds-with-credentials/job/jclouds-packet-live-tests/ws/project/pom.xml,>
line 1194, column 15
[WARNING] 
[WARNING] Some problems were encountered while building the effective model for org.apache.jclouds.provider:rackspace-cloudnetworks-us:bundle:2.3.0-SNAPSHOT
[WARNING] 'reporting.plugins.plugin.version' for org.apache.maven.plugins:maven-checkstyle-plugin
is missing. @ org.apache.jclouds:jclouds-project:2.3.0-SNAPSHOT, <https://builds.apache.org/job/jclouds-with-credentials/job/jclouds-packet-live-tests/ws/project/pom.xml,>
line 1194, column 15
[WARNING] 
[WARNING] Some problems were encountered while building the effective model for org.apache.jclouds.provider:rackspace-cloudservers-uk:bundle:2.3.0-SNAPSHOT
[WARNING] 'reporting.plugins.plugin.version' for org.apache.maven.plugins:maven-checkstyle-plugin
is missing. @ org.apache.jclouds:jclouds-project:2.3.0-SNAPSHOT, <https://builds.apache.org/job/jclouds-with-credentials/job/jclouds-packet-live-tests/ws/project/pom.xml,>
line 1194, column 15
[WARNING] 
[WARNING] Some problems were encountered while building the effective model for org.apache.jclouds.provider:rackspace-cloudservers-us:bundle:2.3.0-SNAPSHOT
[WARNING] 'reporting.plugins.plugin.version' for org.apache.maven.plugins:maven-checkstyle-plugin
is missing. @ org.apache.jclouds:jclouds-project:2.3.0-SNAPSHOT, <https://builds.apache.org/job/jclouds-with-credentials/job/jclouds-packet-live-tests/ws/project/pom.xml,>
line 1194, column 15
[WARNING] 
[WARNING] Some problems were encountered while building the effective model for org.apache.jclouds.provider:serverlove-z1-man:bundle:2.3.0-SNAPSHOT
[WARNING] 'reporting.plugins.plugin.version' for org.apache.maven.plugins:maven-checkstyle-plugin
is missing. @ org.apache.jclouds:jclouds-project:2.3.0-SNAPSHOT, <https://builds.apache.org/job/jclouds-with-credentials/job/jclouds-packet-live-tests/ws/project/pom.xml,>
line 1194, column 15
[WARNING] 
[WARNING] Some problems were encountered while building the effective model for org.apache.jclouds.provider:skalicloud-sdg-my:bundle:2.3.0-SNAPSHOT
[WARNING] 'reporting.plugins.plugin.version' for org.apache.maven.plugins:maven-checkstyle-plugin
is missing. @ org.apache.jclouds:jclouds-project:2.3.0-SNAPSHOT, <https://builds.apache.org/job/jclouds-with-credentials/job/jclouds-packet-live-tests/ws/project/pom.xml,>
line 1194, column 15
[WARNING] 
[WARNING] Some problems were encountered while building the effective model for org.apache.jclouds.provider:softlayer:bundle:2.3.0-SNAPSHOT
[WARNING] 'reporting.plugins.plugin.version' for org.apache.maven.plugins:maven-checkstyle-plugin
is missing. @ org.apache.jclouds:jclouds-project:2.3.0-SNAPSHOT, <https://builds.apache.org/job/jclouds-with-credentials/job/jclouds-packet-live-tests/ws/project/pom.xml,>
line 1194, column 15
[WARNING] 
[WARNING] Some problems were encountered while building the effective model for org.apache.jclouds.provider:ultradns-ws:bundle:2.3.0-SNAPSHOT
[WARNING] 'reporting.plugins.plugin.version' for org.apache.maven.plugins:maven-checkstyle-plugin
is missing. @ org.apache.jclouds:jclouds-project:2.3.0-SNAPSHOT, <https://builds.apache.org/job/jclouds-with-credentials/job/jclouds-packet-live-tests/ws/project/pom.xml,>
line 1194, column 15
[WARNING] 
[WARNING] Some problems were encountered while building the effective model for org.apache.jclouds.provider:jclouds-providers-project:pom:2.3.0-SNAPSHOT
[WARNING] 'reporting.plugins.plugin.version' for org.apache.maven.plugins:maven-checkstyle-plugin
is missing. @ org.apache.jclouds:jclouds-project:2.3.0-SNAPSHOT, <https://builds.apache.org/job/jclouds-with-credentials/job/jclouds-packet-live-tests/ws/project/pom.xml,>
line 1194, column 15
[WARNING] 
[WARNING] Some problems were encountered while building the effective model for org.apache.jclouds:jclouds-blobstore:bundle:2.3.0-SNAPSHOT
[WARNING] 'reporting.plugins.plugin.version' for org.apache.maven.plugins:maven-checkstyle-plugin
is missing. @ org.apache.jclouds:jclouds-project:2.3.0-SNAPSHOT, <https://builds.apache.org/job/jclouds-with-credentials/job/jclouds-packet-live-tests/ws/project/pom.xml,>
line 1194, column 15
[WARNING] 
[WARNING] Some problems were encountered while building the effective model for org.apache.jclouds.api:servermanager:bundle:2.3.0-SNAPSHOT
[WARNING] 'reporting.plugins.plugin.version' for org.apache.maven.plugins:maven-checkstyle-plugin
is missing. @ org.apache.jclouds:jclouds-project:2.3.0-SNAPSHOT, <https://builds.apache.org/job/jclouds-with-credentials/job/jclouds-packet-live-tests/ws/project/pom.xml,>
line 1194, column 15
[WARNING] 
[WARNING] Some problems were encountered while building the effective model for org.apache.jclouds:jclouds-skeletons-project:pom:2.3.0-SNAPSHOT
[WARNING] 'reporting.plugins.plugin.version' for org.apache.maven.plugins:maven-checkstyle-plugin
is missing. @ org.apache.jclouds:jclouds-project:2.3.0-SNAPSHOT, <https://builds.apache.org/job/jclouds-with-credentials/job/jclouds-packet-live-tests/ws/project/pom.xml,>
line 1194, column 15
[WARNING] 
[WARNING] Some problems were encountered while building the effective model for org.apache.jclouds.driver:jclouds-apachehc:bundle:2.3.0-SNAPSHOT
[WARNING] 'reporting.plugins.plugin.version' for org.apache.maven.plugins:maven-checkstyle-plugin
is missing. @ org.apache.jclouds:jclouds-project:2.3.0-SNAPSHOT, <https://builds.apache.org/job/jclouds-with-credentials/job/jclouds-packet-live-tests/ws/project/pom.xml,>
line 1194, column 15
[WARNING] 
[WARNING] Some problems were encountered while building the effective model for org.apache.jclouds.driver:jclouds-bouncycastle:bundle:2.3.0-SNAPSHOT
[WARNING] 'reporting.plugins.plugin.version' for org.apache.maven.plugins:maven-checkstyle-plugin
is missing. @ org.apache.jclouds:jclouds-project:2.3.0-SNAPSHOT, <https://builds.apache.org/job/jclouds-with-credentials/job/jclouds-packet-live-tests/ws/project/pom.xml,>
line 1194, column 15
[WARNING] 
[WARNING] Some problems were encountered while building the effective model for org.apache.jclouds.driver:jclouds-enterprise:bundle:2.3.0-SNAPSHOT
[WARNING] 'reporting.plugins.plugin.version' for org.apache.maven.plugins:maven-checkstyle-plugin
is missing. @ org.apache.jclouds:jclouds-project:2.3.0-SNAPSHOT, <https://builds.apache.org/job/jclouds-with-credentials/job/jclouds-packet-live-tests/ws/project/pom.xml,>
line 1194, column 15
[WARNING] 
[WARNING] Some problems were encountered while building the effective model for org.apache.jclouds.driver:jclouds-gae:bundle:2.3.0-SNAPSHOT
[WARNING] 'reporting.plugins.plugin.version' for org.apache.maven.plugins:maven-checkstyle-plugin
is missing. @ org.apache.jclouds:jclouds-project:2.3.0-SNAPSHOT, <https://builds.apache.org/job/jclouds-with-credentials/job/jclouds-packet-live-tests/ws/project/pom.xml,>
line 1194, column 15
[WARNING] 
[WARNING] Some problems were encountered while building the effective model for org.apache.jclouds.driver:jclouds-joda:bundle:2.3.0-SNAPSHOT
[WARNING] 'reporting.plugins.plugin.version' for org.apache.maven.plugins:maven-checkstyle-plugin
is missing. @ org.apache.jclouds:jclouds-project:2.3.0-SNAPSHOT, <https://builds.apache.org/job/jclouds-with-credentials/job/jclouds-packet-live-tests/ws/project/pom.xml,>
line 1194, column 15
[WARNING] 
[WARNING] Some problems were encountered while building the effective model for org.apache.jclouds.driver:jclouds-jsch:bundle:2.3.0-SNAPSHOT
[WARNING] 'reporting.plugins.plugin.version' for org.apache.maven.plugins:maven-checkstyle-plugin
is missing. @ org.apache.jclouds:jclouds-project:2.3.0-SNAPSHOT, <https://builds.apache.org/job/jclouds-with-credentials/job/jclouds-packet-live-tests/ws/project/pom.xml,>
line 1194, column 15
[WARNING] 
[WARNING] Some problems were encountered while building the effective model for org.apache.jclouds.driver:jclouds-log4j:bundle:2.3.0-SNAPSHOT
[WARNING] 'reporting.plugins.plugin.version' for org.apache.maven.plugins:maven-checkstyle-plugin
is missing. @ org.apache.jclouds:jclouds-project:2.3.0-SNAPSHOT, <https://builds.apache.org/job/jclouds-with-credentials/job/jclouds-packet-live-tests/ws/project/pom.xml,>
line 1194, column 15
[WARNING] 
[WARNING] Some problems were encountered while building the effective model for org.apache.jclouds.driver:jclouds-netty:bundle:2.3.0-SNAPSHOT
[WARNING] 'reporting.plugins.plugin.version' for org.apache.maven.plugins:maven-checkstyle-plugin
is missing. @ org.apache.jclouds:jclouds-project:2.3.0-SNAPSHOT, <https://builds.apache.org/job/jclouds-with-credentials/job/jclouds-packet-live-tests/ws/project/pom.xml,>
line 1194, column 15
[WARNING] 
[WARNING] Some problems were encountered while building the effective model for org.apache.jclouds.driver:jclouds-okhttp:bundle:2.3.0-SNAPSHOT
[WARNING] 'reporting.plugins.plugin.version' for org.apache.maven.plugins:maven-checkstyle-plugin
is missing. @ org.apache.jclouds:jclouds-project:2.3.0-SNAPSHOT, <https://builds.apache.org/job/jclouds-with-credentials/job/jclouds-packet-live-tests/ws/project/pom.xml,>
line 1194, column 15
[WARNING] 
[WARNING] Some problems were encountered while building the effective model for org.apache.jclouds.driver:jclouds-slf4j:bundle:2.3.0-SNAPSHOT
[WARNING] 'reporting.plugins.plugin.version' for org.apache.maven.plugins:maven-checkstyle-plugin
is missing. @ org.apache.jclouds:jclouds-project:2.3.0-SNAPSHOT, <https://builds.apache.org/job/jclouds-with-credentials/job/jclouds-packet-live-tests/ws/project/pom.xml,>
line 1194, column 15
[WARNING] 
[WARNING] Some problems were encountered while building the effective model for org.apache.jclouds.driver:jclouds-sshj:bundle:2.3.0-SNAPSHOT
[WARNING] 'reporting.plugins.plugin.version' for org.apache.maven.plugins:maven-checkstyle-plugin
is missing. @ org.apache.jclouds:jclouds-project:2.3.0-SNAPSHOT, <https://builds.apache.org/job/jclouds-with-credentials/job/jclouds-packet-live-tests/ws/project/pom.xml,>
line 1194, column 15
[WARNING] 
[WARNING] Some problems were encountered while building the effective model for org.apache.jclouds:jclouds-drivers-project:pom:2.3.0-SNAPSHOT
[WARNING] 'reporting.plugins.plugin.version' for org.apache.maven.plugins:maven-checkstyle-plugin
is missing. @ org.apache.jclouds:jclouds-project:2.3.0-SNAPSHOT, <https://builds.apache.org/job/jclouds-with-credentials/job/jclouds-packet-live-tests/ws/project/pom.xml,>
line 1194, column 15
[WARNING] 
[WARNING] Some problems were encountered while building the effective model for org.apache.jclouds:jclouds-scriptbuilder:bundle:2.3.0-SNAPSHOT
[WARNING] 'reporting.plugins.plugin.version' for org.apache.maven.plugins:maven-checkstyle-plugin
is missing. @ org.apache.jclouds:jclouds-project:2.3.0-SNAPSHOT, <https://builds.apache.org/job/jclouds-with-credentials/job/jclouds-packet-live-tests/ws/project/pom.xml,>
line 1194, column 15
[WARNING] 
[WARNING] Some problems were encountered while building the effective model for org.apache.jclouds:jclouds-allcompute:jar:2.3.0-SNAPSHOT
[WARNING] 'reporting.plugins.plugin.version' for org.apache.maven.plugins:maven-checkstyle-plugin
is missing. @ org.apache.jclouds:jclouds-project:2.3.0-SNAPSHOT, <https://builds.apache.org/job/jclouds-with-credentials/job/jclouds-packet-live-tests/ws/project/pom.xml,>
line 1194, column 15
[WARNING] 
[WARNING] Some problems were encountered while building the effective model for org.apache.jclouds:jclouds-allblobstore:jar:2.3.0-SNAPSHOT
[WARNING] 'reporting.plugins.plugin.version' for org.apache.maven.plugins:maven-checkstyle-plugin
is missing. @ org.apache.jclouds:jclouds-project:2.3.0-SNAPSHOT, <https://builds.apache.org/job/jclouds-with-credentials/job/jclouds-packet-live-tests/ws/project/pom.xml,>
line 1194, column 15
[WARNING] 
[WARNING] Some problems were encountered while building the effective model for org.apache.jclouds:jclouds-allloadbalancer:jar:2.3.0-SNAPSHOT
[WARNING] 'reporting.plugins.plugin.version' for org.apache.maven.plugins:maven-checkstyle-plugin
is missing. @ org.apache.jclouds:jclouds-project:2.3.0-SNAPSHOT, <https://builds.apache.org/job/jclouds-with-credentials/job/jclouds-packet-live-tests/ws/project/pom.xml,>
line 1194, column 15
[WARNING] 
[WARNING] Some problems were encountered while building the effective model for org.apache.jclouds:jclouds-all:jar:2.3.0-SNAPSHOT
[WARNING] 'reporting.plugins.plugin.version' for org.apache.maven.plugins:maven-checkstyle-plugin
is missing. @ org.apache.jclouds:jclouds-project:2.3.0-SNAPSHOT, <https://builds.apache.org/job/jclouds-with-credentials/job/jclouds-packet-live-tests/ws/project/pom.xml,>
line 1194, column 15
[WARNING] 
[WARNING] Some problems were encountered while building the effective model for org.apache.jclouds:jclouds:pom:2.3.0-SNAPSHOT
[WARNING] 'build.pluginManagement.plugins.plugin.(groupId:artifactId)' must be unique but
found duplicate declaration of plugin org.apache.rat:apache-rat-plugin @ org.apache.jclouds:jclouds-project:2.3.0-SNAPSHOT,
<https://builds.apache.org/job/jclouds-with-credentials/job/jclouds-packet-live-tests/ws/project/pom.xml,>
line 995, column 17
[WARNING] 'reporting.plugins.plugin.version' for org.apache.maven.plugins:maven-checkstyle-plugin
is missing. @ org.apache.jclouds:jclouds-project:2.3.0-SNAPSHOT, <https://builds.apache.org/job/jclouds-with-credentials/job/jclouds-packet-live-tests/ws/project/pom.xml,>
line 1194, column 15
[WARNING] 
[WARNING] It is highly recommended to fix these problems because they threaten the stability
of your build.
[WARNING] 
[WARNING] For this reason, future Maven versions might no longer support building such malformed
projects.
[WARNING] 
[INFO] 
[INFO] -----------------< org.apache.jclouds.provider:packet >-----------------
[INFO] Building jclouds Packet compute API 2.3.0-SNAPSHOT
[INFO] -------------------------------[ bundle ]-------------------------------
Downloading: https://repository.apache.org/content/repositories/snapshots/org/apache/jclouds/jclouds-compute/2.3.0-SNAPSHOT/maven-metadata.xml
Downloading: http://repository.apache.org/snapshots/org/apache/jclouds/jclouds-compute/2.3.0-SNAPSHOT/maven-metadata.xml
Downloaded: http://repository.apache.org/snapshots/org/apache/jclouds/jclouds-compute/2.3.0-SNAPSHOT/maven-metadata.xml
(2 KB at 1.7 KB/sec)
Downloaded: https://repository.apache.org/content/repositories/snapshots/org/apache/jclouds/jclouds-compute/2.3.0-SNAPSHOT/maven-metadata.xml
(2 KB at 0.8 KB/sec)
Downloading: https://repository.apache.org/content/repositories/snapshots/org/apache/jclouds/jclouds-compute/2.3.0-SNAPSHOT/jclouds-compute-2.3.0-20200124.144523-12.pom
Downloaded: https://repository.apache.org/content/repositories/snapshots/org/apache/jclouds/jclouds-compute/2.3.0-SNAPSHOT/jclouds-compute-2.3.0-20200124.144523-12.pom
(3 KB at 4.3 KB/sec)
Downloading: https://repository.apache.org/content/repositories/snapshots/org/apache/jclouds/jclouds-scriptbuilder/2.3.0-SNAPSHOT/maven-metadata.xml
Downloading: http://repository.apache.org/snapshots/org/apache/jclouds/jclouds-scriptbuilder/2.3.0-SNAPSHOT/maven-metadata.xml
Downloaded: http://repository.apache.org/snapshots/org/apache/jclouds/jclouds-scriptbuilder/2.3.0-SNAPSHOT/maven-metadata.xml
(2 KB at 5.0 KB/sec)
Downloaded: https://repository.apache.org/content/repositories/snapshots/org/apache/jclouds/jclouds-scriptbuilder/2.3.0-SNAPSHOT/maven-metadata.xml
(2 KB at 3.7 KB/sec)
Downloading: https://repository.apache.org/content/repositories/snapshots/org/apache/jclouds/jclouds-scriptbuilder/2.3.0-SNAPSHOT/jclouds-scriptbuilder-2.3.0-20200124.144411-12.pom
Downloaded: https://repository.apache.org/content/repositories/snapshots/org/apache/jclouds/jclouds-scriptbuilder/2.3.0-SNAPSHOT/jclouds-scriptbuilder-2.3.0-20200124.144411-12.pom
(3 KB at 5.9 KB/sec)
Downloading: http://repository.apache.org/snapshots/org/apache/jclouds/jclouds-core/2.3.0-SNAPSHOT/maven-metadata.xml
Downloading: https://repository.apache.org/content/repositories/snapshots/org/apache/jclouds/jclouds-core/2.3.0-SNAPSHOT/maven-metadata.xml
Downloaded: http://repository.apache.org/snapshots/org/apache/jclouds/jclouds-core/2.3.0-SNAPSHOT/maven-metadata.xml
(2 KB at 4.9 KB/sec)
Downloaded: https://repository.apache.org/content/repositories/snapshots/org/apache/jclouds/jclouds-core/2.3.0-SNAPSHOT/maven-metadata.xml
(2 KB at 3.7 KB/sec)
Downloading: https://repository.apache.org/content/repositories/snapshots/org/apache/jclouds/jclouds-core/2.3.0-SNAPSHOT/jclouds-core-2.3.0-20200124.144051-12.pom
Downloaded: https://repository.apache.org/content/repositories/snapshots/org/apache/jclouds/jclouds-core/2.3.0-SNAPSHOT/jclouds-core-2.3.0-20200124.144051-12.pom
(6 KB at 12.1 KB/sec)
Downloading: https://repository.apache.org/content/repositories/snapshots/org/apache/jclouds/jclouds-gson/2.3.0-SNAPSHOT/maven-metadata.xml
Downloading: http://repository.apache.org/snapshots/org/apache/jclouds/jclouds-gson/2.3.0-SNAPSHOT/maven-metadata.xml
Downloaded: http://repository.apache.org/snapshots/org/apache/jclouds/jclouds-gson/2.3.0-SNAPSHOT/maven-metadata.xml
(2 KB at 4.1 KB/sec)
Downloaded: https://repository.apache.org/content/repositories/snapshots/org/apache/jclouds/jclouds-gson/2.3.0-SNAPSHOT/maven-metadata.xml
(2 KB at 3.3 KB/sec)
Downloading: https://repository.apache.org/content/repositories/snapshots/org/apache/jclouds/jclouds-gson/2.3.0-SNAPSHOT/jclouds-gson-2.3.0-20200124.143740-12.pom
Downloaded: https://repository.apache.org/content/repositories/snapshots/org/apache/jclouds/jclouds-gson/2.3.0-SNAPSHOT/jclouds-gson-2.3.0-20200124.143740-12.pom
(2 KB at 4.4 KB/sec)
Downloading: http://repository.apache.org/snapshots/org/apache/jclouds/driver/jclouds-slf4j/2.3.0-SNAPSHOT/maven-metadata.xml
Downloading: https://repository.apache.org/content/repositories/snapshots/org/apache/jclouds/driver/jclouds-slf4j/2.3.0-SNAPSHOT/maven-metadata.xml
Downloaded: http://repository.apache.org/snapshots/org/apache/jclouds/driver/jclouds-slf4j/2.3.0-SNAPSHOT/maven-metadata.xml
(2 KB at 1.8 KB/sec)
Downloaded: https://repository.apache.org/content/repositories/snapshots/org/apache/jclouds/driver/jclouds-slf4j/2.3.0-SNAPSHOT/maven-metadata.xml
(2 KB at 1.7 KB/sec)
Downloading: https://repository.apache.org/content/repositories/snapshots/org/apache/jclouds/driver/jclouds-slf4j/2.3.0-SNAPSHOT/jclouds-slf4j-2.3.0-20200124.144124-12.pom
Downloaded: https://repository.apache.org/content/repositories/snapshots/org/apache/jclouds/driver/jclouds-slf4j/2.3.0-SNAPSHOT/jclouds-slf4j-2.3.0-20200124.144124-12.pom
(3 KB at 5.2 KB/sec)
Downloading: https://repository.apache.org/content/repositories/snapshots/org/apache/jclouds/driver/jclouds-sshj/2.3.0-SNAPSHOT/maven-metadata.xml
Downloading: http://repository.apache.org/snapshots/org/apache/jclouds/driver/jclouds-sshj/2.3.0-SNAPSHOT/maven-metadata.xml
Downloaded: http://repository.apache.org/snapshots/org/apache/jclouds/driver/jclouds-sshj/2.3.0-SNAPSHOT/maven-metadata.xml
(2 KB at 5.0 KB/sec)
Downloaded: https://repository.apache.org/content/repositories/snapshots/org/apache/jclouds/driver/jclouds-sshj/2.3.0-SNAPSHOT/maven-metadata.xml
(2 KB at 3.6 KB/sec)
Downloading: https://repository.apache.org/content/repositories/snapshots/org/apache/jclouds/driver/jclouds-sshj/2.3.0-SNAPSHOT/jclouds-sshj-2.3.0-20200124.144903-12.pom
Downloaded: https://repository.apache.org/content/repositories/snapshots/org/apache/jclouds/driver/jclouds-sshj/2.3.0-SNAPSHOT/jclouds-sshj-2.3.0-20200124.144903-12.pom
(6 KB at 12.3 KB/sec)
Downloading: https://repository.apache.org/content/repositories/snapshots/org/apache/jclouds/driver/jclouds-bouncycastle/2.3.0-SNAPSHOT/maven-metadata.xml
Downloading: http://repository.apache.org/snapshots/org/apache/jclouds/driver/jclouds-bouncycastle/2.3.0-SNAPSHOT/maven-metadata.xml
Downloaded: http://repository.apache.org/snapshots/org/apache/jclouds/driver/jclouds-bouncycastle/2.3.0-SNAPSHOT/maven-metadata.xml
(2 KB at 5.1 KB/sec)
Downloaded: https://repository.apache.org/content/repositories/snapshots/org/apache/jclouds/driver/jclouds-bouncycastle/2.3.0-SNAPSHOT/maven-metadata.xml
(2 KB at 3.6 KB/sec)
Downloading: https://repository.apache.org/content/repositories/snapshots/org/apache/jclouds/driver/jclouds-bouncycastle/2.3.0-SNAPSHOT/jclouds-bouncycastle-2.3.0-20200124.144828-12.pom
Downloaded: https://repository.apache.org/content/repositories/snapshots/org/apache/jclouds/driver/jclouds-bouncycastle/2.3.0-SNAPSHOT/jclouds-bouncycastle-2.3.0-20200124.144828-12.pom
(3 KB at 5.3 KB/sec)
Downloading: http://repo.maven.apache.org/maven2/com/hierynomus/sshj/0.27.0/sshj-0.27.0.pom
[JENKINS] Archiving disabled
[INFO] ------------------------------------------------------------------------
[INFO] BUILD FAILURE
[INFO] ------------------------------------------------------------------------
[INFO] Total time: 05:09 min
[INFO] Finished at: 2020-02-04T08:21:08Z
[INFO] ------------------------------------------------------------------------
[JENKINS] Archiving disabled
[ERROR] Failed to execute goal on project packet: Could not resolve dependencies for project
org.apache.jclouds.provider:packet:bundle:2.3.0-SNAPSHOT: Failed to collect dependencies for
[org.apache.jclouds:jclouds-compute:jar:2.3.0-SNAPSHOT (compile), com.google.auto.service:auto-service:jar:1.0-rc3
(provided?), com.google.auto.value:auto-value:jar:1.4.1 (provided), org.apache.jclouds:jclouds-core:jar:tests:2.3.0-SNAPSHOT
(test), org.apache.jclouds:jclouds-compute:jar:tests:2.3.0-SNAPSHOT (test), org.apache.jclouds.driver:jclouds-slf4j:jar:tests:2.3.0-SNAPSHOT
(test), org.apache.jclouds.driver:jclouds-slf4j:jar:2.3.0-SNAPSHOT (test), ch.qos.logback:logback-classic:jar:1.1.2
(test), org.apache.jclouds.driver:jclouds-sshj:jar:2.3.0-SNAPSHOT (test), com.squareup.okhttp:mockwebserver:jar:2.2.0
(test), com.google.errorprone:error_prone_annotations:jar:2.1.0 (compile), com.google.code.findbugs:jsr305:jar:1.3.9
(provided), org.testng:testng:jar:6.8.21 (test), org.easymock:easymock:jar:3.4 (test), xmlunit:xmlunit:jar:1.3
(test), org.assertj:assertj-core:jar:1.7.0 (test), org.assertj:assertj-guava:jar:1.3.0 (test)]:
Failed to read artifact descriptor for com.hierynomus:sshj:jar:0.27.0: Could not transfer
artifact com.hierynomus:sshj:pom:0.27.0 from/to central (http://repo.maven.apache.org/maven2):
Failed to transfer file: http://repo.maven.apache.org/maven2/com/hierynomus/sshj/0.27.0/sshj-0.27.0.pom.
Return code is: 501 , ReasonPhrase:HTTPS Required. -> [Help 1]
[ERROR] 
[ERROR] To see the full stack trace of the errors, re-run Maven with the -e switch.
[ERROR] Re-run Maven using the -X switch to enable full debug logging.
[ERROR] 
[ERROR] For more information about the errors and possible solutions, please read the following
articles:
[ERROR] [Help 1] http://cwiki.apache.org/confluence/display/MAVEN/DependencyResolutionException
channel stopped

Mime
View raw message