jclouds-notifications mailing list archives

Site index · List index
Message view « Date » · « Thread »
Top « Date » · « Thread »
From Apache Jenkins Server <jenk...@builds.apache.org>
Subject Build failed in Jenkins: jclouds-with-credentials » jclouds-chef-live-tests #72
Date Wed, 26 Feb 2020 08:52:21 GMT
See <https://builds.apache.org/job/jclouds-with-credentials/job/jclouds-chef-live-tests/72/display/redirect>

Changes:


------------------------------------------
[...truncated 90.17 KB...]
[WARNING] Some problems were encountered while building the effective model for org.apache.jclouds:jclouds-blobstore:bundle:2.3.0-SNAPSHOT
[WARNING] 'reporting.plugins.plugin.version' for org.apache.maven.plugins:maven-checkstyle-plugin
is missing. @ org.apache.jclouds:jclouds-project:2.3.0-SNAPSHOT, <https://builds.apache.org/job/jclouds-with-credentials/job/jclouds-chef-live-tests/ws/project/pom.xml,>
line 1194, column 15
[WARNING] 
[WARNING] Some problems were encountered while building the effective model for org.apache.jclouds.api:servermanager:bundle:2.3.0-SNAPSHOT
[WARNING] 'reporting.plugins.plugin.version' for org.apache.maven.plugins:maven-checkstyle-plugin
is missing. @ org.apache.jclouds:jclouds-project:2.3.0-SNAPSHOT, <https://builds.apache.org/job/jclouds-with-credentials/job/jclouds-chef-live-tests/ws/project/pom.xml,>
line 1194, column 15
[WARNING] 
[WARNING] Some problems were encountered while building the effective model for org.apache.jclouds:jclouds-skeletons-project:pom:2.3.0-SNAPSHOT
[WARNING] 'reporting.plugins.plugin.version' for org.apache.maven.plugins:maven-checkstyle-plugin
is missing. @ org.apache.jclouds:jclouds-project:2.3.0-SNAPSHOT, <https://builds.apache.org/job/jclouds-with-credentials/job/jclouds-chef-live-tests/ws/project/pom.xml,>
line 1194, column 15
[WARNING] 
[WARNING] Some problems were encountered while building the effective model for org.apache.jclouds.driver:jclouds-apachehc:bundle:2.3.0-SNAPSHOT
[WARNING] 'reporting.plugins.plugin.version' for org.apache.maven.plugins:maven-checkstyle-plugin
is missing. @ org.apache.jclouds:jclouds-project:2.3.0-SNAPSHOT, <https://builds.apache.org/job/jclouds-with-credentials/job/jclouds-chef-live-tests/ws/project/pom.xml,>
line 1194, column 15
[WARNING] 
[WARNING] Some problems were encountered while building the effective model for org.apache.jclouds.driver:jclouds-bouncycastle:bundle:2.3.0-SNAPSHOT
[WARNING] 'reporting.plugins.plugin.version' for org.apache.maven.plugins:maven-checkstyle-plugin
is missing. @ org.apache.jclouds:jclouds-project:2.3.0-SNAPSHOT, <https://builds.apache.org/job/jclouds-with-credentials/job/jclouds-chef-live-tests/ws/project/pom.xml,>
line 1194, column 15
[WARNING] 
[WARNING] Some problems were encountered while building the effective model for org.apache.jclouds.driver:jclouds-enterprise:bundle:2.3.0-SNAPSHOT
[WARNING] 'reporting.plugins.plugin.version' for org.apache.maven.plugins:maven-checkstyle-plugin
is missing. @ org.apache.jclouds:jclouds-project:2.3.0-SNAPSHOT, <https://builds.apache.org/job/jclouds-with-credentials/job/jclouds-chef-live-tests/ws/project/pom.xml,>
line 1194, column 15
[WARNING] 
[WARNING] Some problems were encountered while building the effective model for org.apache.jclouds.driver:jclouds-gae:bundle:2.3.0-SNAPSHOT
[WARNING] 'reporting.plugins.plugin.version' for org.apache.maven.plugins:maven-checkstyle-plugin
is missing. @ org.apache.jclouds:jclouds-project:2.3.0-SNAPSHOT, <https://builds.apache.org/job/jclouds-with-credentials/job/jclouds-chef-live-tests/ws/project/pom.xml,>
line 1194, column 15
[WARNING] 
[WARNING] Some problems were encountered while building the effective model for org.apache.jclouds.driver:jclouds-joda:bundle:2.3.0-SNAPSHOT
[WARNING] 'reporting.plugins.plugin.version' for org.apache.maven.plugins:maven-checkstyle-plugin
is missing. @ org.apache.jclouds:jclouds-project:2.3.0-SNAPSHOT, <https://builds.apache.org/job/jclouds-with-credentials/job/jclouds-chef-live-tests/ws/project/pom.xml,>
line 1194, column 15
[WARNING] 
[WARNING] Some problems were encountered while building the effective model for org.apache.jclouds.driver:jclouds-jsch:bundle:2.3.0-SNAPSHOT
[WARNING] 'reporting.plugins.plugin.version' for org.apache.maven.plugins:maven-checkstyle-plugin
is missing. @ org.apache.jclouds:jclouds-project:2.3.0-SNAPSHOT, <https://builds.apache.org/job/jclouds-with-credentials/job/jclouds-chef-live-tests/ws/project/pom.xml,>
line 1194, column 15
[WARNING] 
[WARNING] Some problems were encountered while building the effective model for org.apache.jclouds.driver:jclouds-log4j:bundle:2.3.0-SNAPSHOT
[WARNING] 'reporting.plugins.plugin.version' for org.apache.maven.plugins:maven-checkstyle-plugin
is missing. @ org.apache.jclouds:jclouds-project:2.3.0-SNAPSHOT, <https://builds.apache.org/job/jclouds-with-credentials/job/jclouds-chef-live-tests/ws/project/pom.xml,>
line 1194, column 15
[WARNING] 
[WARNING] Some problems were encountered while building the effective model for org.apache.jclouds.driver:jclouds-netty:bundle:2.3.0-SNAPSHOT
[WARNING] 'reporting.plugins.plugin.version' for org.apache.maven.plugins:maven-checkstyle-plugin
is missing. @ org.apache.jclouds:jclouds-project:2.3.0-SNAPSHOT, <https://builds.apache.org/job/jclouds-with-credentials/job/jclouds-chef-live-tests/ws/project/pom.xml,>
line 1194, column 15
[WARNING] 
[WARNING] Some problems were encountered while building the effective model for org.apache.jclouds.driver:jclouds-okhttp:bundle:2.3.0-SNAPSHOT
[WARNING] 'reporting.plugins.plugin.version' for org.apache.maven.plugins:maven-checkstyle-plugin
is missing. @ org.apache.jclouds:jclouds-project:2.3.0-SNAPSHOT, <https://builds.apache.org/job/jclouds-with-credentials/job/jclouds-chef-live-tests/ws/project/pom.xml,>
line 1194, column 15
[WARNING] 
[WARNING] Some problems were encountered while building the effective model for org.apache.jclouds.driver:jclouds-slf4j:bundle:2.3.0-SNAPSHOT
[WARNING] 'reporting.plugins.plugin.version' for org.apache.maven.plugins:maven-checkstyle-plugin
is missing. @ org.apache.jclouds:jclouds-project:2.3.0-SNAPSHOT, <https://builds.apache.org/job/jclouds-with-credentials/job/jclouds-chef-live-tests/ws/project/pom.xml,>
line 1194, column 15
[WARNING] 
[WARNING] Some problems were encountered while building the effective model for org.apache.jclouds.driver:jclouds-sshj:bundle:2.3.0-SNAPSHOT
[WARNING] 'reporting.plugins.plugin.version' for org.apache.maven.plugins:maven-checkstyle-plugin
is missing. @ org.apache.jclouds:jclouds-project:2.3.0-SNAPSHOT, <https://builds.apache.org/job/jclouds-with-credentials/job/jclouds-chef-live-tests/ws/project/pom.xml,>
line 1194, column 15
[WARNING] 
[WARNING] Some problems were encountered while building the effective model for org.apache.jclouds:jclouds-drivers-project:pom:2.3.0-SNAPSHOT
[WARNING] 'reporting.plugins.plugin.version' for org.apache.maven.plugins:maven-checkstyle-plugin
is missing. @ org.apache.jclouds:jclouds-project:2.3.0-SNAPSHOT, <https://builds.apache.org/job/jclouds-with-credentials/job/jclouds-chef-live-tests/ws/project/pom.xml,>
line 1194, column 15
[WARNING] 
[WARNING] Some problems were encountered while building the effective model for org.apache.jclouds:jclouds-scriptbuilder:bundle:2.3.0-SNAPSHOT
[WARNING] 'reporting.plugins.plugin.version' for org.apache.maven.plugins:maven-checkstyle-plugin
is missing. @ org.apache.jclouds:jclouds-project:2.3.0-SNAPSHOT, <https://builds.apache.org/job/jclouds-with-credentials/job/jclouds-chef-live-tests/ws/project/pom.xml,>
line 1194, column 15
[WARNING] 
[WARNING] Some problems were encountered while building the effective model for org.apache.jclouds:jclouds-allcompute:jar:2.3.0-SNAPSHOT
[WARNING] 'reporting.plugins.plugin.version' for org.apache.maven.plugins:maven-checkstyle-plugin
is missing. @ org.apache.jclouds:jclouds-project:2.3.0-SNAPSHOT, <https://builds.apache.org/job/jclouds-with-credentials/job/jclouds-chef-live-tests/ws/project/pom.xml,>
line 1194, column 15
[WARNING] 
[WARNING] Some problems were encountered while building the effective model for org.apache.jclouds:jclouds-allblobstore:jar:2.3.0-SNAPSHOT
[WARNING] 'reporting.plugins.plugin.version' for org.apache.maven.plugins:maven-checkstyle-plugin
is missing. @ org.apache.jclouds:jclouds-project:2.3.0-SNAPSHOT, <https://builds.apache.org/job/jclouds-with-credentials/job/jclouds-chef-live-tests/ws/project/pom.xml,>
line 1194, column 15
[WARNING] 
[WARNING] Some problems were encountered while building the effective model for org.apache.jclouds:jclouds-allloadbalancer:jar:2.3.0-SNAPSHOT
[WARNING] 'reporting.plugins.plugin.version' for org.apache.maven.plugins:maven-checkstyle-plugin
is missing. @ org.apache.jclouds:jclouds-project:2.3.0-SNAPSHOT, <https://builds.apache.org/job/jclouds-with-credentials/job/jclouds-chef-live-tests/ws/project/pom.xml,>
line 1194, column 15
[WARNING] 
[WARNING] Some problems were encountered while building the effective model for org.apache.jclouds:jclouds-all:jar:2.3.0-SNAPSHOT
[WARNING] 'reporting.plugins.plugin.version' for org.apache.maven.plugins:maven-checkstyle-plugin
is missing. @ org.apache.jclouds:jclouds-project:2.3.0-SNAPSHOT, <https://builds.apache.org/job/jclouds-with-credentials/job/jclouds-chef-live-tests/ws/project/pom.xml,>
line 1194, column 15
[WARNING] 
[WARNING] Some problems were encountered while building the effective model for org.apache.jclouds:jclouds:pom:2.3.0-SNAPSHOT
[WARNING] 'build.pluginManagement.plugins.plugin.(groupId:artifactId)' must be unique but
found duplicate declaration of plugin org.apache.rat:apache-rat-plugin @ org.apache.jclouds:jclouds-project:2.3.0-SNAPSHOT,
<https://builds.apache.org/job/jclouds-with-credentials/job/jclouds-chef-live-tests/ws/project/pom.xml,>
line 995, column 17
[WARNING] 'reporting.plugins.plugin.version' for org.apache.maven.plugins:maven-checkstyle-plugin
is missing. @ org.apache.jclouds:jclouds-project:2.3.0-SNAPSHOT, <https://builds.apache.org/job/jclouds-with-credentials/job/jclouds-chef-live-tests/ws/project/pom.xml,>
line 1194, column 15
[WARNING] 
[WARNING] It is highly recommended to fix these problems because they threaten the stability
of your build.
[WARNING] 
[WARNING] For this reason, future Maven versions might no longer support building such malformed
projects.
[WARNING] 
[INFO] 
[INFO] --------------------< org.apache.jclouds.api:chef >---------------------
[INFO] Building jclouds Chef api 2.3.0-SNAPSHOT
[INFO] -------------------------------[ bundle ]-------------------------------
Downloading: https://repo.maven.apache.org/maven2/org/apache/maven/plugins/maven-enforcer-plugin/1.1.1/maven-enforcer-plugin-1.1.1.pom
Downloaded: https://repo.maven.apache.org/maven2/org/apache/maven/plugins/maven-enforcer-plugin/1.1.1/maven-enforcer-plugin-1.1.1.pom
(7 KB at 10.8 KB/sec)
Downloading: https://repo.maven.apache.org/maven2/org/apache/maven/enforcer/enforcer/1.1.1/enforcer-1.1.1.pom
Downloaded: https://repo.maven.apache.org/maven2/org/apache/maven/enforcer/enforcer/1.1.1/enforcer-1.1.1.pom
(12 KB at 346.8 KB/sec)
Downloading: https://repo.maven.apache.org/maven2/org/apache/maven/plugins/maven-enforcer-plugin/1.1.1/maven-enforcer-plugin-1.1.1.jar
Downloaded: https://repo.maven.apache.org/maven2/org/apache/maven/plugins/maven-enforcer-plugin/1.1.1/maven-enforcer-plugin-1.1.1.jar
(22 KB at 852.5 KB/sec)
Downloading: https://repo.maven.apache.org/maven2/org/apache/maven/plugins/maven-toolchains-plugin/1.1/maven-toolchains-plugin-1.1.pom
Downloaded: https://repo.maven.apache.org/maven2/org/apache/maven/plugins/maven-toolchains-plugin/1.1/maven-toolchains-plugin-1.1.pom
(4 KB at 202.1 KB/sec)
Downloading: https://repo.maven.apache.org/maven2/org/apache/maven/plugins/maven-plugins/26/maven-plugins-26.pom
Downloaded: https://repo.maven.apache.org/maven2/org/apache/maven/plugins/maven-plugins/26/maven-plugins-26.pom
(12 KB at 528.7 KB/sec)
Downloading: https://repo.maven.apache.org/maven2/org/apache/maven/plugins/maven-toolchains-plugin/1.1/maven-toolchains-plugin-1.1.jar
Downloaded: https://repo.maven.apache.org/maven2/org/apache/maven/plugins/maven-toolchains-plugin/1.1/maven-toolchains-plugin-1.1.jar
(25 KB at 1061.9 KB/sec)
Downloading: https://repo.maven.apache.org/maven2/org/apache/maven/plugins/maven-surefire-plugin/2.17/maven-surefire-plugin-2.17.pom
Downloaded: https://repo.maven.apache.org/maven2/org/apache/maven/plugins/maven-surefire-plugin/2.17/maven-surefire-plugin-2.17.pom
(5 KB at 271.3 KB/sec)
Downloading: https://repo.maven.apache.org/maven2/org/apache/maven/surefire/surefire/2.17/surefire-2.17.pom
Downloaded: https://repo.maven.apache.org/maven2/org/apache/maven/surefire/surefire/2.17/surefire-2.17.pom
(17 KB at 889.5 KB/sec)
Downloading: https://repo.maven.apache.org/maven2/org/apache/maven/plugins/maven-surefire-plugin/2.17/maven-surefire-plugin-2.17.jar
Downloaded: https://repo.maven.apache.org/maven2/org/apache/maven/plugins/maven-surefire-plugin/2.17/maven-surefire-plugin-2.17.jar
(34 KB at 1591.8 KB/sec)
Downloading: https://repo.maven.apache.org/maven2/org/codehaus/mojo/animal-sniffer-maven-plugin/1.16/animal-sniffer-maven-plugin-1.16.pom
Downloaded: https://repo.maven.apache.org/maven2/org/codehaus/mojo/animal-sniffer-maven-plugin/1.16/animal-sniffer-maven-plugin-1.16.pom
(6 KB at 323.2 KB/sec)
Downloading: https://repo.maven.apache.org/maven2/org/codehaus/mojo/animal-sniffer-parent/1.16/animal-sniffer-parent-1.16.pom
Downloaded: https://repo.maven.apache.org/maven2/org/codehaus/mojo/animal-sniffer-parent/1.16/animal-sniffer-parent-1.16.pom
(6 KB at 319.5 KB/sec)
Downloading: https://repo.maven.apache.org/maven2/org/codehaus/mojo/mojo-parent/36/mojo-parent-36.pom
Downloaded: https://repo.maven.apache.org/maven2/org/codehaus/mojo/mojo-parent/36/mojo-parent-36.pom
(28 KB at 1555.2 KB/sec)
Downloading: https://repo.maven.apache.org/maven2/org/codehaus/mojo/animal-sniffer-maven-plugin/1.16/animal-sniffer-maven-plugin-1.16.jar
Downloaded: https://repo.maven.apache.org/maven2/org/codehaus/mojo/animal-sniffer-maven-plugin/1.16/animal-sniffer-maven-plugin-1.16.jar
(33 KB at 1686.4 KB/sec)
Downloading: https://repo.maven.apache.org/maven2/org/basepom/maven/duplicate-finder-maven-plugin/1.1.2/duplicate-finder-maven-plugin-1.1.2.pom
Downloaded: https://repo.maven.apache.org/maven2/org/basepom/maven/duplicate-finder-maven-plugin/1.1.2/duplicate-finder-maven-plugin-1.1.2.pom
(20 KB at 37.6 KB/sec)
Downloading: https://repo.maven.apache.org/maven2/org/basepom/basepom-standard-oss/11/basepom-standard-oss-11.pom
Downloaded: https://repo.maven.apache.org/maven2/org/basepom/basepom-standard-oss/11/basepom-standard-oss-11.pom
(10 KB at 512.1 KB/sec)
Downloading: https://repo.maven.apache.org/maven2/org/basepom/basepom-standard/11/basepom-standard-11.pom
Downloaded: https://repo.maven.apache.org/maven2/org/basepom/basepom-standard/11/basepom-standard-11.pom
(43 KB at 163.4 KB/sec)
Downloading: https://repo.maven.apache.org/maven2/org/basepom/basepom-foundation/11/basepom-foundation-11.pom
Downloaded: https://repo.maven.apache.org/maven2/org/basepom/basepom-foundation/11/basepom-foundation-11.pom
(46 KB at 1996.3 KB/sec)
Downloading: https://repo.maven.apache.org/maven2/org/basepom/maven/duplicate-finder-maven-plugin/1.1.2/duplicate-finder-maven-plugin-1.1.2.jar
Downloaded: https://repo.maven.apache.org/maven2/org/basepom/maven/duplicate-finder-maven-plugin/1.1.2/duplicate-finder-maven-plugin-1.1.2.jar
(73 KB at 207.1 KB/sec)
Downloading: https://repo.maven.apache.org/maven2/org/gaul/modernizer-maven-plugin/1.8.0/modernizer-maven-plugin-1.8.0.pom
Downloaded: https://repo.maven.apache.org/maven2/org/gaul/modernizer-maven-plugin/1.8.0/modernizer-maven-plugin-1.8.0.pom
(4 KB at 197.6 KB/sec)
Downloading: https://repo.maven.apache.org/maven2/org/gaul/modernizer-maven-parent/1.8.0/modernizer-maven-parent-1.8.0.pom
Downloaded: https://repo.maven.apache.org/maven2/org/gaul/modernizer-maven-parent/1.8.0/modernizer-maven-parent-1.8.0.pom
(9 KB at 504.2 KB/sec)
Downloading: https://repo.maven.apache.org/maven2/org/gaul/modernizer-maven-plugin/1.8.0/modernizer-maven-plugin-1.8.0.jar
Downloaded: https://repo.maven.apache.org/maven2/org/gaul/modernizer-maven-plugin/1.8.0/modernizer-maven-plugin-1.8.0.jar
(36 KB at 1761.3 KB/sec)
Downloading: https://repository.apache.org/content/repositories/snapshots/org/apache/jclouds/jclouds-core/2.3.0-SNAPSHOT/maven-metadata.xml
Downloading: http://repository.apache.org/snapshots/org/apache/jclouds/jclouds-core/2.3.0-SNAPSHOT/maven-metadata.xml
Downloaded: http://repository.apache.org/snapshots/org/apache/jclouds/jclouds-core/2.3.0-SNAPSHOT/maven-metadata.xml
(2 KB at 4.6 KB/sec)
Downloaded: https://repository.apache.org/content/repositories/snapshots/org/apache/jclouds/jclouds-core/2.3.0-SNAPSHOT/maven-metadata.xml
(2 KB at 2.0 KB/sec)
Downloading: https://repository.apache.org/content/repositories/snapshots/org/apache/jclouds/jclouds-core/2.3.0-SNAPSHOT/jclouds-core-2.3.0-20200217.143448-13.pom
Downloaded: https://repository.apache.org/content/repositories/snapshots/org/apache/jclouds/jclouds-core/2.3.0-SNAPSHOT/jclouds-core-2.3.0-20200217.143448-13.pom
(6 KB at 6.7 KB/sec)
Downloading: http://repository.apache.org/snapshots/org/apache/jclouds/jclouds-gson/2.3.0-SNAPSHOT/maven-metadata.xml
Downloading: https://repository.apache.org/content/repositories/snapshots/org/apache/jclouds/jclouds-gson/2.3.0-SNAPSHOT/maven-metadata.xml
Downloaded: http://repository.apache.org/snapshots/org/apache/jclouds/jclouds-gson/2.3.0-SNAPSHOT/maven-metadata.xml
(2 KB at 4.1 KB/sec)
Downloaded: https://repository.apache.org/content/repositories/snapshots/org/apache/jclouds/jclouds-gson/2.3.0-SNAPSHOT/maven-metadata.xml
(2 KB at 1.7 KB/sec)
Downloading: https://repository.apache.org/content/repositories/snapshots/org/apache/jclouds/jclouds-gson/2.3.0-SNAPSHOT/jclouds-gson-2.3.0-20200217.143117-13.pom
Downloaded: https://repository.apache.org/content/repositories/snapshots/org/apache/jclouds/jclouds-gson/2.3.0-SNAPSHOT/jclouds-gson-2.3.0-20200217.143117-13.pom
(2 KB at 2.4 KB/sec)
Downloading: https://repo.maven.apache.org/maven2/com/google/errorprone/error_prone_annotations/2.1.0/error_prone_annotations-2.1.0.pom
Downloaded: https://repo.maven.apache.org/maven2/com/google/errorprone/error_prone_annotations/2.1.0/error_prone_annotations-2.1.0.pom
(2 KB at 89.0 KB/sec)
Downloading: https://repo.maven.apache.org/maven2/com/google/errorprone/error_prone_parent/2.1.0/error_prone_parent-2.1.0.pom
Downloaded: https://repo.maven.apache.org/maven2/com/google/errorprone/error_prone_parent/2.1.0/error_prone_parent-2.1.0.pom
(5 KB at 291.3 KB/sec)
Downloading: https://repository.apache.org/content/repositories/snapshots/org/apache/jclouds/jclouds-scriptbuilder/2.3.0-SNAPSHOT/maven-metadata.xml
Downloading: http://repository.apache.org/snapshots/org/apache/jclouds/jclouds-scriptbuilder/2.3.0-SNAPSHOT/maven-metadata.xml
Downloaded: http://repository.apache.org/snapshots/org/apache/jclouds/jclouds-scriptbuilder/2.3.0-SNAPSHOT/maven-metadata.xml
(2 KB at 4.6 KB/sec)
Downloaded: https://repository.apache.org/content/repositories/snapshots/org/apache/jclouds/jclouds-scriptbuilder/2.3.0-SNAPSHOT/maven-metadata.xml
(2 KB at 2.0 KB/sec)
Downloading: https://repository.apache.org/content/repositories/snapshots/org/apache/jclouds/jclouds-scriptbuilder/2.3.0-SNAPSHOT/jclouds-scriptbuilder-2.3.0-20200217.143822-13.pom
Downloaded: https://repository.apache.org/content/repositories/snapshots/org/apache/jclouds/jclouds-scriptbuilder/2.3.0-SNAPSHOT/jclouds-scriptbuilder-2.3.0-20200217.143822-13.pom
(3 KB at 3.3 KB/sec)
Downloading: https://repo.maven.apache.org/maven2/com/google/inject/extensions/guice-multibindings/3.0/guice-multibindings-3.0.pom
Downloaded: https://repo.maven.apache.org/maven2/com/google/inject/extensions/guice-multibindings/3.0/guice-multibindings-3.0.pom
(547 B at 28.1 KB/sec)
Downloading: https://repository.apache.org/content/repositories/snapshots/org/apache/jclouds/jclouds-blobstore/2.3.0-SNAPSHOT/maven-metadata.xml
Downloading: http://repository.apache.org/snapshots/org/apache/jclouds/jclouds-blobstore/2.3.0-SNAPSHOT/maven-metadata.xml
Downloaded: http://repository.apache.org/snapshots/org/apache/jclouds/jclouds-blobstore/2.3.0-SNAPSHOT/maven-metadata.xml
(2 KB at 5.2 KB/sec)
Downloaded: https://repository.apache.org/content/repositories/snapshots/org/apache/jclouds/jclouds-blobstore/2.3.0-SNAPSHOT/maven-metadata.xml
(2 KB at 2.0 KB/sec)
Downloading: https://repository.apache.org/content/repositories/snapshots/org/apache/jclouds/jclouds-blobstore/2.3.0-SNAPSHOT/jclouds-blobstore-2.3.0-20200217.144152-13.pom
Downloaded: https://repository.apache.org/content/repositories/snapshots/org/apache/jclouds/jclouds-blobstore/2.3.0-SNAPSHOT/jclouds-blobstore-2.3.0-20200217.144152-13.pom
(4 KB at 4.8 KB/sec)
Downloading: http://repository.apache.org/snapshots/org/apache/jclouds/driver/jclouds-slf4j/2.3.0-SNAPSHOT/maven-metadata.xml
Downloading: https://repository.apache.org/content/repositories/snapshots/org/apache/jclouds/driver/jclouds-slf4j/2.3.0-SNAPSHOT/maven-metadata.xml
Downloaded: http://repository.apache.org/snapshots/org/apache/jclouds/driver/jclouds-slf4j/2.3.0-SNAPSHOT/maven-metadata.xml
(2 KB at 4.5 KB/sec)
Downloaded: https://repository.apache.org/content/repositories/snapshots/org/apache/jclouds/driver/jclouds-slf4j/2.3.0-SNAPSHOT/maven-metadata.xml
(2 KB at 2.0 KB/sec)
Downloading: https://repository.apache.org/content/repositories/snapshots/org/apache/jclouds/driver/jclouds-slf4j/2.3.0-SNAPSHOT/jclouds-slf4j-2.3.0-20200217.143522-13.pom
Downloaded: https://repository.apache.org/content/repositories/snapshots/org/apache/jclouds/driver/jclouds-slf4j/2.3.0-SNAPSHOT/jclouds-slf4j-2.3.0-20200217.143522-13.pom
(3 KB at 3.0 KB/sec)
Downloading: https://repo.maven.apache.org/maven2/org/slf4j/slf4j-api/1.7.2/slf4j-api-1.7.2.pom
Downloaded: https://repo.maven.apache.org/maven2/org/slf4j/slf4j-api/1.7.2/slf4j-api-1.7.2.pom
(3 KB at 164.1 KB/sec)
Downloading: https://repo.maven.apache.org/maven2/org/slf4j/slf4j-parent/1.7.2/slf4j-parent-1.7.2.pom
Downloaded: https://repo.maven.apache.org/maven2/org/slf4j/slf4j-parent/1.7.2/slf4j-parent-1.7.2.pom
(12 KB at 640.4 KB/sec)
Downloading: https://repo.maven.apache.org/maven2/org/slf4j/slf4j-api/1.7.6/slf4j-api-1.7.6.pom
Downloaded: https://repo.maven.apache.org/maven2/org/slf4j/slf4j-api/1.7.6/slf4j-api-1.7.6.pom
(3 KB at 164.1 KB/sec)
Downloading: https://repo.maven.apache.org/maven2/org/slf4j/slf4j-parent/1.7.6/slf4j-parent-1.7.6.pom
Downloaded: https://repo.maven.apache.org/maven2/org/slf4j/slf4j-parent/1.7.6/slf4j-parent-1.7.6.pom
(12 KB at 726.7 KB/sec)
Downloading: https://repo.maven.apache.org/maven2/com/google/auto/service/auto-service/1.0-rc3/auto-service-1.0-rc3.pom
Downloaded: https://repo.maven.apache.org/maven2/com/google/auto/service/auto-service/1.0-rc3/auto-service-1.0-rc3.pom
(3 KB at 155.1 KB/sec)
Downloading: https://repo.maven.apache.org/maven2/com/google/auto/auto-parent/3/auto-parent-3.pom
Downloaded: https://repo.maven.apache.org/maven2/com/google/auto/auto-parent/3/auto-parent-3.pom
(4 KB at 220.5 KB/sec)
Downloading: https://repo.maven.apache.org/maven2/com/google/auto/auto-common/0.3/auto-common-0.3.pom
Downloaded: https://repo.maven.apache.org/maven2/com/google/auto/auto-common/0.3/auto-common-0.3.pom
(3 KB at 10.7 KB/sec)
Downloading: https://repo.maven.apache.org/maven2/com/google/auto/auto-parent/2/auto-parent-2.pom
Downloaded: https://repo.maven.apache.org/maven2/com/google/auto/auto-parent/2/auto-parent-2.pom
(5 KB at 233.0 KB/sec)
Downloading: https://repo.maven.apache.org/maven2/org/testng/testng/6.8.21/testng-6.8.21.pom
Downloaded: https://repo.maven.apache.org/maven2/org/testng/testng/6.8.21/testng-6.8.21.pom
(8 KB at 398.5 KB/sec)
Downloading: https://repo.maven.apache.org/maven2/org/assertj/assertj-core/1.7.0/assertj-core-1.7.0.pom
Downloaded: https://repo.maven.apache.org/maven2/org/assertj/assertj-core/1.7.0/assertj-core-1.7.0.pom
(5 KB at 281.8 KB/sec)
Downloading: https://repo.maven.apache.org/maven2/org/assertj/assertj-parent-pom/1.2.6/assertj-parent-pom-1.2.6.pom
Downloaded: https://repo.maven.apache.org/maven2/org/assertj/assertj-parent-pom/1.2.6/assertj-parent-pom-1.2.6.pom
(14 KB at 769.9 KB/sec)
Downloading: https://repo.maven.apache.org/maven2/org/assertj/assertj-guava/1.3.0/assertj-guava-1.3.0.pom
Downloaded: https://repo.maven.apache.org/maven2/org/assertj/assertj-guava/1.3.0/assertj-guava-1.3.0.pom
(4 KB at 10.6 KB/sec)
Downloading: https://repository.apache.org/content/repositories/snapshots/org/apache/jclouds/jclouds-core/2.3.0-SNAPSHOT/jclouds-core-2.3.0-20200217.143448-13.jar
Downloading: https://repository.apache.org/content/repositories/snapshots/org/apache/jclouds/jclouds-gson/2.3.0-SNAPSHOT/jclouds-gson-2.3.0-20200217.143117-13.jar
Downloading: https://repository.apache.org/content/repositories/snapshots/org/apache/jclouds/jclouds-core/2.3.0-SNAPSHOT/jclouds-core-2.3.0-20200217.143448-13-tests.jar
Downloading: https://repository.apache.org/content/repositories/snapshots/org/apache/jclouds/jclouds-scriptbuilder/2.3.0-SNAPSHOT/jclouds-scriptbuilder-2.3.0-20200217.143822-13.jar
Downloading: https://repository.apache.org/content/repositories/snapshots/org/apache/jclouds/jclouds-scriptbuilder/2.3.0-SNAPSHOT/jclouds-scriptbuilder-2.3.0-20200217.143822-13-tests.jar
Downloaded: https://repository.apache.org/content/repositories/snapshots/org/apache/jclouds/jclouds-scriptbuilder/2.3.0-SNAPSHOT/jclouds-scriptbuilder-2.3.0-20200217.143822-13.jar
(170 KB at 166.4 KB/sec)
Downloading: https://repository.apache.org/content/repositories/snapshots/org/apache/jclouds/jclouds-blobstore/2.3.0-SNAPSHOT/jclouds-blobstore-2.3.0-20200217.144152-13.jar
Downloaded: https://repository.apache.org/content/repositories/snapshots/org/apache/jclouds/jclouds-scriptbuilder/2.3.0-SNAPSHOT/jclouds-scriptbuilder-2.3.0-20200217.143822-13-tests.jar
(102 KB at 98.0 KB/sec)
Downloading: https://repository.apache.org/content/repositories/snapshots/org/apache/jclouds/driver/jclouds-slf4j/2.3.0-SNAPSHOT/jclouds-slf4j-2.3.0-20200217.143522-13.jar
Downloaded: https://repository.apache.org/content/repositories/snapshots/org/apache/jclouds/jclouds-gson/2.3.0-SNAPSHOT/jclouds-gson-2.3.0-20200217.143117-13.jar
(248 KB at 228.5 KB/sec)
Downloaded: https://repository.apache.org/content/repositories/snapshots/org/apache/jclouds/jclouds-core/2.3.0-SNAPSHOT/jclouds-core-2.3.0-20200217.143448-13-tests.jar
(601 KB at 512.2 KB/sec)
Downloaded: https://repository.apache.org/content/repositories/snapshots/org/apache/jclouds/jclouds-core/2.3.0-SNAPSHOT/jclouds-core-2.3.0-20200217.143448-13.jar
(740 KB at 585.6 KB/sec)
Downloaded: https://repository.apache.org/content/repositories/snapshots/org/apache/jclouds/driver/jclouds-slf4j/2.3.0-SNAPSHOT/jclouds-slf4j-2.3.0-20200217.143522-13.jar
(12 KB at 14.0 KB/sec)
Downloaded: https://repository.apache.org/content/repositories/snapshots/org/apache/jclouds/jclouds-blobstore/2.3.0-SNAPSHOT/jclouds-blobstore-2.3.0-20200217.144152-13.jar
(191 KB at 172.7 KB/sec)
Downloading: https://repo.maven.apache.org/maven2/com/google/inject/extensions/guice-multibindings/3.0/guice-multibindings-3.0.jar
Downloading: https://repo.maven.apache.org/maven2/org/slf4j/slf4j-api/1.7.2/slf4j-api-1.7.2.jar
Downloading: https://repo.maven.apache.org/maven2/com/google/auto/service/auto-service/1.0-rc3/auto-service-1.0-rc3.jar
Downloading: https://repo.maven.apache.org/maven2/com/google/errorprone/error_prone_annotations/2.1.0/error_prone_annotations-2.1.0.jar
Downloading: https://repo.maven.apache.org/maven2/com/google/auto/auto-common/0.3/auto-common-0.3.jar
Downloaded: https://repo.maven.apache.org/maven2/com/google/auto/service/auto-service/1.0-rc3/auto-service-1.0-rc3.jar
(11 KB at 603.6 KB/sec)
Downloading: https://repo.maven.apache.org/maven2/org/testng/testng/6.8.21/testng-6.8.21.jar
Downloaded: https://repo.maven.apache.org/maven2/com/google/errorprone/error_prone_annotations/2.1.0/error_prone_annotations-2.1.0.jar
(12 KB at 407.3 KB/sec)
Downloading: https://repo.maven.apache.org/maven2/org/assertj/assertj-core/1.7.0/assertj-core-1.7.0.jar
Downloaded: https://repo.maven.apache.org/maven2/org/slf4j/slf4j-api/1.7.2/slf4j-api-1.7.2.jar
(26 KB at 849.1 KB/sec)
Downloading: https://repo.maven.apache.org/maven2/org/assertj/assertj-guava/1.3.0/assertj-guava-1.3.0.jar
Downloaded: https://repo.maven.apache.org/maven2/com/google/inject/extensions/guice-multibindings/3.0/guice-multibindings-3.0.jar
(34 KB at 1052.0 KB/sec)
Downloaded: https://repo.maven.apache.org/maven2/com/google/auto/auto-common/0.3/auto-common-0.3.jar
(39 KB at 1119.8 KB/sec)
Downloaded: https://repo.maven.apache.org/maven2/org/assertj/assertj-core/1.7.0/assertj-core-1.7.0.jar
(605 KB at 10604.1 KB/sec)
Downloaded: https://repo.maven.apache.org/maven2/org/testng/testng/6.8.21/testng-6.8.21.jar
(818 KB at 9965.8 KB/sec)
Downloaded: https://repo.maven.apache.org/maven2/org/assertj/assertj-guava/1.3.0/assertj-guava-1.3.0.jar
(27 KB at 79.6 KB/sec)
[INFO] 
[INFO] --- maven-clean-plugin:2.5:clean (default-clean) @ chef ---
[INFO] 
[INFO] --- maven-enforcer-plugin:1.1.1:enforce (enforce-banned-dependencies) @ chef ---
Downloading: https://repo.maven.apache.org/maven2/org/apache/maven/enforcer/enforcer-api/1.1.1/enforcer-api-1.1.1.pom
Downloaded: https://repo.maven.apache.org/maven2/org/apache/maven/enforcer/enforcer-api/1.1.1/enforcer-api-1.1.1.pom
(4 KB at 172.9 KB/sec)
Downloading: https://repo.maven.apache.org/maven2/org/apache/maven/enforcer/enforcer-rules/1.1.1/enforcer-rules-1.1.1.pom
Downloaded: https://repo.maven.apache.org/maven2/org/apache/maven/enforcer/enforcer-rules/1.1.1/enforcer-rules-1.1.1.pom
(4 KB at 261.6 KB/sec)
Downloading: https://repo.maven.apache.org/maven2/org/apache/maven/shared/maven-common-artifact-filters/1.2/maven-common-artifact-filters-1.2.pom
Downloaded: https://repo.maven.apache.org/maven2/org/apache/maven/shared/maven-common-artifact-filters/1.2/maven-common-artifact-filters-1.2.pom
(5 KB at 275.9 KB/sec)
Downloading: https://repo.maven.apache.org/maven2/org/apache/maven/doxia/doxia-sink-api/1.0-alpha-10/doxia-sink-api-1.0-alpha-10.jar
Downloading: https://repo.maven.apache.org/maven2/org/apache/maven/enforcer/enforcer-api/1.1.1/enforcer-api-1.1.1.jar
Downloading: https://repo.maven.apache.org/maven2/org/apache/maven/enforcer/enforcer-rules/1.1.1/enforcer-rules-1.1.1.jar
Downloading: https://repo.maven.apache.org/maven2/org/apache/maven/shared/maven-common-artifact-filters/1.2/maven-common-artifact-filters-1.2.jar
Downloaded: https://repo.maven.apache.org/maven2/org/apache/maven/doxia/doxia-sink-api/1.0-alpha-10/doxia-sink-api-1.0-alpha-10.jar
(10 KB at 604.7 KB/sec)
Downloaded: https://repo.maven.apache.org/maven2/org/apache/maven/shared/maven-common-artifact-filters/1.2/maven-common-artifact-filters-1.2.jar
(31 KB at 1928.6 KB/sec)
Downloaded: https://repo.maven.apache.org/maven2/org/apache/maven/enforcer/enforcer-rules/1.1.1/enforcer-rules-1.1.1.jar
(68 KB at 2954.1 KB/sec)
Downloaded: https://repo.maven.apache.org/maven2/org/apache/maven/enforcer/enforcer-api/1.1.1/enforcer-api-1.1.1.jar
(10 KB at 33.3 KB/sec)
[INFO] 
[INFO] --- maven-enforcer-plugin:1.1.1:enforce (enforce-java) @ chef ---
[INFO] 
[INFO] --- maven-toolchains-plugin:1.1:toolchain (default) @ chef ---
[INFO] Required toolchain: jdk [ version='1.7' ]
[ERROR] No toolchain matched from 10 found for type jdk
[ERROR] Cannot find matching toolchain definitions for the following toolchain types:
jdk [ version='1.7' ]
[JENKINS] Archiving disabled
[INFO] ------------------------------------------------------------------------
[INFO] BUILD FAILURE
[INFO] ------------------------------------------------------------------------
[INFO] Total time: 04:33 min
[INFO] Finished at: 2020-02-26T08:52:02Z
[INFO] ------------------------------------------------------------------------
[JENKINS] Archiving disabled
[ERROR] Failed to execute goal org.apache.maven.plugins:maven-toolchains-plugin:1.1:toolchain
(default) on project chef: Cannot find matching toolchain definitions for the following toolchain
types:
[ERROR] jdk [ version='1.7' ]
[ERROR] Please make sure you define the required toolchains in your ~/.m2/toolchains.xml file.
[ERROR] -> [Help 1]
[ERROR] 
[ERROR] To see the full stack trace of the errors, re-run Maven with the -e switch.
[ERROR] Re-run Maven using the -X switch to enable full debug logging.
[ERROR] 
[ERROR] For more information about the errors and possible solutions, please read the following
articles:
[ERROR] [Help 1] http://cwiki.apache.org/confluence/display/MAVEN/MojoFailureException
channel stopped

Mime
View raw message