jclouds-notifications mailing list archives

Site index · List index
Message view « Date » · « Thread »
Top « Date » · « Thread »
From Apache Jenkins Server <jenk...@builds.apache.org>
Subject Build failed in Jenkins: jclouds-with-credentials » jclouds-google-compute-engine-live-tests #68
Date Mon, 24 Feb 2020 09:36:05 GMT
See <https://builds.apache.org/job/jclouds-with-credentials/job/jclouds-google-compute-engine-live-tests/68/display/redirect?page=changes>

Changes:

[github] JCLOUDS-1533 - Fix upload with SAS token when blob name contains slash


------------------------------------------
[...truncated 115.77 KB...]
Downloading: https://repo.maven.apache.org/maven2/org/apache/maven/plugins/maven-site-plugin/3.3/maven-site-plugin-3.3.jar
Downloaded: https://repo.maven.apache.org/maven2/org/apache/maven/plugins/maven-site-plugin/3.3/maven-site-plugin-3.3.jar
(122 KB at 2335.4 KB/sec)
Downloading: https://repo.maven.apache.org/maven2/org/apache/maven/plugins/maven-enforcer-plugin/1.1.1/maven-enforcer-plugin-1.1.1.pom
Downloaded: https://repo.maven.apache.org/maven2/org/apache/maven/plugins/maven-enforcer-plugin/1.1.1/maven-enforcer-plugin-1.1.1.pom
(7 KB at 22.8 KB/sec)
Downloading: https://repo.maven.apache.org/maven2/org/apache/maven/enforcer/enforcer/1.1.1/enforcer-1.1.1.pom
Downloaded: https://repo.maven.apache.org/maven2/org/apache/maven/enforcer/enforcer/1.1.1/enforcer-1.1.1.pom
(12 KB at 504.4 KB/sec)
Downloading: https://repo.maven.apache.org/maven2/org/apache/maven/plugins/maven-enforcer-plugin/1.1.1/maven-enforcer-plugin-1.1.1.jar
Downloaded: https://repo.maven.apache.org/maven2/org/apache/maven/plugins/maven-enforcer-plugin/1.1.1/maven-enforcer-plugin-1.1.1.jar
(22 KB at 968.8 KB/sec)
Downloading: https://repo.maven.apache.org/maven2/org/apache/maven/plugins/maven-toolchains-plugin/1.1/maven-toolchains-plugin-1.1.pom
Downloaded: https://repo.maven.apache.org/maven2/org/apache/maven/plugins/maven-toolchains-plugin/1.1/maven-toolchains-plugin-1.1.pom
(4 KB at 192.0 KB/sec)
Downloading: https://repo.maven.apache.org/maven2/org/apache/maven/plugins/maven-plugins/26/maven-plugins-26.pom
Downloaded: https://repo.maven.apache.org/maven2/org/apache/maven/plugins/maven-plugins/26/maven-plugins-26.pom
(12 KB at 504.7 KB/sec)
Downloading: https://repo.maven.apache.org/maven2/org/apache/maven/plugins/maven-toolchains-plugin/1.1/maven-toolchains-plugin-1.1.jar
Downloaded: https://repo.maven.apache.org/maven2/org/apache/maven/plugins/maven-toolchains-plugin/1.1/maven-toolchains-plugin-1.1.jar
(25 KB at 1110.1 KB/sec)
Downloading: https://repo.maven.apache.org/maven2/org/apache/maven/plugins/maven-compiler-plugin/3.8.0/maven-compiler-plugin-3.8.0.pom
Downloaded: https://repo.maven.apache.org/maven2/org/apache/maven/plugins/maven-compiler-plugin/3.8.0/maven-compiler-plugin-3.8.0.pom
(13 KB at 505.9 KB/sec)
Downloading: https://repo.maven.apache.org/maven2/org/apache/maven/plugins/maven-compiler-plugin/3.8.0/maven-compiler-plugin-3.8.0.jar
Downloaded: https://repo.maven.apache.org/maven2/org/apache/maven/plugins/maven-compiler-plugin/3.8.0/maven-compiler-plugin-3.8.0.jar
(61 KB at 2240.1 KB/sec)
Downloading: https://repo.maven.apache.org/maven2/org/apache/maven/plugins/maven-surefire-plugin/2.17/maven-surefire-plugin-2.17.pom
Downloaded: https://repo.maven.apache.org/maven2/org/apache/maven/plugins/maven-surefire-plugin/2.17/maven-surefire-plugin-2.17.pom
(5 KB at 244.2 KB/sec)
Downloading: https://repo.maven.apache.org/maven2/org/apache/maven/surefire/surefire/2.17/surefire-2.17.pom
Downloaded: https://repo.maven.apache.org/maven2/org/apache/maven/surefire/surefire/2.17/surefire-2.17.pom
(17 KB at 676.1 KB/sec)
Downloading: https://repo.maven.apache.org/maven2/org/apache/maven/plugins/maven-surefire-plugin/2.17/maven-surefire-plugin-2.17.jar
Downloaded: https://repo.maven.apache.org/maven2/org/apache/maven/plugins/maven-surefire-plugin/2.17/maven-surefire-plugin-2.17.jar
(34 KB at 1152.7 KB/sec)
Downloading: https://repo.maven.apache.org/maven2/org/codehaus/mojo/animal-sniffer-maven-plugin/1.16/animal-sniffer-maven-plugin-1.16.pom
Downloaded: https://repo.maven.apache.org/maven2/org/codehaus/mojo/animal-sniffer-maven-plugin/1.16/animal-sniffer-maven-plugin-1.16.pom
(6 KB at 261.6 KB/sec)
Downloading: https://repo.maven.apache.org/maven2/org/codehaus/mojo/animal-sniffer-parent/1.16/animal-sniffer-parent-1.16.pom
Downloaded: https://repo.maven.apache.org/maven2/org/codehaus/mojo/animal-sniffer-parent/1.16/animal-sniffer-parent-1.16.pom
(6 KB at 246.8 KB/sec)
Downloading: https://repo.maven.apache.org/maven2/org/codehaus/mojo/mojo-parent/36/mojo-parent-36.pom
Downloaded: https://repo.maven.apache.org/maven2/org/codehaus/mojo/mojo-parent/36/mojo-parent-36.pom
(28 KB at 1166.4 KB/sec)
Downloading: https://repo.maven.apache.org/maven2/org/codehaus/mojo/animal-sniffer-maven-plugin/1.16/animal-sniffer-maven-plugin-1.16.jar
Downloaded: https://repo.maven.apache.org/maven2/org/codehaus/mojo/animal-sniffer-maven-plugin/1.16/animal-sniffer-maven-plugin-1.16.jar
(33 KB at 1281.7 KB/sec)
Downloading: https://repo.maven.apache.org/maven2/org/basepom/maven/duplicate-finder-maven-plugin/1.1.2/duplicate-finder-maven-plugin-1.1.2.pom
Downloaded: https://repo.maven.apache.org/maven2/org/basepom/maven/duplicate-finder-maven-plugin/1.1.2/duplicate-finder-maven-plugin-1.1.2.pom
(20 KB at 45.7 KB/sec)
Downloading: https://repo.maven.apache.org/maven2/org/basepom/basepom-standard-oss/11/basepom-standard-oss-11.pom
Downloaded: https://repo.maven.apache.org/maven2/org/basepom/basepom-standard-oss/11/basepom-standard-oss-11.pom
(10 KB at 463.4 KB/sec)
Downloading: https://repo.maven.apache.org/maven2/org/basepom/basepom-standard/11/basepom-standard-11.pom
Downloaded: https://repo.maven.apache.org/maven2/org/basepom/basepom-standard/11/basepom-standard-11.pom
(43 KB at 1692.8 KB/sec)
Downloading: https://repo.maven.apache.org/maven2/org/basepom/basepom-foundation/11/basepom-foundation-11.pom
Downloaded: https://repo.maven.apache.org/maven2/org/basepom/basepom-foundation/11/basepom-foundation-11.pom
(46 KB at 170.1 KB/sec)
Downloading: https://repo.maven.apache.org/maven2/org/basepom/maven/duplicate-finder-maven-plugin/1.1.2/duplicate-finder-maven-plugin-1.1.2.jar
Downloaded: https://repo.maven.apache.org/maven2/org/basepom/maven/duplicate-finder-maven-plugin/1.1.2/duplicate-finder-maven-plugin-1.1.2.jar
(73 KB at 181.6 KB/sec)
Downloading: https://repo.maven.apache.org/maven2/org/gaul/modernizer-maven-plugin/1.8.0/modernizer-maven-plugin-1.8.0.pom
Downloaded: https://repo.maven.apache.org/maven2/org/gaul/modernizer-maven-plugin/1.8.0/modernizer-maven-plugin-1.8.0.pom
(4 KB at 20.1 KB/sec)
Downloading: https://repo.maven.apache.org/maven2/org/gaul/modernizer-maven-parent/1.8.0/modernizer-maven-parent-1.8.0.pom
Downloaded: https://repo.maven.apache.org/maven2/org/gaul/modernizer-maven-parent/1.8.0/modernizer-maven-parent-1.8.0.pom
(9 KB at 41.8 KB/sec)
Downloading: https://repo.maven.apache.org/maven2/org/gaul/modernizer-maven-plugin/1.8.0/modernizer-maven-plugin-1.8.0.jar
Downloaded: https://repo.maven.apache.org/maven2/org/gaul/modernizer-maven-plugin/1.8.0/modernizer-maven-plugin-1.8.0.jar
(36 KB at 1409.1 KB/sec)
Downloading: https://repository.apache.org/content/repositories/snapshots/org/apache/jclouds/jclouds-core/2.3.0-SNAPSHOT/maven-metadata.xml
Downloading: http://repository.apache.org/snapshots/org/apache/jclouds/jclouds-core/2.3.0-SNAPSHOT/maven-metadata.xml
Downloaded: http://repository.apache.org/snapshots/org/apache/jclouds/jclouds-core/2.3.0-SNAPSHOT/maven-metadata.xml
(2 KB at 4.6 KB/sec)
Downloaded: https://repository.apache.org/content/repositories/snapshots/org/apache/jclouds/jclouds-core/2.3.0-SNAPSHOT/maven-metadata.xml
(2 KB at 1.8 KB/sec)
Downloading: https://repository.apache.org/content/repositories/snapshots/org/apache/jclouds/jclouds-core/2.3.0-SNAPSHOT/jclouds-core-2.3.0-20200217.143448-13.pom
Downloaded: https://repository.apache.org/content/repositories/snapshots/org/apache/jclouds/jclouds-core/2.3.0-SNAPSHOT/jclouds-core-2.3.0-20200217.143448-13.pom
(6 KB at 6.6 KB/sec)
Downloading: https://repository.apache.org/content/repositories/snapshots/org/apache/jclouds/jclouds-gson/2.3.0-SNAPSHOT/maven-metadata.xml
Downloading: http://repository.apache.org/snapshots/org/apache/jclouds/jclouds-gson/2.3.0-SNAPSHOT/maven-metadata.xml
Downloaded: http://repository.apache.org/snapshots/org/apache/jclouds/jclouds-gson/2.3.0-SNAPSHOT/maven-metadata.xml
(2 KB at 4.0 KB/sec)
Downloaded: https://repository.apache.org/content/repositories/snapshots/org/apache/jclouds/jclouds-gson/2.3.0-SNAPSHOT/maven-metadata.xml
(2 KB at 1.7 KB/sec)
Downloading: https://repository.apache.org/content/repositories/snapshots/org/apache/jclouds/jclouds-gson/2.3.0-SNAPSHOT/jclouds-gson-2.3.0-20200217.143117-13.pom
Downloaded: https://repository.apache.org/content/repositories/snapshots/org/apache/jclouds/jclouds-gson/2.3.0-SNAPSHOT/jclouds-gson-2.3.0-20200217.143117-13.pom
(2 KB at 2.4 KB/sec)
Downloading: https://repo.maven.apache.org/maven2/com/google/errorprone/error_prone_annotations/2.1.0/error_prone_annotations-2.1.0.pom
Downloaded: https://repo.maven.apache.org/maven2/com/google/errorprone/error_prone_annotations/2.1.0/error_prone_annotations-2.1.0.pom
(2 KB at 76.3 KB/sec)
Downloading: https://repo.maven.apache.org/maven2/com/google/errorprone/error_prone_parent/2.1.0/error_prone_parent-2.1.0.pom
Downloaded: https://repo.maven.apache.org/maven2/com/google/errorprone/error_prone_parent/2.1.0/error_prone_parent-2.1.0.pom
(5 KB at 225.1 KB/sec)
Downloading: https://repository.apache.org/content/repositories/snapshots/org/apache/jclouds/driver/jclouds-bouncycastle/2.3.0-SNAPSHOT/maven-metadata.xml
Downloading: http://repository.apache.org/snapshots/org/apache/jclouds/driver/jclouds-bouncycastle/2.3.0-SNAPSHOT/maven-metadata.xml
Downloaded: http://repository.apache.org/snapshots/org/apache/jclouds/driver/jclouds-bouncycastle/2.3.0-SNAPSHOT/maven-metadata.xml
(2 KB at 4.7 KB/sec)
Downloaded: https://repository.apache.org/content/repositories/snapshots/org/apache/jclouds/driver/jclouds-bouncycastle/2.3.0-SNAPSHOT/maven-metadata.xml
(2 KB at 2.0 KB/sec)
Downloading: https://repository.apache.org/content/repositories/snapshots/org/apache/jclouds/driver/jclouds-bouncycastle/2.3.0-SNAPSHOT/jclouds-bouncycastle-2.3.0-20200217.144311-13.pom
Downloaded: https://repository.apache.org/content/repositories/snapshots/org/apache/jclouds/driver/jclouds-bouncycastle/2.3.0-SNAPSHOT/jclouds-bouncycastle-2.3.0-20200217.144311-13.pom
(3 KB at 2.9 KB/sec)
Downloading: https://repo.maven.apache.org/maven2/org/bouncycastle/bcprov-ext-jdk15on/1.60/bcprov-ext-jdk15on-1.60.pom
Downloaded: https://repo.maven.apache.org/maven2/org/bouncycastle/bcprov-ext-jdk15on/1.60/bcprov-ext-jdk15on-1.60.pom
(2 KB at 58.8 KB/sec)
Downloading: https://repository.apache.org/content/repositories/snapshots/org/apache/jclouds/common/googlecloud/2.3.0-SNAPSHOT/maven-metadata.xml
Downloading: http://repository.apache.org/snapshots/org/apache/jclouds/common/googlecloud/2.3.0-SNAPSHOT/maven-metadata.xml
Downloaded: http://repository.apache.org/snapshots/org/apache/jclouds/common/googlecloud/2.3.0-SNAPSHOT/maven-metadata.xml
(2 KB at 4.8 KB/sec)
Downloaded: https://repository.apache.org/content/repositories/snapshots/org/apache/jclouds/common/googlecloud/2.3.0-SNAPSHOT/maven-metadata.xml
(2 KB at 2.0 KB/sec)
Downloading: https://repository.apache.org/content/repositories/snapshots/org/apache/jclouds/common/googlecloud/2.3.0-SNAPSHOT/googlecloud-2.3.0-20200217.143631-13.pom
Downloaded: https://repository.apache.org/content/repositories/snapshots/org/apache/jclouds/common/googlecloud/2.3.0-SNAPSHOT/googlecloud-2.3.0-20200217.143631-13.pom
(3 KB at 3.3 KB/sec)
Downloading: https://repository.apache.org/content/repositories/snapshots/org/apache/jclouds/api/oauth/2.3.0-SNAPSHOT/maven-metadata.xml
Downloading: http://repository.apache.org/snapshots/org/apache/jclouds/api/oauth/2.3.0-SNAPSHOT/maven-metadata.xml
Downloaded: http://repository.apache.org/snapshots/org/apache/jclouds/api/oauth/2.3.0-SNAPSHOT/maven-metadata.xml
(2 KB at 4.9 KB/sec)
Downloaded: https://repository.apache.org/content/repositories/snapshots/org/apache/jclouds/api/oauth/2.3.0-SNAPSHOT/maven-metadata.xml
(2 KB at 1.9 KB/sec)
Downloading: https://repository.apache.org/content/repositories/snapshots/org/apache/jclouds/api/oauth/2.3.0-SNAPSHOT/oauth-2.3.0-20200217.143558-13.pom
Downloaded: https://repository.apache.org/content/repositories/snapshots/org/apache/jclouds/api/oauth/2.3.0-SNAPSHOT/oauth-2.3.0-20200217.143558-13.pom
(6 KB at 6.2 KB/sec)
Downloading: http://repository.apache.org/snapshots/org/apache/jclouds/jclouds-compute/2.3.0-SNAPSHOT/maven-metadata.xml
Downloading: https://repository.apache.org/content/repositories/snapshots/org/apache/jclouds/jclouds-compute/2.3.0-SNAPSHOT/maven-metadata.xml
Downloaded: http://repository.apache.org/snapshots/org/apache/jclouds/jclouds-compute/2.3.0-SNAPSHOT/maven-metadata.xml
(2 KB at 4.8 KB/sec)
Downloaded: https://repository.apache.org/content/repositories/snapshots/org/apache/jclouds/jclouds-compute/2.3.0-SNAPSHOT/maven-metadata.xml
(2 KB at 2.0 KB/sec)
Downloading: https://repository.apache.org/content/repositories/snapshots/org/apache/jclouds/jclouds-compute/2.3.0-SNAPSHOT/jclouds-compute-2.3.0-20200217.143945-13.pom
Downloaded: https://repository.apache.org/content/repositories/snapshots/org/apache/jclouds/jclouds-compute/2.3.0-SNAPSHOT/jclouds-compute-2.3.0-20200217.143945-13.pom
(3 KB at 3.3 KB/sec)
Downloading: https://repository.apache.org/content/repositories/snapshots/org/apache/jclouds/jclouds-scriptbuilder/2.3.0-SNAPSHOT/maven-metadata.xml
Downloading: http://repository.apache.org/snapshots/org/apache/jclouds/jclouds-scriptbuilder/2.3.0-SNAPSHOT/maven-metadata.xml
Downloaded: http://repository.apache.org/snapshots/org/apache/jclouds/jclouds-scriptbuilder/2.3.0-SNAPSHOT/maven-metadata.xml
(2 KB at 4.8 KB/sec)
Downloaded: https://repository.apache.org/content/repositories/snapshots/org/apache/jclouds/jclouds-scriptbuilder/2.3.0-SNAPSHOT/maven-metadata.xml
(2 KB at 2.0 KB/sec)
Downloading: https://repository.apache.org/content/repositories/snapshots/org/apache/jclouds/jclouds-scriptbuilder/2.3.0-SNAPSHOT/jclouds-scriptbuilder-2.3.0-20200217.143822-13.pom
Downloaded: https://repository.apache.org/content/repositories/snapshots/org/apache/jclouds/jclouds-scriptbuilder/2.3.0-SNAPSHOT/jclouds-scriptbuilder-2.3.0-20200217.143822-13.pom
(3 KB at 3.3 KB/sec)
Downloading: https://repo.maven.apache.org/maven2/com/google/auto/service/auto-service/1.0-rc3/auto-service-1.0-rc3.pom
Downloaded: https://repo.maven.apache.org/maven2/com/google/auto/service/auto-service/1.0-rc3/auto-service-1.0-rc3.pom
(3 KB at 174.5 KB/sec)
Downloading: https://repo.maven.apache.org/maven2/com/google/auto/value/auto-value/1.4.1/auto-value-1.4.1.pom
Downloaded: https://repo.maven.apache.org/maven2/com/google/auto/value/auto-value/1.4.1/auto-value-1.4.1.pom
(7 KB at 31.5 KB/sec)
Downloading: http://repository.apache.org/snapshots/org/apache/jclouds/driver/jclouds-slf4j/2.3.0-SNAPSHOT/maven-metadata.xml
Downloading: https://repository.apache.org/content/repositories/snapshots/org/apache/jclouds/driver/jclouds-slf4j/2.3.0-SNAPSHOT/maven-metadata.xml
Downloaded: http://repository.apache.org/snapshots/org/apache/jclouds/driver/jclouds-slf4j/2.3.0-SNAPSHOT/maven-metadata.xml
(2 KB at 4.9 KB/sec)
Downloaded: https://repository.apache.org/content/repositories/snapshots/org/apache/jclouds/driver/jclouds-slf4j/2.3.0-SNAPSHOT/maven-metadata.xml
(2 KB at 2.0 KB/sec)
Downloading: https://repository.apache.org/content/repositories/snapshots/org/apache/jclouds/driver/jclouds-slf4j/2.3.0-SNAPSHOT/jclouds-slf4j-2.3.0-20200217.143522-13.pom
Downloaded: https://repository.apache.org/content/repositories/snapshots/org/apache/jclouds/driver/jclouds-slf4j/2.3.0-SNAPSHOT/jclouds-slf4j-2.3.0-20200217.143522-13.pom
(3 KB at 3.0 KB/sec)
Downloading: https://repo.maven.apache.org/maven2/org/slf4j/slf4j-api/1.7.2/slf4j-api-1.7.2.pom
Downloaded: https://repo.maven.apache.org/maven2/org/slf4j/slf4j-api/1.7.2/slf4j-api-1.7.2.pom
(3 KB at 154.5 KB/sec)
Downloading: https://repo.maven.apache.org/maven2/org/slf4j/slf4j-parent/1.7.2/slf4j-parent-1.7.2.pom
Downloaded: https://repo.maven.apache.org/maven2/org/slf4j/slf4j-parent/1.7.2/slf4j-parent-1.7.2.pom
(12 KB at 640.4 KB/sec)
Downloading: http://repository.apache.org/snapshots/org/apache/jclouds/driver/jclouds-sshj/2.3.0-SNAPSHOT/maven-metadata.xml
Downloading: https://repository.apache.org/content/repositories/snapshots/org/apache/jclouds/driver/jclouds-sshj/2.3.0-SNAPSHOT/maven-metadata.xml
Downloaded: http://repository.apache.org/snapshots/org/apache/jclouds/driver/jclouds-sshj/2.3.0-SNAPSHOT/maven-metadata.xml
(2 KB at 4.8 KB/sec)
Downloaded: https://repository.apache.org/content/repositories/snapshots/org/apache/jclouds/driver/jclouds-sshj/2.3.0-SNAPSHOT/maven-metadata.xml
(2 KB at 2.0 KB/sec)
Downloading: https://repository.apache.org/content/repositories/snapshots/org/apache/jclouds/driver/jclouds-sshj/2.3.0-SNAPSHOT/jclouds-sshj-2.3.0-20200217.144348-13.pom
Downloaded: https://repository.apache.org/content/repositories/snapshots/org/apache/jclouds/driver/jclouds-sshj/2.3.0-SNAPSHOT/jclouds-sshj-2.3.0-20200217.144348-13.pom
(6 KB at 6.7 KB/sec)
Downloading: https://repo.maven.apache.org/maven2/com/hierynomus/sshj/0.27.0/sshj-0.27.0.pom
Downloaded: https://repo.maven.apache.org/maven2/com/hierynomus/sshj/0.27.0/sshj-0.27.0.pom
(3 KB at 161.0 KB/sec)
Downloading: https://repo.maven.apache.org/maven2/com/jcraft/jzlib/1.1.3/jzlib-1.1.3.pom
Downloaded: https://repo.maven.apache.org/maven2/com/jcraft/jzlib/1.1.3/jzlib-1.1.3.pom (4
KB at 168.9 KB/sec)
Downloading: https://repo.maven.apache.org/maven2/net/i2p/crypto/eddsa/0.2.0/eddsa-0.2.0.pom
Downloaded: https://repo.maven.apache.org/maven2/net/i2p/crypto/eddsa/0.2.0/eddsa-0.2.0.pom
(7 KB at 321.9 KB/sec)
Downloading: https://repo.maven.apache.org/maven2/com/jcraft/jsch.agentproxy.sshj/0.0.9/jsch.agentproxy.sshj-0.0.9.pom
Downloaded: https://repo.maven.apache.org/maven2/com/jcraft/jsch.agentproxy.sshj/0.0.9/jsch.agentproxy.sshj-0.0.9.pom
(2 KB at 62.9 KB/sec)
Downloading: https://repository.apache.org/content/repositories/snapshots/org/apache/jclouds/driver/jclouds-okhttp/2.3.0-SNAPSHOT/maven-metadata.xml
Downloading: http://repository.apache.org/snapshots/org/apache/jclouds/driver/jclouds-okhttp/2.3.0-SNAPSHOT/maven-metadata.xml
Downloaded: http://repository.apache.org/snapshots/org/apache/jclouds/driver/jclouds-okhttp/2.3.0-SNAPSHOT/maven-metadata.xml
(2 KB at 4.6 KB/sec)
Downloaded: https://repository.apache.org/content/repositories/snapshots/org/apache/jclouds/driver/jclouds-okhttp/2.3.0-SNAPSHOT/maven-metadata.xml
(2 KB at 2.0 KB/sec)
Downloading: https://repository.apache.org/content/repositories/snapshots/org/apache/jclouds/driver/jclouds-okhttp/2.3.0-SNAPSHOT/jclouds-okhttp-2.3.0-20200217.144859-13.pom
Downloaded: https://repository.apache.org/content/repositories/snapshots/org/apache/jclouds/driver/jclouds-okhttp/2.3.0-SNAPSHOT/jclouds-okhttp-2.3.0-20200217.144859-13.pom
(3 KB at 3.0 KB/sec)
Downloading: https://repo.maven.apache.org/maven2/com/squareup/okhttp/okhttp/2.2.0/okhttp-2.2.0.pom
Downloaded: https://repo.maven.apache.org/maven2/com/squareup/okhttp/okhttp/2.2.0/okhttp-2.2.0.pom
(2 KB at 72.7 KB/sec)
Downloading: https://repo.maven.apache.org/maven2/com/squareup/okhttp/parent/2.2.0/parent-2.2.0.pom
Downloaded: https://repo.maven.apache.org/maven2/com/squareup/okhttp/parent/2.2.0/parent-2.2.0.pom
(9 KB at 507.6 KB/sec)
Downloading: https://repo.maven.apache.org/maven2/com/squareup/okio/okio/1.2.0/okio-1.2.0.pom
Downloaded: https://repo.maven.apache.org/maven2/com/squareup/okio/okio/1.2.0/okio-1.2.0.pom
(812 B at 49.6 KB/sec)
Downloading: https://repo.maven.apache.org/maven2/com/squareup/okio/okio-parent/1.2.0/okio-parent-1.2.0.pom
Downloaded: https://repo.maven.apache.org/maven2/com/squareup/okio/okio-parent/1.2.0/okio-parent-1.2.0.pom
(4 KB at 193.1 KB/sec)
Downloading: https://repo.maven.apache.org/maven2/org/slf4j/slf4j-api/1.7.6/slf4j-api-1.7.6.pom
Downloaded: https://repo.maven.apache.org/maven2/org/slf4j/slf4j-api/1.7.6/slf4j-api-1.7.6.pom
(3 KB at 175.1 KB/sec)
Downloading: https://repo.maven.apache.org/maven2/org/slf4j/slf4j-parent/1.7.6/slf4j-parent-1.7.6.pom
Downloaded: https://repo.maven.apache.org/maven2/org/slf4j/slf4j-parent/1.7.6/slf4j-parent-1.7.6.pom
(12 KB at 684.0 KB/sec)
Downloading: https://repo.maven.apache.org/maven2/com/squareup/okhttp/mockwebserver/2.2.0/mockwebserver-2.2.0.pom
Downloaded: https://repo.maven.apache.org/maven2/com/squareup/okhttp/mockwebserver/2.2.0/mockwebserver-2.2.0.pom
(2 KB at 86.5 KB/sec)
Downloading: https://repo.maven.apache.org/maven2/org/testng/testng/6.8.21/testng-6.8.21.pom
Downloaded: https://repo.maven.apache.org/maven2/org/testng/testng/6.8.21/testng-6.8.21.pom
(8 KB at 421.9 KB/sec)
Downloading: https://repo.maven.apache.org/maven2/com/beust/jcommander/1.27/jcommander-1.27.pom
Downloaded: https://repo.maven.apache.org/maven2/com/beust/jcommander/1.27/jcommander-1.27.pom
(8 KB at 413.0 KB/sec)
Downloading: https://repo.maven.apache.org/maven2/org/assertj/assertj-core/1.7.0/assertj-core-1.7.0.pom
Downloaded: https://repo.maven.apache.org/maven2/org/assertj/assertj-core/1.7.0/assertj-core-1.7.0.pom
(5 KB at 265.2 KB/sec)
Downloading: https://repo.maven.apache.org/maven2/org/assertj/assertj-parent-pom/1.2.6/assertj-parent-pom-1.2.6.pom
Downloaded: https://repo.maven.apache.org/maven2/org/assertj/assertj-parent-pom/1.2.6/assertj-parent-pom-1.2.6.pom
(14 KB at 688.8 KB/sec)
Downloading: https://repo.maven.apache.org/maven2/org/assertj/assertj-guava/1.3.0/assertj-guava-1.3.0.pom
Downloaded: https://repo.maven.apache.org/maven2/org/assertj/assertj-guava/1.3.0/assertj-guava-1.3.0.pom
(4 KB at 207.9 KB/sec)
Downloading: https://repository.apache.org/content/repositories/snapshots/org/apache/jclouds/jclouds-core/2.3.0-SNAPSHOT/jclouds-core-2.3.0-20200217.143448-13.jar
Downloading: https://repository.apache.org/content/repositories/snapshots/org/apache/jclouds/jclouds-gson/2.3.0-SNAPSHOT/jclouds-gson-2.3.0-20200217.143117-13.jar
Downloading: https://repository.apache.org/content/repositories/snapshots/org/apache/jclouds/driver/jclouds-bouncycastle/2.3.0-SNAPSHOT/jclouds-bouncycastle-2.3.0-20200217.144311-13.jar
Downloading: https://repository.apache.org/content/repositories/snapshots/org/apache/jclouds/common/googlecloud/2.3.0-SNAPSHOT/googlecloud-2.3.0-20200217.143631-13.jar
Downloading: https://repository.apache.org/content/repositories/snapshots/org/apache/jclouds/api/oauth/2.3.0-SNAPSHOT/oauth-2.3.0-20200217.143558-13.jar
Downloaded: https://repository.apache.org/content/repositories/snapshots/org/apache/jclouds/driver/jclouds-bouncycastle/2.3.0-SNAPSHOT/jclouds-bouncycastle-2.3.0-20200217.144311-13.jar
(11 KB at 12.0 KB/sec)
Downloading: https://repository.apache.org/content/repositories/snapshots/org/apache/jclouds/common/googlecloud/2.3.0-SNAPSHOT/googlecloud-2.3.0-20200217.143631-13-tests.jar
Downloaded: https://repository.apache.org/content/repositories/snapshots/org/apache/jclouds/common/googlecloud/2.3.0-SNAPSHOT/googlecloud-2.3.0-20200217.143631-13.jar
(26 KB at 28.3 KB/sec)
Downloading: https://repository.apache.org/content/repositories/snapshots/org/apache/jclouds/api/oauth/2.3.0-SNAPSHOT/oauth-2.3.0-20200217.143558-13-tests.jar
Downloaded: https://repository.apache.org/content/repositories/snapshots/org/apache/jclouds/api/oauth/2.3.0-SNAPSHOT/oauth-2.3.0-20200217.143558-13.jar
(63 KB at 64.1 KB/sec)
Downloading: https://repository.apache.org/content/repositories/snapshots/org/apache/jclouds/jclouds-compute/2.3.0-SNAPSHOT/jclouds-compute-2.3.0-20200217.143945-13.jar
Downloaded: https://repository.apache.org/content/repositories/snapshots/org/apache/jclouds/jclouds-gson/2.3.0-SNAPSHOT/jclouds-gson-2.3.0-20200217.143117-13.jar
(248 KB at 213.0 KB/sec)
Downloading: https://repository.apache.org/content/repositories/snapshots/org/apache/jclouds/jclouds-scriptbuilder/2.3.0-SNAPSHOT/jclouds-scriptbuilder-2.3.0-20200217.143822-13.jar
Downloaded: https://repository.apache.org/content/repositories/snapshots/org/apache/jclouds/jclouds-core/2.3.0-SNAPSHOT/jclouds-core-2.3.0-20200217.143448-13.jar
(740 KB at 584.7 KB/sec)
Downloading: https://repository.apache.org/content/repositories/snapshots/org/apache/jclouds/jclouds-compute/2.3.0-SNAPSHOT/jclouds-compute-2.3.0-20200217.143945-13-tests.jar
Downloaded: https://repository.apache.org/content/repositories/snapshots/org/apache/jclouds/common/googlecloud/2.3.0-SNAPSHOT/googlecloud-2.3.0-20200217.143631-13-tests.jar
(11 KB at 13.5 KB/sec)
Downloading: https://repository.apache.org/content/repositories/snapshots/org/apache/jclouds/jclouds-core/2.3.0-SNAPSHOT/jclouds-core-2.3.0-20200217.143448-13-tests.jar
Downloaded: https://repository.apache.org/content/repositories/snapshots/org/apache/jclouds/api/oauth/2.3.0-SNAPSHOT/oauth-2.3.0-20200217.143558-13-tests.jar
(27 KB at 30.3 KB/sec)
Downloading: https://repository.apache.org/content/repositories/snapshots/org/apache/jclouds/driver/jclouds-slf4j/2.3.0-SNAPSHOT/jclouds-slf4j-2.3.0-20200217.143522-13.jar
Downloaded: https://repository.apache.org/content/repositories/snapshots/org/apache/jclouds/jclouds-compute/2.3.0-SNAPSHOT/jclouds-compute-2.3.0-20200217.143945-13.jar
(511 KB at 442.6 KB/sec)
Downloading: https://repository.apache.org/content/repositories/snapshots/org/apache/jclouds/driver/jclouds-sshj/2.3.0-SNAPSHOT/jclouds-sshj-2.3.0-20200217.144348-13.jar
Downloaded: https://repository.apache.org/content/repositories/snapshots/org/apache/jclouds/jclouds-scriptbuilder/2.3.0-SNAPSHOT/jclouds-scriptbuilder-2.3.0-20200217.143822-13.jar
(170 KB at 163.2 KB/sec)
Downloading: https://repository.apache.org/content/repositories/snapshots/org/apache/jclouds/driver/jclouds-okhttp/2.3.0-SNAPSHOT/jclouds-okhttp-2.3.0-20200217.144859-13.jar
Downloaded: https://repository.apache.org/content/repositories/snapshots/org/apache/jclouds/jclouds-compute/2.3.0-SNAPSHOT/jclouds-compute-2.3.0-20200217.143945-13-tests.jar
(235 KB at 210.4 KB/sec)
Downloaded: https://repository.apache.org/content/repositories/snapshots/org/apache/jclouds/driver/jclouds-slf4j/2.3.0-SNAPSHOT/jclouds-slf4j-2.3.0-20200217.143522-13.jar
(12 KB at 13.8 KB/sec)
Downloaded: https://repository.apache.org/content/repositories/snapshots/org/apache/jclouds/jclouds-core/2.3.0-SNAPSHOT/jclouds-core-2.3.0-20200217.143448-13-tests.jar
(601 KB at 477.6 KB/sec)
Downloaded: https://repository.apache.org/content/repositories/snapshots/org/apache/jclouds/driver/jclouds-sshj/2.3.0-SNAPSHOT/jclouds-sshj-2.3.0-20200217.144348-13.jar
(39 KB at 44.6 KB/sec)
Downloaded: https://repository.apache.org/content/repositories/snapshots/org/apache/jclouds/driver/jclouds-okhttp/2.3.0-SNAPSHOT/jclouds-okhttp-2.3.0-20200217.144859-13.jar
(18 KB at 19.9 KB/sec)
Downloading: https://repo.maven.apache.org/maven2/org/bouncycastle/bcprov-ext-jdk15on/1.60/bcprov-ext-jdk15on-1.60.jar
Downloading: https://repo.maven.apache.org/maven2/com/google/auto/service/auto-service/1.0-rc3/auto-service-1.0-rc3.jar
Downloading: https://repo.maven.apache.org/maven2/com/google/auto/value/auto-value/1.4.1/auto-value-1.4.1.jar
Downloading: https://repo.maven.apache.org/maven2/org/slf4j/slf4j-api/1.7.2/slf4j-api-1.7.2.jar
Downloading: https://repo.maven.apache.org/maven2/com/hierynomus/sshj/0.27.0/sshj-0.27.0.jar
Downloaded: https://repo.maven.apache.org/maven2/org/slf4j/slf4j-api/1.7.2/slf4j-api-1.7.2.jar
(26 KB at 1340.6 KB/sec)
Downloading: https://repo.maven.apache.org/maven2/com/jcraft/jzlib/1.1.3/jzlib-1.1.3.jar
Downloaded: https://repo.maven.apache.org/maven2/com/google/auto/service/auto-service/1.0-rc3/auto-service-1.0-rc3.jar
(11 KB at 366.5 KB/sec)
Downloading: https://repo.maven.apache.org/maven2/net/i2p/crypto/eddsa/0.2.0/eddsa-0.2.0.jar
Downloaded: https://repo.maven.apache.org/maven2/com/jcraft/jzlib/1.1.3/jzlib-1.1.3.jar (71
KB at 3514.5 KB/sec)
Downloading: https://repo.maven.apache.org/maven2/com/jcraft/jsch.agentproxy.sshj/0.0.9/jsch.agentproxy.sshj-0.0.9.jar
Downloaded: https://repo.maven.apache.org/maven2/net/i2p/crypto/eddsa/0.2.0/eddsa-0.2.0.jar
(61 KB at 2759.7 KB/sec)
Downloading: https://repo.maven.apache.org/maven2/com/squareup/okhttp/okhttp/2.2.0/okhttp-2.2.0.jar
Downloaded: https://repo.maven.apache.org/maven2/com/hierynomus/sshj/0.27.0/sshj-0.27.0.jar
(498 KB at 7006.9 KB/sec)
Downloading: https://repo.maven.apache.org/maven2/com/squareup/okio/okio/1.2.0/okio-1.2.0.jar
Downloaded: https://repo.maven.apache.org/maven2/com/squareup/okhttp/okhttp/2.2.0/okhttp-2.2.0.jar
(304 KB at 7594.3 KB/sec)
Downloading: https://repo.maven.apache.org/maven2/com/squareup/okhttp/mockwebserver/2.2.0/mockwebserver-2.2.0.jar
Downloaded: https://repo.maven.apache.org/maven2/com/squareup/okio/okio/1.2.0/okio-1.2.0.jar
(54 KB at 2550.5 KB/sec)
Downloading: https://repo.maven.apache.org/maven2/com/google/errorprone/error_prone_annotations/2.1.0/error_prone_annotations-2.1.0.jar
Downloaded: https://repo.maven.apache.org/maven2/com/google/errorprone/error_prone_annotations/2.1.0/error_prone_annotations-2.1.0.jar
(12 KB at 738.2 KB/sec)
Downloading: https://repo.maven.apache.org/maven2/org/testng/testng/6.8.21/testng-6.8.21.jar
Downloaded: https://repo.maven.apache.org/maven2/org/testng/testng/6.8.21/testng-6.8.21.jar
(818 KB at 9393.0 KB/sec)
Downloading: https://repo.maven.apache.org/maven2/com/beust/jcommander/1.27/jcommander-1.27.jar
Downloaded: https://repo.maven.apache.org/maven2/com/beust/jcommander/1.27/jcommander-1.27.jar
(55 KB at 2714.1 KB/sec)
Downloading: https://repo.maven.apache.org/maven2/org/assertj/assertj-core/1.7.0/assertj-core-1.7.0.jar
Downloaded: https://repo.maven.apache.org/maven2/com/jcraft/jsch.agentproxy.sshj/0.0.9/jsch.agentproxy.sshj-0.0.9.jar
(4 KB at 17.0 KB/sec)
Downloading: https://repo.maven.apache.org/maven2/org/assertj/assertj-guava/1.3.0/assertj-guava-1.3.0.jar
Downloaded: https://repo.maven.apache.org/maven2/org/assertj/assertj-core/1.7.0/assertj-core-1.7.0.jar
(605 KB at 8279.9 KB/sec)
Downloaded: https://repo.maven.apache.org/maven2/org/bouncycastle/bcprov-ext-jdk15on/1.60/bcprov-ext-jdk15on-1.60.jar
(4161 KB at 10246.8 KB/sec)
Downloaded: https://repo.maven.apache.org/maven2/org/assertj/assertj-guava/1.3.0/assertj-guava-1.3.0.jar
(27 KB at 98.9 KB/sec)
Downloaded: https://repo.maven.apache.org/maven2/com/squareup/okhttp/mockwebserver/2.2.0/mockwebserver-2.2.0.jar
(40 KB at 84.0 KB/sec)
Downloaded: https://repo.maven.apache.org/maven2/com/google/auto/value/auto-value/1.4.1/auto-value-1.4.1.jar
(1470 KB at 1898.5 KB/sec)
[INFO] 
[INFO] --- maven-clean-plugin:2.5:clean (default-clean) @ google-compute-engine ---
[INFO] 
[INFO] --- maven-enforcer-plugin:1.1.1:enforce (enforce-banned-dependencies) @ google-compute-engine
---
Downloading: https://repo.maven.apache.org/maven2/org/apache/maven/enforcer/enforcer-api/1.1.1/enforcer-api-1.1.1.pom
Downloaded: https://repo.maven.apache.org/maven2/org/apache/maven/enforcer/enforcer-api/1.1.1/enforcer-api-1.1.1.pom
(4 KB at 163.8 KB/sec)
Downloading: https://repo.maven.apache.org/maven2/org/apache/maven/enforcer/enforcer-rules/1.1.1/enforcer-rules-1.1.1.pom
Downloaded: https://repo.maven.apache.org/maven2/org/apache/maven/enforcer/enforcer-rules/1.1.1/enforcer-rules-1.1.1.pom
(4 KB at 218.0 KB/sec)
Downloading: https://repo.maven.apache.org/maven2/org/apache/maven/doxia/doxia-sink-api/1.0-alpha-10/doxia-sink-api-1.0-alpha-10.jar
Downloading: https://repo.maven.apache.org/maven2/org/apache/maven/enforcer/enforcer-api/1.1.1/enforcer-api-1.1.1.jar
Downloading: https://repo.maven.apache.org/maven2/org/apache/maven/enforcer/enforcer-rules/1.1.1/enforcer-rules-1.1.1.jar
Downloaded: https://repo.maven.apache.org/maven2/org/apache/maven/doxia/doxia-sink-api/1.0-alpha-10/doxia-sink-api-1.0-alpha-10.jar
(10 KB at 569.1 KB/sec)
Downloaded: https://repo.maven.apache.org/maven2/org/apache/maven/enforcer/enforcer-api/1.1.1/enforcer-api-1.1.1.jar
(10 KB at 503.6 KB/sec)
Downloaded: https://repo.maven.apache.org/maven2/org/apache/maven/enforcer/enforcer-rules/1.1.1/enforcer-rules-1.1.1.jar
(68 KB at 306.1 KB/sec)
[INFO] 
[INFO] --- maven-enforcer-plugin:1.1.1:enforce (enforce-java) @ google-compute-engine ---
[INFO] 
[INFO] --- maven-toolchains-plugin:1.1:toolchain (default) @ google-compute-engine ---
[INFO] Required toolchain: jdk [ version='1.7' ]
[JENKINS] Archiving disabled
[INFO] ------------------------------------------------------------------------
[INFO] BUILD FAILURE
[INFO] ------------------------------------------------------------------------
[INFO] Total time: 04:52 min
[INFO] Finished at: 2020-02-24T09:35:44Z
[INFO] ------------------------------------------------------------------------
[JENKINS] Archiving disabled
[ERROR] Failed to execute goal org.apache.maven.plugins:maven-toolchains-plugin:1.1:toolchain
(default) on project google-compute-engine: Misconfigured toolchains. Non-existing JDK home
configuration at /home/jenkins/tools/java/latest15 -> [Help 1]
[ERROR] 
[ERROR] To see the full stack trace of the errors, re-run Maven with the -e switch.
[ERROR] Re-run Maven using the -X switch to enable full debug logging.
[ERROR] 
[ERROR] For more information about the errors and possible solutions, please read the following
articles:
[ERROR] [Help 1] http://cwiki.apache.org/confluence/display/MAVEN/MojoExecutionException
channel stopped

Mime
View raw message