jclouds-notifications mailing list archives

Site index · List index
Message view « Date » · « Thread »
Top « Date » · « Thread »
From Apache Jenkins Server <jenk...@builds.apache.org>
Subject Build failed in Jenkins: jclouds-with-credentials » jclouds-packet-live-tests #92
Date Tue, 11 Aug 2020 04:55:35 GMT
See <https://builds.apache.org/job/jclouds-with-credentials/job/jclouds-packet-live-tests/92/display/redirect>

Changes:


------------------------------------------
[...truncated 106.47 KB...]
[WARNING] Some problems were encountered while building the effective model for org.apache.jclouds:jclouds-scriptbuilder:bundle:2.3.0-SNAPSHOT
[WARNING] 'reporting.plugins.plugin.version' for org.apache.maven.plugins:maven-checkstyle-plugin
is missing. @ org.apache.jclouds:jclouds-project:2.3.0-SNAPSHOT, <https://builds.apache.org/job/jclouds-with-credentials/job/jclouds-packet-live-tests/ws/project/pom.xml,>
line 1196, column 15
[WARNING] 
[WARNING] Some problems were encountered while building the effective model for org.apache.jclouds:jclouds-allcompute:jar:2.3.0-SNAPSHOT
[WARNING] 'reporting.plugins.plugin.version' for org.apache.maven.plugins:maven-checkstyle-plugin
is missing. @ org.apache.jclouds:jclouds-project:2.3.0-SNAPSHOT, <https://builds.apache.org/job/jclouds-with-credentials/job/jclouds-packet-live-tests/ws/project/pom.xml,>
line 1196, column 15
[WARNING] 
[WARNING] Some problems were encountered while building the effective model for org.apache.jclouds:jclouds-allblobstore:jar:2.3.0-SNAPSHOT
[WARNING] 'reporting.plugins.plugin.version' for org.apache.maven.plugins:maven-checkstyle-plugin
is missing. @ org.apache.jclouds:jclouds-project:2.3.0-SNAPSHOT, <https://builds.apache.org/job/jclouds-with-credentials/job/jclouds-packet-live-tests/ws/project/pom.xml,>
line 1196, column 15
[WARNING] 
[WARNING] Some problems were encountered while building the effective model for org.apache.jclouds:jclouds-allloadbalancer:jar:2.3.0-SNAPSHOT
[WARNING] 'reporting.plugins.plugin.version' for org.apache.maven.plugins:maven-checkstyle-plugin
is missing. @ org.apache.jclouds:jclouds-project:2.3.0-SNAPSHOT, <https://builds.apache.org/job/jclouds-with-credentials/job/jclouds-packet-live-tests/ws/project/pom.xml,>
line 1196, column 15
[WARNING] 
[WARNING] Some problems were encountered while building the effective model for org.apache.jclouds:jclouds-all:jar:2.3.0-SNAPSHOT
[WARNING] 'reporting.plugins.plugin.version' for org.apache.maven.plugins:maven-checkstyle-plugin
is missing. @ org.apache.jclouds:jclouds-project:2.3.0-SNAPSHOT, <https://builds.apache.org/job/jclouds-with-credentials/job/jclouds-packet-live-tests/ws/project/pom.xml,>
line 1196, column 15
[WARNING] 
[WARNING] Some problems were encountered while building the effective model for org.apache.jclouds:jclouds:pom:2.3.0-SNAPSHOT
[WARNING] 'build.pluginManagement.plugins.plugin.(groupId:artifactId)' must be unique but
found duplicate declaration of plugin org.apache.rat:apache-rat-plugin @ org.apache.jclouds:jclouds-project:2.3.0-SNAPSHOT,
<https://builds.apache.org/job/jclouds-with-credentials/job/jclouds-packet-live-tests/ws/project/pom.xml,>
line 997, column 17
[WARNING] 'reporting.plugins.plugin.version' for org.apache.maven.plugins:maven-checkstyle-plugin
is missing. @ org.apache.jclouds:jclouds-project:2.3.0-SNAPSHOT, <https://builds.apache.org/job/jclouds-with-credentials/job/jclouds-packet-live-tests/ws/project/pom.xml,>
line 1196, column 15
[WARNING] 
[WARNING] It is highly recommended to fix these problems because they threaten the stability
of your build.
[WARNING] 
[WARNING] For this reason, future Maven versions might no longer support building such malformed
projects.
[WARNING] 
[INFO] 
[INFO] -----------------< org.apache.jclouds.provider:packet >-----------------
[INFO] Building jclouds Packet compute API 2.3.0-SNAPSHOT
[INFO] -------------------------------[ bundle ]-------------------------------
Downloading: https://repo.maven.apache.org/maven2/org/apache/maven/plugins/maven-enforcer-plugin/1.1.1/maven-enforcer-plugin-1.1.1.pom
Downloaded: https://repo.maven.apache.org/maven2/org/apache/maven/plugins/maven-enforcer-plugin/1.1.1/maven-enforcer-plugin-1.1.1.pom
(7 KB at 7.6 KB/sec)
Downloading: https://repo.maven.apache.org/maven2/org/apache/maven/enforcer/enforcer/1.1.1/enforcer-1.1.1.pom
Downloaded: https://repo.maven.apache.org/maven2/org/apache/maven/enforcer/enforcer/1.1.1/enforcer-1.1.1.pom
(12 KB at 369.9 KB/sec)
Downloading: https://repo.maven.apache.org/maven2/org/apache/maven/plugins/maven-enforcer-plugin/1.1.1/maven-enforcer-plugin-1.1.1.jar
Downloaded: https://repo.maven.apache.org/maven2/org/apache/maven/plugins/maven-enforcer-plugin/1.1.1/maven-enforcer-plugin-1.1.1.jar
(22 KB at 666.0 KB/sec)
Downloading: https://repo.maven.apache.org/maven2/org/codehaus/mojo/animal-sniffer-maven-plugin/1.16/animal-sniffer-maven-plugin-1.16.pom
Downloaded: https://repo.maven.apache.org/maven2/org/codehaus/mojo/animal-sniffer-maven-plugin/1.16/animal-sniffer-maven-plugin-1.16.pom
(6 KB at 116.9 KB/sec)
Downloading: https://repo.maven.apache.org/maven2/org/codehaus/mojo/animal-sniffer-parent/1.16/animal-sniffer-parent-1.16.pom
Downloaded: https://repo.maven.apache.org/maven2/org/codehaus/mojo/animal-sniffer-parent/1.16/animal-sniffer-parent-1.16.pom
(6 KB at 194.0 KB/sec)
Downloading: https://repo.maven.apache.org/maven2/org/codehaus/mojo/animal-sniffer-maven-plugin/1.16/animal-sniffer-maven-plugin-1.16.jar
Downloaded: https://repo.maven.apache.org/maven2/org/codehaus/mojo/animal-sniffer-maven-plugin/1.16/animal-sniffer-maven-plugin-1.16.jar
(33 KB at 1033.6 KB/sec)
Downloading: https://repo.maven.apache.org/maven2/org/basepom/maven/duplicate-finder-maven-plugin/1.1.2/duplicate-finder-maven-plugin-1.1.2.pom
Downloaded: https://repo.maven.apache.org/maven2/org/basepom/maven/duplicate-finder-maven-plugin/1.1.2/duplicate-finder-maven-plugin-1.1.2.pom
(20 KB at 582.1 KB/sec)
Downloading: https://repo.maven.apache.org/maven2/org/basepom/basepom-standard-oss/11/basepom-standard-oss-11.pom
Downloaded: https://repo.maven.apache.org/maven2/org/basepom/basepom-standard-oss/11/basepom-standard-oss-11.pom
(10 KB at 374.2 KB/sec)
Downloading: https://repo.maven.apache.org/maven2/org/basepom/basepom-standard/11/basepom-standard-11.pom
Downloaded: https://repo.maven.apache.org/maven2/org/basepom/basepom-standard/11/basepom-standard-11.pom
(43 KB at 1244.7 KB/sec)
Downloading: https://repo.maven.apache.org/maven2/org/basepom/basepom-foundation/11/basepom-foundation-11.pom
Downloaded: https://repo.maven.apache.org/maven2/org/basepom/basepom-foundation/11/basepom-foundation-11.pom
(46 KB at 1434.8 KB/sec)
Downloading: https://repo.maven.apache.org/maven2/org/basepom/maven/duplicate-finder-maven-plugin/1.1.2/duplicate-finder-maven-plugin-1.1.2.jar
Downloaded: https://repo.maven.apache.org/maven2/org/basepom/maven/duplicate-finder-maven-plugin/1.1.2/duplicate-finder-maven-plugin-1.1.2.jar
(73 KB at 2325.0 KB/sec)
Downloading: https://repo.maven.apache.org/maven2/org/gaul/modernizer-maven-plugin/1.8.0/modernizer-maven-plugin-1.8.0.pom
Downloaded: https://repo.maven.apache.org/maven2/org/gaul/modernizer-maven-plugin/1.8.0/modernizer-maven-plugin-1.8.0.pom
(4 KB at 169.4 KB/sec)
Downloading: https://repo.maven.apache.org/maven2/org/gaul/modernizer-maven-parent/1.8.0/modernizer-maven-parent-1.8.0.pom
Downloaded: https://repo.maven.apache.org/maven2/org/gaul/modernizer-maven-parent/1.8.0/modernizer-maven-parent-1.8.0.pom
(9 KB at 366.7 KB/sec)
Downloading: https://repo.maven.apache.org/maven2/org/gaul/modernizer-maven-plugin/1.8.0/modernizer-maven-plugin-1.8.0.jar
Downloaded: https://repo.maven.apache.org/maven2/org/gaul/modernizer-maven-plugin/1.8.0/modernizer-maven-plugin-1.8.0.jar
(36 KB at 1174.2 KB/sec)
Downloading: https://repository.apache.org/content/repositories/snapshots/org/apache/jclouds/jclouds-compute/2.3.0-SNAPSHOT/maven-metadata.xml
Downloading: http://repository.apache.org/snapshots/org/apache/jclouds/jclouds-compute/2.3.0-SNAPSHOT/maven-metadata.xml
Downloaded: https://repository.apache.org/content/repositories/snapshots/org/apache/jclouds/jclouds-compute/2.3.0-SNAPSHOT/maven-metadata.xml
(2 KB at 0.8 KB/sec)
Downloaded: http://repository.apache.org/snapshots/org/apache/jclouds/jclouds-compute/2.3.0-SNAPSHOT/maven-metadata.xml
(2 KB at 0.7 KB/sec)
Downloading: https://repository.apache.org/content/repositories/snapshots/org/apache/jclouds/jclouds-compute/2.3.0-SNAPSHOT/jclouds-compute-2.3.0-20200801.110655-28.pom
Downloaded: https://repository.apache.org/content/repositories/snapshots/org/apache/jclouds/jclouds-compute/2.3.0-SNAPSHOT/jclouds-compute-2.3.0-20200801.110655-28.pom
(3 KB at 6.5 KB/sec)
Downloading: https://repository.apache.org/content/repositories/snapshots/org/apache/jclouds/jclouds-scriptbuilder/2.3.0-SNAPSHOT/maven-metadata.xml
Downloading: http://repository.apache.org/snapshots/org/apache/jclouds/jclouds-scriptbuilder/2.3.0-SNAPSHOT/maven-metadata.xml
Downloaded: https://repository.apache.org/content/repositories/snapshots/org/apache/jclouds/jclouds-scriptbuilder/2.3.0-SNAPSHOT/maven-metadata.xml
(2 KB at 4.1 KB/sec)
Downloaded: http://repository.apache.org/snapshots/org/apache/jclouds/jclouds-scriptbuilder/2.3.0-SNAPSHOT/maven-metadata.xml
(2 KB at 2.6 KB/sec)
Downloading: https://repository.apache.org/content/repositories/snapshots/org/apache/jclouds/jclouds-scriptbuilder/2.3.0-SNAPSHOT/jclouds-scriptbuilder-2.3.0-20200801.110544-28.pom
Downloaded: https://repository.apache.org/content/repositories/snapshots/org/apache/jclouds/jclouds-scriptbuilder/2.3.0-SNAPSHOT/jclouds-scriptbuilder-2.3.0-20200801.110544-28.pom
(3 KB at 7.1 KB/sec)
Downloading: https://repository.apache.org/content/repositories/snapshots/org/apache/jclouds/jclouds-core/2.3.0-SNAPSHOT/maven-metadata.xml
Downloading: http://repository.apache.org/snapshots/org/apache/jclouds/jclouds-core/2.3.0-SNAPSHOT/maven-metadata.xml
Downloaded: http://repository.apache.org/snapshots/org/apache/jclouds/jclouds-core/2.3.0-SNAPSHOT/maven-metadata.xml
(2 KB at 4.9 KB/sec)
Downloaded: https://repository.apache.org/content/repositories/snapshots/org/apache/jclouds/jclouds-core/2.3.0-SNAPSHOT/maven-metadata.xml
(2 KB at 4.2 KB/sec)
Downloading: https://repository.apache.org/content/repositories/snapshots/org/apache/jclouds/jclouds-core/2.3.0-SNAPSHOT/jclouds-core-2.3.0-20200801.110226-28.pom
Downloaded: https://repository.apache.org/content/repositories/snapshots/org/apache/jclouds/jclouds-core/2.3.0-SNAPSHOT/jclouds-core-2.3.0-20200801.110226-28.pom
(6 KB at 14.7 KB/sec)
Downloading: http://repository.apache.org/snapshots/org/apache/jclouds/jclouds-gson/2.3.0-SNAPSHOT/maven-metadata.xml
Downloading: https://repository.apache.org/content/repositories/snapshots/org/apache/jclouds/jclouds-gson/2.3.0-SNAPSHOT/maven-metadata.xml
Downloaded: https://repository.apache.org/content/repositories/snapshots/org/apache/jclouds/jclouds-gson/2.3.0-SNAPSHOT/maven-metadata.xml
(2 KB at 3.4 KB/sec)
Downloaded: http://repository.apache.org/snapshots/org/apache/jclouds/jclouds-gson/2.3.0-SNAPSHOT/maven-metadata.xml
(2 KB at 2.6 KB/sec)
Downloading: https://repository.apache.org/content/repositories/snapshots/org/apache/jclouds/jclouds-gson/2.3.0-SNAPSHOT/jclouds-gson-2.3.0-20200801.105908-32.pom
Downloaded: https://repository.apache.org/content/repositories/snapshots/org/apache/jclouds/jclouds-gson/2.3.0-SNAPSHOT/jclouds-gson-2.3.0-20200801.105908-32.pom
(2 KB at 3.4 KB/sec)
Downloading: https://repo.maven.apache.org/maven2/com/google/auto/service/auto-service/1.0-rc3/auto-service-1.0-rc3.pom
Downloaded: https://repo.maven.apache.org/maven2/com/google/auto/service/auto-service/1.0-rc3/auto-service-1.0-rc3.pom
(3 KB at 139.6 KB/sec)
Downloading: https://repo.maven.apache.org/maven2/com/google/auto/value/auto-value/1.4.1/auto-value-1.4.1.pom
Downloaded: https://repo.maven.apache.org/maven2/com/google/auto/value/auto-value/1.4.1/auto-value-1.4.1.pom
(7 KB at 259.5 KB/sec)
Downloading: http://repository.apache.org/snapshots/org/apache/jclouds/driver/jclouds-slf4j/2.3.0-SNAPSHOT/maven-metadata.xml
Downloading: https://repository.apache.org/content/repositories/snapshots/org/apache/jclouds/driver/jclouds-slf4j/2.3.0-SNAPSHOT/maven-metadata.xml
Downloaded: http://repository.apache.org/snapshots/org/apache/jclouds/driver/jclouds-slf4j/2.3.0-SNAPSHOT/maven-metadata.xml
(2 KB at 4.8 KB/sec)
Downloaded: https://repository.apache.org/content/repositories/snapshots/org/apache/jclouds/driver/jclouds-slf4j/2.3.0-SNAPSHOT/maven-metadata.xml
(2 KB at 4.4 KB/sec)
Downloading: https://repository.apache.org/content/repositories/snapshots/org/apache/jclouds/driver/jclouds-slf4j/2.3.0-SNAPSHOT/jclouds-slf4j-2.3.0-20200801.110259-28.pom
Downloaded: https://repository.apache.org/content/repositories/snapshots/org/apache/jclouds/driver/jclouds-slf4j/2.3.0-SNAPSHOT/jclouds-slf4j-2.3.0-20200801.110259-28.pom
(3 KB at 5.7 KB/sec)
Downloading: http://repository.apache.org/snapshots/org/apache/jclouds/driver/jclouds-sshj/2.3.0-SNAPSHOT/maven-metadata.xml
Downloading: https://repository.apache.org/content/repositories/snapshots/org/apache/jclouds/driver/jclouds-sshj/2.3.0-SNAPSHOT/maven-metadata.xml
Downloaded: https://repository.apache.org/content/repositories/snapshots/org/apache/jclouds/driver/jclouds-sshj/2.3.0-SNAPSHOT/maven-metadata.xml
(2 KB at 4.1 KB/sec)
Downloaded: http://repository.apache.org/snapshots/org/apache/jclouds/driver/jclouds-sshj/2.3.0-SNAPSHOT/maven-metadata.xml
(2 KB at 2.7 KB/sec)
Downloading: https://repository.apache.org/content/repositories/snapshots/org/apache/jclouds/driver/jclouds-sshj/2.3.0-SNAPSHOT/jclouds-sshj-2.3.0-20200801.111033-27.pom
Downloaded: https://repository.apache.org/content/repositories/snapshots/org/apache/jclouds/driver/jclouds-sshj/2.3.0-SNAPSHOT/jclouds-sshj-2.3.0-20200801.111033-27.pom
(6 KB at 13.6 KB/sec)
Downloading: https://repository.apache.org/content/repositories/snapshots/org/apache/jclouds/driver/jclouds-bouncycastle/2.3.0-SNAPSHOT/maven-metadata.xml
Downloading: http://repository.apache.org/snapshots/org/apache/jclouds/driver/jclouds-bouncycastle/2.3.0-SNAPSHOT/maven-metadata.xml
Downloaded: https://repository.apache.org/content/repositories/snapshots/org/apache/jclouds/driver/jclouds-bouncycastle/2.3.0-SNAPSHOT/maven-metadata.xml
(2 KB at 3.9 KB/sec)
Downloaded: http://repository.apache.org/snapshots/org/apache/jclouds/driver/jclouds-bouncycastle/2.3.0-SNAPSHOT/maven-metadata.xml
(2 KB at 3.1 KB/sec)
Downloading: https://repository.apache.org/content/repositories/snapshots/org/apache/jclouds/driver/jclouds-bouncycastle/2.3.0-SNAPSHOT/jclouds-bouncycastle-2.3.0-20200801.110958-27.pom
Downloaded: https://repository.apache.org/content/repositories/snapshots/org/apache/jclouds/driver/jclouds-bouncycastle/2.3.0-SNAPSHOT/jclouds-bouncycastle-2.3.0-20200801.110958-27.pom
(3 KB at 6.4 KB/sec)
Downloading: https://repo.maven.apache.org/maven2/com/hierynomus/sshj/0.27.0/sshj-0.27.0.pom
Downloaded: https://repo.maven.apache.org/maven2/com/hierynomus/sshj/0.27.0/sshj-0.27.0.pom
(3 KB at 94.4 KB/sec)
Downloading: https://repo.maven.apache.org/maven2/com/jcraft/jsch.agentproxy.sshj/0.0.9/jsch.agentproxy.sshj-0.0.9.pom
Downloaded: https://repo.maven.apache.org/maven2/com/jcraft/jsch.agentproxy.sshj/0.0.9/jsch.agentproxy.sshj-0.0.9.pom
(2 KB at 56.3 KB/sec)
Downloading: https://repo.maven.apache.org/maven2/com/squareup/okhttp/mockwebserver/2.2.0/mockwebserver-2.2.0.pom
Downloaded: https://repo.maven.apache.org/maven2/com/squareup/okhttp/mockwebserver/2.2.0/mockwebserver-2.2.0.pom
(2 KB at 70.0 KB/sec)
Downloading: https://repo.maven.apache.org/maven2/org/testng/testng/6.8.21/testng-6.8.21.pom
Downloaded: https://repo.maven.apache.org/maven2/org/testng/testng/6.8.21/testng-6.8.21.pom
(8 KB at 358.6 KB/sec)
Downloading: https://repo.maven.apache.org/maven2/org/assertj/assertj-core/1.7.0/assertj-core-1.7.0.pom
Downloaded: https://repo.maven.apache.org/maven2/org/assertj/assertj-core/1.7.0/assertj-core-1.7.0.pom
(5 KB at 237.3 KB/sec)
Downloading: https://repo.maven.apache.org/maven2/org/assertj/assertj-parent-pom/1.2.6/assertj-parent-pom-1.2.6.pom
Downloaded: https://repo.maven.apache.org/maven2/org/assertj/assertj-parent-pom/1.2.6/assertj-parent-pom-1.2.6.pom
(14 KB at 727.1 KB/sec)
Downloading: https://repo.maven.apache.org/maven2/org/assertj/assertj-guava/1.3.0/assertj-guava-1.3.0.pom
Downloaded: https://repo.maven.apache.org/maven2/org/assertj/assertj-guava/1.3.0/assertj-guava-1.3.0.pom
(4 KB at 196.3 KB/sec)
Downloading: https://repository.apache.org/content/repositories/snapshots/org/apache/jclouds/jclouds-compute/2.3.0-SNAPSHOT/jclouds-compute-2.3.0-20200801.110655-28.jar
Downloading: https://repository.apache.org/content/repositories/snapshots/org/apache/jclouds/jclouds-scriptbuilder/2.3.0-SNAPSHOT/jclouds-scriptbuilder-2.3.0-20200801.110544-28.jar
Downloading: https://repository.apache.org/content/repositories/snapshots/org/apache/jclouds/jclouds-core/2.3.0-SNAPSHOT/jclouds-core-2.3.0-20200801.110226-28.jar
Downloading: https://repository.apache.org/content/repositories/snapshots/org/apache/jclouds/jclouds-core/2.3.0-SNAPSHOT/jclouds-core-2.3.0-20200801.110226-28-tests.jar
Downloading: https://repository.apache.org/content/repositories/snapshots/org/apache/jclouds/jclouds-gson/2.3.0-SNAPSHOT/jclouds-gson-2.3.0-20200801.105908-32.jar
Downloaded: https://repository.apache.org/content/repositories/snapshots/org/apache/jclouds/jclouds-compute/2.3.0-SNAPSHOT/jclouds-compute-2.3.0-20200801.110655-28.jar
(511 KB at 388.6 KB/sec)
Downloaded: https://repository.apache.org/content/repositories/snapshots/org/apache/jclouds/jclouds-scriptbuilder/2.3.0-SNAPSHOT/jclouds-scriptbuilder-2.3.0-20200801.110544-28.jar
(170 KB at 128.8 KB/sec)
Downloading: https://repository.apache.org/content/repositories/snapshots/org/apache/jclouds/driver/jclouds-slf4j/2.3.0-SNAPSHOT/jclouds-slf4j-2.3.0-20200801.110259-28-tests.jar
Downloading: https://repository.apache.org/content/repositories/snapshots/org/apache/jclouds/jclouds-compute/2.3.0-SNAPSHOT/jclouds-compute-2.3.0-20200801.110655-28-tests.jar
Downloaded: https://repository.apache.org/content/repositories/snapshots/org/apache/jclouds/jclouds-gson/2.3.0-SNAPSHOT/jclouds-gson-2.3.0-20200801.105908-32.jar
(248 KB at 182.5 KB/sec)
Downloading: https://repository.apache.org/content/repositories/snapshots/org/apache/jclouds/driver/jclouds-slf4j/2.3.0-SNAPSHOT/jclouds-slf4j-2.3.0-20200801.110259-28.jar
Downloaded: https://repository.apache.org/content/repositories/snapshots/org/apache/jclouds/jclouds-core/2.3.0-SNAPSHOT/jclouds-core-2.3.0-20200801.110226-28-tests.jar
(601 KB at 382.0 KB/sec)
Downloading: https://repository.apache.org/content/repositories/snapshots/org/apache/jclouds/driver/jclouds-sshj/2.3.0-SNAPSHOT/jclouds-sshj-2.3.0-20200801.111033-27.jar
Downloaded: https://repository.apache.org/content/repositories/snapshots/org/apache/jclouds/jclouds-core/2.3.0-SNAPSHOT/jclouds-core-2.3.0-20200801.110226-28.jar
(739 KB at 438.6 KB/sec)
Downloading: https://repository.apache.org/content/repositories/snapshots/org/apache/jclouds/driver/jclouds-bouncycastle/2.3.0-SNAPSHOT/jclouds-bouncycastle-2.3.0-20200801.110958-27.jar
Downloaded: https://repository.apache.org/content/repositories/snapshots/org/apache/jclouds/jclouds-compute/2.3.0-SNAPSHOT/jclouds-compute-2.3.0-20200801.110655-28-tests.jar
(235 KB at 578.4 KB/sec)
Downloaded: https://repository.apache.org/content/repositories/snapshots/org/apache/jclouds/driver/jclouds-slf4j/2.3.0-SNAPSHOT/jclouds-slf4j-2.3.0-20200801.110259-28.jar
(12 KB at 21.7 KB/sec)
Downloaded: https://repository.apache.org/content/repositories/snapshots/org/apache/jclouds/driver/jclouds-slf4j/2.3.0-SNAPSHOT/jclouds-slf4j-2.3.0-20200801.110259-28-tests.jar
(10 KB at 17.4 KB/sec)
Downloaded: https://repository.apache.org/content/repositories/snapshots/org/apache/jclouds/driver/jclouds-sshj/2.3.0-SNAPSHOT/jclouds-sshj-2.3.0-20200801.111033-27.jar
(39 KB at 69.1 KB/sec)
Downloaded: https://repository.apache.org/content/repositories/snapshots/org/apache/jclouds/driver/jclouds-bouncycastle/2.3.0-SNAPSHOT/jclouds-bouncycastle-2.3.0-20200801.110958-27.jar
(11 KB at 23.1 KB/sec)
Downloading: https://repo.maven.apache.org/maven2/com/google/auto/service/auto-service/1.0-rc3/auto-service-1.0-rc3.jar
Downloading: https://repo.maven.apache.org/maven2/com/google/auto/value/auto-value/1.4.1/auto-value-1.4.1.jar
Downloading: https://repo.maven.apache.org/maven2/com/hierynomus/sshj/0.27.0/sshj-0.27.0.jar
Downloading: https://repo.maven.apache.org/maven2/com/jcraft/jsch.agentproxy.sshj/0.0.9/jsch.agentproxy.sshj-0.0.9.jar
Downloading: https://repo.maven.apache.org/maven2/com/squareup/okhttp/mockwebserver/2.2.0/mockwebserver-2.2.0.jar
Downloaded: https://repo.maven.apache.org/maven2/com/google/auto/service/auto-service/1.0-rc3/auto-service-1.0-rc3.jar
(11 KB at 513.1 KB/sec)
Downloading: https://repo.maven.apache.org/maven2/org/testng/testng/6.8.21/testng-6.8.21.jar
Downloaded: https://repo.maven.apache.org/maven2/com/jcraft/jsch.agentproxy.sshj/0.0.9/jsch.agentproxy.sshj-0.0.9.jar
(4 KB at 104.5 KB/sec)
Downloading: https://repo.maven.apache.org/maven2/org/assertj/assertj-core/1.7.0/assertj-core-1.7.0.jar
Downloaded: https://repo.maven.apache.org/maven2/com/squareup/okhttp/mockwebserver/2.2.0/mockwebserver-2.2.0.jar
(40 KB at 918.0 KB/sec)
Downloading: https://repo.maven.apache.org/maven2/org/assertj/assertj-guava/1.3.0/assertj-guava-1.3.0.jar
Downloaded: https://repo.maven.apache.org/maven2/org/assertj/assertj-guava/1.3.0/assertj-guava-1.3.0.jar
(27 KB at 1415.6 KB/sec)
Downloaded: https://repo.maven.apache.org/maven2/com/hierynomus/sshj/0.27.0/sshj-0.27.0.jar
(498 KB at 5993.8 KB/sec)
Downloaded: https://repo.maven.apache.org/maven2/org/testng/testng/6.8.21/testng-6.8.21.jar
(818 KB at 10214.9 KB/sec)
Downloaded: https://repo.maven.apache.org/maven2/org/assertj/assertj-core/1.7.0/assertj-core-1.7.0.jar
(605 KB at 8513.1 KB/sec)
Downloaded: https://repo.maven.apache.org/maven2/com/google/auto/value/auto-value/1.4.1/auto-value-1.4.1.jar
(1470 KB at 10275.9 KB/sec)
[INFO] 
[INFO] --- maven-clean-plugin:2.5:clean (default-clean) @ packet ---
[INFO] 
[INFO] --- maven-enforcer-plugin:1.1.1:enforce (enforce-banned-dependencies) @ packet ---
Downloading: https://repo.maven.apache.org/maven2/org/apache/maven/enforcer/enforcer-api/1.1.1/enforcer-api-1.1.1.pom
Downloaded: https://repo.maven.apache.org/maven2/org/apache/maven/enforcer/enforcer-api/1.1.1/enforcer-api-1.1.1.pom
(4 KB at 115.2 KB/sec)
Downloading: https://repo.maven.apache.org/maven2/org/apache/maven/enforcer/enforcer-rules/1.1.1/enforcer-rules-1.1.1.pom
Downloaded: https://repo.maven.apache.org/maven2/org/apache/maven/enforcer/enforcer-rules/1.1.1/enforcer-rules-1.1.1.pom
(4 KB at 178.4 KB/sec)
Downloading: https://repo.maven.apache.org/maven2/org/apache/maven/enforcer/enforcer-api/1.1.1/enforcer-api-1.1.1.jar
Downloading: https://repo.maven.apache.org/maven2/org/apache/maven/enforcer/enforcer-rules/1.1.1/enforcer-rules-1.1.1.jar
Downloaded: https://repo.maven.apache.org/maven2/org/apache/maven/enforcer/enforcer-api/1.1.1/enforcer-api-1.1.1.jar
(10 KB at 478.4 KB/sec)
Downloaded: https://repo.maven.apache.org/maven2/org/apache/maven/enforcer/enforcer-rules/1.1.1/enforcer-rules-1.1.1.jar
(68 KB at 2831.1 KB/sec)
[INFO] 
[INFO] --- maven-enforcer-plugin:1.1.1:enforce (enforce-java) @ packet ---
[INFO] 
[INFO] --- maven-toolchains-plugin:1.1:toolchain (default) @ packet ---
[INFO] Required toolchain: jdk [ version='1.8' ]
[INFO] Found matching toolchain for type jdk: JDK[/home/jenkins/tools/java/latest1.8/]
[INFO] 
[INFO] --- maven-remote-resources-plugin:1.5:process (default) @ packet ---
[INFO] 
[INFO] --- maven-resources-plugin:2.6:resources (default-resources) @ packet ---
[INFO] Using 'UTF-8' encoding to copy filtered resources.
[INFO] skip non existing resourceDirectory <https://builds.apache.org/job/jclouds-with-credentials/job/jclouds-packet-live-tests/ws/providers/packet/src/main/resources>
[INFO] skip non existing resourceDirectory <https://builds.apache.org/job/jclouds-with-credentials/job/jclouds-packet-live-tests/ws/providers/packet/target/classes>
[INFO] Copying 3 resources
[INFO] 
[INFO] --- maven-compiler-plugin:3.8.0:compile (default-compile) @ packet ---
Downloading: https://repo.maven.apache.org/maven2/org/codehaus/plexus/plexus-compiler-javac-errorprone/2.6/plexus-compiler-javac-errorprone-2.6.pom
Downloaded: https://repo.maven.apache.org/maven2/org/codehaus/plexus/plexus-compiler-javac-errorprone/2.6/plexus-compiler-javac-errorprone-2.6.pom
(2 KB at 94.6 KB/sec)
Downloading: https://repo.maven.apache.org/maven2/org/codehaus/plexus/plexus-compilers/2.6/plexus-compilers-2.6.pom
Downloaded: https://repo.maven.apache.org/maven2/org/codehaus/plexus/plexus-compilers/2.6/plexus-compilers-2.6.pom
(2 KB at 76.9 KB/sec)
Downloading: https://repo.maven.apache.org/maven2/org/codehaus/plexus/plexus-compiler/2.6/plexus-compiler-2.6.pom
Downloaded: https://repo.maven.apache.org/maven2/org/codehaus/plexus/plexus-compiler/2.6/plexus-compiler-2.6.pom
(6 KB at 309.2 KB/sec)
Downloading: https://repo.maven.apache.org/maven2/org/codehaus/plexus/plexus-compiler-javac/2.6/plexus-compiler-javac-2.6.pom
Downloaded: https://repo.maven.apache.org/maven2/org/codehaus/plexus/plexus-compiler-javac/2.6/plexus-compiler-javac-2.6.pom
(769 B at 46.9 KB/sec)
Downloading: https://repo.maven.apache.org/maven2/org/codehaus/plexus/plexus-compiler-api/2.6/plexus-compiler-api-2.6.pom
Downloaded: https://repo.maven.apache.org/maven2/org/codehaus/plexus/plexus-compiler-api/2.6/plexus-compiler-api-2.6.pom
(865 B at 46.9 KB/sec)
Downloading: https://repo.maven.apache.org/maven2/com/google/errorprone/error_prone_core/2.0.1/error_prone_core-2.0.1.pom
Downloaded: https://repo.maven.apache.org/maven2/com/google/errorprone/error_prone_core/2.0.1/error_prone_core-2.0.1.pom
(9 KB at 519.9 KB/sec)
Downloading: https://repo.maven.apache.org/maven2/com/google/errorprone/error_prone_parent/2.0.1/error_prone_parent-2.0.1.pom
Downloaded: https://repo.maven.apache.org/maven2/com/google/errorprone/error_prone_parent/2.0.1/error_prone_parent-2.0.1.pom
(5 KB at 256.0 KB/sec)
Downloading: https://repo.maven.apache.org/maven2/com/google/errorprone/error_prone_annotation/2.0.1/error_prone_annotation-2.0.1.pom
Downloaded: https://repo.maven.apache.org/maven2/com/google/errorprone/error_prone_annotation/2.0.1/error_prone_annotation-2.0.1.pom
(2 KB at 81.2 KB/sec)
Downloading: https://repo.maven.apache.org/maven2/org/checkerframework/dataflow/1.8.10/dataflow-1.8.10.pom
Downloaded: https://repo.maven.apache.org/maven2/org/checkerframework/dataflow/1.8.10/dataflow-1.8.10.pom
(5 KB at 235.8 KB/sec)
Downloading: https://repo.maven.apache.org/maven2/org/checkerframework/javacutil/1.8.10/javacutil-1.8.10.pom
Downloaded: https://repo.maven.apache.org/maven2/org/checkerframework/javacutil/1.8.10/javacutil-1.8.10.pom
(4 KB at 246.5 KB/sec)
Downloading: https://repo.maven.apache.org/maven2/com/google/errorprone/javac/1.8.0-u20/javac-1.8.0-u20.pom
Downloaded: https://repo.maven.apache.org/maven2/com/google/errorprone/javac/1.8.0-u20/javac-1.8.0-u20.pom
(2 KB at 70.3 KB/sec)
Downloading: https://repo.maven.apache.org/maven2/com/google/errorprone/error_prone_annotations/2.0.1/error_prone_annotations-2.0.1.pom
Downloaded: https://repo.maven.apache.org/maven2/com/google/errorprone/error_prone_annotations/2.0.1/error_prone_annotations-2.0.1.pom
(2 KB at 81.4 KB/sec)
Downloading: https://repo.maven.apache.org/maven2/com/google/errorprone/error_prone_core/2.0.5/error_prone_core-2.0.5.pom
Downloaded: https://repo.maven.apache.org/maven2/com/google/errorprone/error_prone_core/2.0.5/error_prone_core-2.0.5.pom
(10 KB at 553.0 KB/sec)
Downloading: https://repo.maven.apache.org/maven2/com/google/errorprone/error_prone_parent/2.0.5/error_prone_parent-2.0.5.pom
Downloaded: https://repo.maven.apache.org/maven2/com/google/errorprone/error_prone_parent/2.0.5/error_prone_parent-2.0.5.pom
(5 KB at 275.2 KB/sec)
Downloading: https://repo.maven.apache.org/maven2/com/google/errorprone/error_prone_annotation/2.0.5/error_prone_annotation-2.0.5.pom
Downloaded: https://repo.maven.apache.org/maven2/com/google/errorprone/error_prone_annotation/2.0.5/error_prone_annotation-2.0.5.pom
(2 KB at 81.2 KB/sec)
Downloading: https://repo.maven.apache.org/maven2/com/google/errorprone/javac/1.9.0-dev-r2644-1/javac-1.9.0-dev-r2644-1.pom
Downloaded: https://repo.maven.apache.org/maven2/com/google/errorprone/javac/1.9.0-dev-r2644-1/javac-1.9.0-dev-r2644-1.pom
(2 KB at 66.8 KB/sec)
Downloading: https://repo.maven.apache.org/maven2/com/google/errorprone/error_prone_annotations/2.0.5/error_prone_annotations-2.0.5.pom
Downloaded: https://repo.maven.apache.org/maven2/com/google/errorprone/error_prone_annotations/2.0.5/error_prone_annotations-2.0.5.pom
(2 KB at 81.4 KB/sec)
Downloading: https://repo.maven.apache.org/maven2/org/codehaus/plexus/plexus-compiler-javac-errorprone/2.6/plexus-compiler-javac-errorprone-2.6.jar
Downloading: https://repo.maven.apache.org/maven2/com/google/errorprone/error_prone_core/2.0.5/error_prone_core-2.0.5.jar
Downloading: https://repo.maven.apache.org/maven2/com/google/errorprone/error_prone_annotation/2.0.5/error_prone_annotation-2.0.5.jar
Downloading: https://repo.maven.apache.org/maven2/org/checkerframework/dataflow/1.8.10/dataflow-1.8.10.jar
Downloading: https://repo.maven.apache.org/maven2/org/checkerframework/javacutil/1.8.10/javacutil-1.8.10.jar
Downloaded: https://repo.maven.apache.org/maven2/org/codehaus/plexus/plexus-compiler-javac-errorprone/2.6/plexus-compiler-javac-errorprone-2.6.jar
(10 KB at 521.9 KB/sec)
Downloading: https://repo.maven.apache.org/maven2/com/google/errorprone/javac/1.9.0-dev-r2644-1/javac-1.9.0-dev-r2644-1.jar
Downloaded: https://repo.maven.apache.org/maven2/org/checkerframework/javacutil/1.8.10/javacutil-1.8.10.jar
(85 KB at 3245.3 KB/sec)
Downloading: https://repo.maven.apache.org/maven2/com/google/errorprone/error_prone_annotations/2.0.5/error_prone_annotations-2.0.5.jar
Downloaded: https://repo.maven.apache.org/maven2/org/checkerframework/dataflow/1.8.10/dataflow-1.8.10.jar
(283 KB at 7646.9 KB/sec)
Downloaded: https://repo.maven.apache.org/maven2/com/google/errorprone/error_prone_annotations/2.0.5/error_prone_annotations-2.0.5.jar
(7 KB at 349.1 KB/sec)
Downloaded: https://repo.maven.apache.org/maven2/com/google/errorprone/error_prone_annotation/2.0.5/error_prone_annotation-2.0.5.jar
(13 KB at 147.3 KB/sec)
Downloaded: https://repo.maven.apache.org/maven2/com/google/errorprone/javac/1.9.0-dev-r2644-1/javac-1.9.0-dev-r2644-1.jar
(2438 KB at 9907.9 KB/sec)
Downloaded: https://repo.maven.apache.org/maven2/com/google/errorprone/error_prone_core/2.0.5/error_prone_core-2.0.5.jar
(3574 KB at 7190.0 KB/sec)
[INFO] Toolchain in maven-compiler-plugin: JDK[/home/jenkins/tools/java/latest1.8/]
[INFO] Changes detected - recompiling the module!
[INFO] Compiling 39 source files to <https://builds.apache.org/job/jclouds-with-credentials/job/jclouds-packet-live-tests/ws/providers/packet/target/classes>
[JENKINS] Archiving disabled
[INFO] ------------------------------------------------------------------------
[INFO] BUILD FAILURE
[INFO] ------------------------------------------------------------------------
[INFO] Total time: 04:43 min
[INFO] Finished at: 2020-08-11T04:55:09Z
[INFO] ------------------------------------------------------------------------
[JENKINS] Archiving disabled
[ERROR] Failed to execute goal org.apache.maven.plugins:maven-compiler-plugin:3.8.0:compile
(default-compile) on project packet: Fatal error compiling: CompilerException: InvocationTargetException:
NullPointerException -> [Help 1]
[ERROR] 
[ERROR] To see the full stack trace of the errors, re-run Maven with the -e switch.
[ERROR] Re-run Maven using the -X switch to enable full debug logging.
[ERROR] 
[ERROR] For more information about the errors and possible solutions, please read the following
articles:
[ERROR] [Help 1] http://cwiki.apache.org/confluence/display/MAVEN/MojoExecutionException
channel stopped
No JDK named ?JDK 1.8.0_144 (unlimited security)? found
No JDK named ?JDK 1.8.0_144 (unlimited security)? found
No JDK named ?JDK 1.8.0_144 (unlimited security)? found

Mime
View raw message