jclouds-notifications mailing list archives

Site index · List index
Message view « Date » · « Thread »
Top « Date » · « Thread »
From Apache Jenkins Server <jenk...@builds.apache.org>
Subject Build failed in Jenkins: JClouds » 2.2.x » jclouds-labs-aws-2.2.x #1
Date Wed, 19 Aug 2020 02:06:16 GMT
See <https://ci-builds.apache.org/job/JClouds/job/2.2.x/job/jclouds-labs-aws-2.2.x/1/display/redirect>

Changes:


------------------------------------------
[...truncated 18.98 KB...]
[INFO] 1 resources included (use -debug for more details)
[INFO] Rat check: Summary over all files. Unapproved: 0, unknown: 0, generated: 0, approved:
1 licenses.
[INFO] 
[INFO] --- maven-jar-plugin:2.4:test-jar (default) @ jclouds-labs-aws ---
[WARNING] JAR will be empty - no content was marked for inclusion!
[INFO] Building jar: <https://ci-builds.apache.org/job/JClouds/job/2.2.x/job/jclouds-labs-aws-2.2.x/ws/target/jclouds-labs-aws-2.2.1-SNAPSHOT-tests.jar>
[INFO] Downloading from Nexus: http://repository.apache.org/snapshots/org/apache/jclouds/api/sts/2.2.1-SNAPSHOT/maven-metadata.xml
[INFO] Downloading from apache-snapshots: https://repository.apache.org/content/repositories/snapshots/org/apache/jclouds/api/sts/2.2.1-SNAPSHOT/maven-metadata.xml
[INFO] Downloading from apache-snapshots: https://repository.apache.org/content/repositories/snapshots/org/apache/jclouds/api/sts/2.2.1-SNAPSHOT/sts-2.2.1-SNAPSHOT.pom
[INFO] Downloading from Nexus: http://repository.apache.org/snapshots/org/apache/jclouds/api/sts/2.2.1-SNAPSHOT/sts-2.2.1-SNAPSHOT.pom
[WARNING] The POM for org.apache.jclouds.api:sts:jar:2.2.1-SNAPSHOT is missing, no dependency
information available
[INFO] Downloading from Nexus: http://repository.apache.org/snapshots/org/apache/jclouds/jclouds-loadbalancer/2.2.1-SNAPSHOT/maven-metadata.xml
[INFO] Downloading from apache-snapshots: https://repository.apache.org/content/repositories/snapshots/org/apache/jclouds/jclouds-loadbalancer/2.2.1-SNAPSHOT/maven-metadata.xml
[INFO] Downloading from apache-snapshots: https://repository.apache.org/content/repositories/snapshots/org/apache/jclouds/jclouds-loadbalancer/2.2.1-SNAPSHOT/jclouds-loadbalancer-2.2.1-SNAPSHOT.pom
[INFO] Downloading from Nexus: http://repository.apache.org/snapshots/org/apache/jclouds/jclouds-loadbalancer/2.2.1-SNAPSHOT/jclouds-loadbalancer-2.2.1-SNAPSHOT.pom
[WARNING] The POM for org.apache.jclouds:jclouds-loadbalancer:jar:2.2.1-SNAPSHOT is missing,
no dependency information available
[INFO] Downloading from apache-snapshots: https://repository.apache.org/content/repositories/snapshots/org/apache/jclouds/jclouds-core/2.2.1-SNAPSHOT/maven-metadata.xml
[INFO] Downloading from Nexus: http://repository.apache.org/snapshots/org/apache/jclouds/jclouds-core/2.2.1-SNAPSHOT/maven-metadata.xml
[INFO] Downloading from apache-snapshots: https://repository.apache.org/content/repositories/snapshots/org/apache/jclouds/jclouds-core/2.2.1-SNAPSHOT/jclouds-core-2.2.1-SNAPSHOT.pom
[INFO] Downloading from Nexus: http://repository.apache.org/snapshots/org/apache/jclouds/jclouds-core/2.2.1-SNAPSHOT/jclouds-core-2.2.1-SNAPSHOT.pom
[WARNING] The POM for org.apache.jclouds:jclouds-core:jar:tests:2.2.1-SNAPSHOT is missing,
no dependency information available
[INFO] Downloading from apache-snapshots: https://repository.apache.org/content/repositories/snapshots/org/apache/jclouds/jclouds-compute/2.2.1-SNAPSHOT/maven-metadata.xml
[INFO] Downloading from Nexus: http://repository.apache.org/snapshots/org/apache/jclouds/jclouds-compute/2.2.1-SNAPSHOT/maven-metadata.xml
[INFO] Downloading from apache-snapshots: https://repository.apache.org/content/repositories/snapshots/org/apache/jclouds/jclouds-compute/2.2.1-SNAPSHOT/jclouds-compute-2.2.1-SNAPSHOT.pom
[INFO] Downloading from Nexus: http://repository.apache.org/snapshots/org/apache/jclouds/jclouds-compute/2.2.1-SNAPSHOT/jclouds-compute-2.2.1-SNAPSHOT.pom
[WARNING] The POM for org.apache.jclouds:jclouds-compute:jar:tests:2.2.1-SNAPSHOT is missing,
no dependency information available
[INFO] Downloading from apache-snapshots: https://repository.apache.org/content/repositories/snapshots/org/apache/jclouds/provider/aws-ec2/2.2.1-SNAPSHOT/maven-metadata.xml
[INFO] Downloading from Nexus: http://repository.apache.org/snapshots/org/apache/jclouds/provider/aws-ec2/2.2.1-SNAPSHOT/maven-metadata.xml
[INFO] Downloading from apache-snapshots: https://repository.apache.org/content/repositories/snapshots/org/apache/jclouds/provider/aws-ec2/2.2.1-SNAPSHOT/aws-ec2-2.2.1-SNAPSHOT.pom
[INFO] Downloading from Nexus: http://repository.apache.org/snapshots/org/apache/jclouds/provider/aws-ec2/2.2.1-SNAPSHOT/aws-ec2-2.2.1-SNAPSHOT.pom
[WARNING] The POM for org.apache.jclouds.provider:aws-ec2:jar:2.2.1-SNAPSHOT is missing, no
dependency information available
[INFO] Downloading from apache-snapshots: https://repository.apache.org/content/repositories/snapshots/org/apache/jclouds/driver/jclouds-sshj/2.2.1-SNAPSHOT/maven-metadata.xml
[INFO] Downloading from Nexus: http://repository.apache.org/snapshots/org/apache/jclouds/driver/jclouds-sshj/2.2.1-SNAPSHOT/maven-metadata.xml
[INFO] Downloading from apache-snapshots: https://repository.apache.org/content/repositories/snapshots/org/apache/jclouds/driver/jclouds-sshj/2.2.1-SNAPSHOT/jclouds-sshj-2.2.1-SNAPSHOT.pom
[INFO] Downloading from Nexus: http://repository.apache.org/snapshots/org/apache/jclouds/driver/jclouds-sshj/2.2.1-SNAPSHOT/jclouds-sshj-2.2.1-SNAPSHOT.pom
[WARNING] The POM for org.apache.jclouds.driver:jclouds-sshj:jar:2.2.1-SNAPSHOT is missing,
no dependency information available
[WARNING] The POM for org.apache.jclouds:jclouds-loadbalancer:jar:tests:2.2.1-SNAPSHOT is
missing, no dependency information available
[INFO] Downloading from Nexus: http://repository.apache.org/snapshots/org/apache/jclouds/driver/jclouds-slf4j/2.2.1-SNAPSHOT/maven-metadata.xml
[INFO] Downloading from apache-snapshots: https://repository.apache.org/content/repositories/snapshots/org/apache/jclouds/driver/jclouds-slf4j/2.2.1-SNAPSHOT/maven-metadata.xml
[INFO] Downloading from apache-snapshots: https://repository.apache.org/content/repositories/snapshots/org/apache/jclouds/driver/jclouds-slf4j/2.2.1-SNAPSHOT/jclouds-slf4j-2.2.1-SNAPSHOT.pom
[INFO] Downloading from Nexus: http://repository.apache.org/snapshots/org/apache/jclouds/driver/jclouds-slf4j/2.2.1-SNAPSHOT/jclouds-slf4j-2.2.1-SNAPSHOT.pom
[WARNING] The POM for org.apache.jclouds.driver:jclouds-slf4j:jar:2.2.1-SNAPSHOT is missing,
no dependency information available
[INFO] Downloading from apache-snapshots: https://repository.apache.org/content/repositories/snapshots/org/apache/jclouds/api/sts/2.2.1-SNAPSHOT/sts-2.2.1-SNAPSHOT.jar
[INFO] Downloading from apache-snapshots: https://repository.apache.org/content/repositories/snapshots/org/apache/jclouds/jclouds-loadbalancer/2.2.1-SNAPSHOT/jclouds-loadbalancer-2.2.1-SNAPSHOT.jar
[INFO] Downloading from Nexus: http://repository.apache.org/snapshots/org/apache/jclouds/api/sts/2.2.1-SNAPSHOT/sts-2.2.1-SNAPSHOT.jar
[INFO] Downloading from Nexus: http://repository.apache.org/snapshots/org/apache/jclouds/jclouds-loadbalancer/2.2.1-SNAPSHOT/jclouds-loadbalancer-2.2.1-SNAPSHOT.jar
[INFO] ------------------------------------------------------------------------
[INFO] Reactor Summary:
[INFO] 
[INFO] Apache jclouds labs aws 2.2.1-SNAPSHOT ............. FAILURE [ 20.727 s]
[INFO] jcloud elb api ..................................... SKIPPED
[INFO] jcloud iam api ..................................... SKIPPED
[INFO] jcloud rds api ..................................... SKIPPED
[INFO] Apache jclouds :: AWS :: Glacier API ............... SKIPPED
[INFO] jclouds Amazon Elastic Load Balancer provider ...... SKIPPED
[INFO] jclouds Amazon Identity and Access Management (IAM) provider SKIPPED
[INFO] jclouds Amazon Relational Database Service provider 2.2.1-SNAPSHOT SKIPPED
[INFO] ------------------------------------------------------------------------
[INFO] BUILD FAILURE
[INFO] ------------------------------------------------------------------------
[INFO] Total time: 42.396 s
[INFO] Finished at: 2020-08-19T02:06:05Z
[INFO] ------------------------------------------------------------------------
Waiting for Jenkins to finish collecting data
[ERROR] Failed to execute goal on project elb: Could not resolve dependencies for project
org.apache.jclouds.labs:elb:bundle:2.2.1-SNAPSHOT: The following artifacts could not be resolved:
org.apache.jclouds.api:sts:jar:2.2.1-SNAPSHOT, org.apache.jclouds:jclouds-loadbalancer:jar:2.2.1-SNAPSHOT:
Could not find artifact org.apache.jclouds.api:sts:jar:2.2.1-SNAPSHOT in apache-snapshots
(https://repository.apache.org/content/repositories/snapshots) -> [Help 1]
org.apache.maven.lifecycle.LifecycleExecutionException: Failed to execute goal on project
elb: Could not resolve dependencies for project org.apache.jclouds.labs:elb:bundle:2.2.1-SNAPSHOT:
The following artifacts could not be resolved: org.apache.jclouds.api:sts:jar:2.2.1-SNAPSHOT,
org.apache.jclouds:jclouds-loadbalancer:jar:2.2.1-SNAPSHOT: Could not find artifact org.apache.jclouds.api:sts:jar:2.2.1-SNAPSHOT
in apache-snapshots (https://repository.apache.org/content/repositories/snapshots)
    at org.apache.maven.lifecycle.internal.LifecycleDependencyResolver.getDependencies (LifecycleDependencyResolver.java:269)
    at org.apache.maven.lifecycle.internal.LifecycleDependencyResolver.resolveProjectDependencies
(LifecycleDependencyResolver.java:147)
    at org.apache.maven.lifecycle.internal.MojoExecutor.ensureDependenciesAreResolved (MojoExecutor.java:263)
    at org.apache.maven.lifecycle.internal.MojoExecutor.execute (MojoExecutor.java:200)
    at org.apache.maven.lifecycle.internal.MojoExecutor.execute (MojoExecutor.java:154)
    at org.apache.maven.lifecycle.internal.MojoExecutor.execute (MojoExecutor.java:146)
    at org.apache.maven.lifecycle.internal.LifecycleModuleBuilder.buildProject (LifecycleModuleBuilder.java:117)
    at org.apache.maven.lifecycle.internal.LifecycleModuleBuilder.buildProject (LifecycleModuleBuilder.java:81)
    at org.apache.maven.lifecycle.internal.builder.singlethreaded.SingleThreadedBuilder.build
(SingleThreadedBuilder.java:56)
    at org.apache.maven.lifecycle.internal.LifecycleStarter.execute (LifecycleStarter.java:128)
    at org.apache.maven.DefaultMaven.doExecute (DefaultMaven.java:305)
    at org.apache.maven.DefaultMaven.doExecute (DefaultMaven.java:192)
    at org.apache.maven.DefaultMaven.execute (DefaultMaven.java:105)
    at org.jvnet.hudson.maven3.launcher.Maven35Launcher.main (Maven35Launcher.java:130)
    at sun.reflect.NativeMethodAccessorImpl.invoke0 (Native Method)
    at sun.reflect.NativeMethodAccessorImpl.invoke (NativeMethodAccessorImpl.java:62)
    at sun.reflect.DelegatingMethodAccessorImpl.invoke (DelegatingMethodAccessorImpl.java:43)
    at java.lang.reflect.Method.invoke (Method.java:498)
    at org.codehaus.plexus.classworlds.launcher.Launcher.launchEnhanced (Launcher.java:289)
    at org.codehaus.plexus.classworlds.launcher.Launcher.launch (Launcher.java:229)
    at jenkins.maven3.agent.Maven35Main.launch (Maven35Main.java:178)
    at sun.reflect.NativeMethodAccessorImpl.invoke0 (Native Method)
    at sun.reflect.NativeMethodAccessorImpl.invoke (NativeMethodAccessorImpl.java:62)
    at sun.reflect.DelegatingMethodAccessorImpl.invoke (DelegatingMethodAccessorImpl.java:43)
    at java.lang.reflect.Method.invoke (Method.java:498)
    at hudson.maven.Maven3Builder.call (Maven3Builder.java:139)
    at hudson.maven.Maven3Builder.call (Maven3Builder.java:70)
    at hudson.remoting.UserRequest.perform (UserRequest.java:211)
    at hudson.remoting.UserRequest.perform (UserRequest.java:54)
    at hudson.remoting.Request$2.run (Request.java:369)
    at hudson.remoting.InterceptingExecutorService$1.call (InterceptingExecutorService.java:72)
    at java.util.concurrent.FutureTask.run (FutureTask.java:266)
    at java.util.concurrent.ThreadPoolExecutor.runWorker (ThreadPoolExecutor.java:1149)
    at java.util.concurrent.ThreadPoolExecutor$Worker.run (ThreadPoolExecutor.java:624)
    at java.lang.Thread.run (Thread.java:748)
Caused by: org.apache.maven.project.DependencyResolutionException: Could not resolve dependencies
for project org.apache.jclouds.labs:elb:bundle:2.2.1-SNAPSHOT: The following artifacts could
not be resolved: org.apache.jclouds.api:sts:jar:2.2.1-SNAPSHOT, org.apache.jclouds:jclouds-loadbalancer:jar:2.2.1-SNAPSHOT:
Could not find artifact org.apache.jclouds.api:sts:jar:2.2.1-SNAPSHOT in apache-snapshots
(https://repository.apache.org/content/repositories/snapshots)
    at org.apache.maven.project.DefaultProjectDependenciesResolver.resolve (DefaultProjectDependenciesResolver.java:209)
    at org.apache.maven.lifecycle.internal.LifecycleDependencyResolver.getDependencies (LifecycleDependencyResolver.java:243)
    at org.apache.maven.lifecycle.internal.LifecycleDependencyResolver.resolveProjectDependencies
(LifecycleDependencyResolver.java:147)
    at org.apache.maven.lifecycle.internal.MojoExecutor.ensureDependenciesAreResolved (MojoExecutor.java:263)
    at org.apache.maven.lifecycle.internal.MojoExecutor.execute (MojoExecutor.java:200)
    at org.apache.maven.lifecycle.internal.MojoExecutor.execute (MojoExecutor.java:154)
    at org.apache.maven.lifecycle.internal.MojoExecutor.execute (MojoExecutor.java:146)
    at org.apache.maven.lifecycle.internal.LifecycleModuleBuilder.buildProject (LifecycleModuleBuilder.java:117)
    at org.apache.maven.lifecycle.internal.LifecycleModuleBuilder.buildProject (LifecycleModuleBuilder.java:81)
    at org.apache.maven.lifecycle.internal.builder.singlethreaded.SingleThreadedBuilder.build
(SingleThreadedBuilder.java:56)
    at org.apache.maven.lifecycle.internal.LifecycleStarter.execute (LifecycleStarter.java:128)
    at org.apache.maven.DefaultMaven.doExecute (DefaultMaven.java:305)
    at org.apache.maven.DefaultMaven.doExecute (DefaultMaven.java:192)
    at org.apache.maven.DefaultMaven.execute (DefaultMaven.java:105)
    at org.jvnet.hudson.maven3.launcher.Maven35Launcher.main (Maven35Launcher.java:130)
    at sun.reflect.NativeMethodAccessorImpl.invoke0 (Native Method)
    at sun.reflect.NativeMethodAccessorImpl.invoke (NativeMethodAccessorImpl.java:62)
    at sun.reflect.DelegatingMethodAccessorImpl.invoke (DelegatingMethodAccessorImpl.java:43)
    at java.lang.reflect.Method.invoke (Method.java:498)
    at org.codehaus.plexus.classworlds.launcher.Launcher.launchEnhanced (Launcher.java:289)
    at org.codehaus.plexus.classworlds.launcher.Launcher.launch (Launcher.java:229)
    at jenkins.maven3.agent.Maven35Main.launch (Maven35Main.java:178)
    at sun.reflect.NativeMethodAccessorImpl.invoke0 (Native Method)
    at sun.reflect.NativeMethodAccessorImpl.invoke (NativeMethodAccessorImpl.java:62)
    at sun.reflect.DelegatingMethodAccessorImpl.invoke (DelegatingMethodAccessorImpl.java:43)
    at java.lang.reflect.Method.invoke (Method.java:498)
    at hudson.maven.Maven3Builder.call (Maven3Builder.java:139)
    at hudson.maven.Maven3Builder.call (Maven3Builder.java:70)
    at hudson.remoting.UserRequest.perform (UserRequest.java:211)
    at hudson.remoting.UserRequest.perform (UserRequest.java:54)
    at hudson.remoting.Request$2.run (Request.java:369)
    at hudson.remoting.InterceptingExecutorService$1.call (InterceptingExecutorService.java:72)
    at java.util.concurrent.FutureTask.run (FutureTask.java:266)
    at java.util.concurrent.ThreadPoolExecutor.runWorker (ThreadPoolExecutor.java:1149)
    at java.util.concurrent.ThreadPoolExecutor$Worker.run (ThreadPoolExecutor.java:624)
    at java.lang.Thread.run (Thread.java:748)
Caused by: org.eclipse.aether.resolution.DependencyResolutionException: The following artifacts
could not be resolved: org.apache.jclouds.api:sts:jar:2.2.1-SNAPSHOT, org.apache.jclouds:jclouds-loadbalancer:jar:2.2.1-SNAPSHOT:
Could not find artifact org.apache.jclouds.api:sts:jar:2.2.1-SNAPSHOT in apache-snapshots
(https://repository.apache.org/content/repositories/snapshots)
    at org.eclipse.aether.internal.impl.DefaultRepositorySystem.resolveDependencies (DefaultRepositorySystem.java:355)
    at org.apache.maven.project.DefaultProjectDependenciesResolver.resolve (DefaultProjectDependenciesResolver.java:202)
    at org.apache.maven.lifecycle.internal.LifecycleDependencyResolver.getDependencies (LifecycleDependencyResolver.java:243)
    at org.apache.maven.lifecycle.internal.LifecycleDependencyResolver.resolveProjectDependencies
(LifecycleDependencyResolver.java:147)
    at org.apache.maven.lifecycle.internal.MojoExecutor.ensureDependenciesAreResolved (MojoExecutor.java:263)
    at org.apache.maven.lifecycle.internal.MojoExecutor.execute (MojoExecutor.java:200)
    at org.apache.maven.lifecycle.internal.MojoExecutor.execute (MojoExecutor.java:154)
    at org.apache.maven.lifecycle.internal.MojoExecutor.execute (MojoExecutor.java:146)
    at org.apache.maven.lifecycle.internal.LifecycleModuleBuilder.buildProject (LifecycleModuleBuilder.java:117)
    at org.apache.maven.lifecycle.internal.LifecycleModuleBuilder.buildProject (LifecycleModuleBuilder.java:81)
    at org.apache.maven.lifecycle.internal.builder.singlethreaded.SingleThreadedBuilder.build
(SingleThreadedBuilder.java:56)
    at org.apache.maven.lifecycle.internal.LifecycleStarter.execute (LifecycleStarter.java:128)
    at org.apache.maven.DefaultMaven.doExecute (DefaultMaven.java:305)
    at org.apache.maven.DefaultMaven.doExecute (DefaultMaven.java:192)
    at org.apache.maven.DefaultMaven.execute (DefaultMaven.java:105)
    at org.jvnet.hudson.maven3.launcher.Maven35Launcher.main (Maven35Launcher.java:130)
    at sun.reflect.NativeMethodAccessorImpl.invoke0 (Native Method)
    at sun.reflect.NativeMethodAccessorImpl.invoke (NativeMethodAccessorImpl.java:62)
    at sun.reflect.DelegatingMethodAccessorImpl.invoke (DelegatingMethodAccessorImpl.java:43)
    at java.lang.reflect.Method.invoke (Method.java:498)
    at org.codehaus.plexus.classworlds.launcher.Launcher.launchEnhanced (Launcher.java:289)
    at org.codehaus.plexus.classworlds.launcher.Launcher.launch (Launcher.java:229)
    at jenkins.maven3.agent.Maven35Main.launch (Maven35Main.java:178)
    at sun.reflect.NativeMethodAccessorImpl.invoke0 (Native Method)
    at sun.reflect.NativeMethodAccessorImpl.invoke (NativeMethodAccessorImpl.java:62)
    at sun.reflect.DelegatingMethodAccessorImpl.invoke (DelegatingMethodAccessorImpl.java:43)
    at java.lang.reflect.Method.invoke (Method.java:498)
    at hudson.maven.Maven3Builder.call (Maven3Builder.java:139)
    at hudson.maven.Maven3Builder.call (Maven3Builder.java:70)
    at hudson.remoting.UserRequest.perform (UserRequest.java:211)
    at hudson.remoting.UserRequest.perform (UserRequest.java:54)
    at hudson.remoting.Request$2.run (Request.java:369)
    at hudson.remoting.InterceptingExecutorService$1.call (InterceptingExecutorService.java:72)
    at java.util.concurrent.FutureTask.run (FutureTask.java:266)
    at java.util.concurrent.ThreadPoolExecutor.runWorker (ThreadPoolExecutor.java:1149)
    at java.util.concurrent.ThreadPoolExecutor$Worker.run (ThreadPoolExecutor.java:624)
    at java.lang.Thread.run (Thread.java:748)
Caused by: org.eclipse.aether.resolution.ArtifactResolutionException: The following artifacts
could not be resolved: org.apache.jclouds.api:sts:jar:2.2.1-SNAPSHOT, org.apache.jclouds:jclouds-loadbalancer:jar:2.2.1-SNAPSHOT:
Could not find artifact org.apache.jclouds.api:sts:jar:2.2.1-SNAPSHOT in apache-snapshots
(https://repository.apache.org/content/repositories/snapshots)
    at org.eclipse.aether.internal.impl.DefaultArtifactResolver.resolve (DefaultArtifactResolver.java:422)
    at org.eclipse.aether.internal.impl.DefaultArtifactResolver.resolveArtifacts (DefaultArtifactResolver.java:224)
    at org.eclipse.aether.internal.impl.DefaultRepositorySystem.resolveDependencies (DefaultRepositorySystem.java:338)
    at org.apache.maven.project.DefaultProjectDependenciesResolver.resolve (DefaultProjectDependenciesResolver.java:202)
    at org.apache.maven.lifecycle.internal.LifecycleDependencyResolver.getDependencies (LifecycleDependencyResolver.java:243)
    at org.apache.maven.lifecycle.internal.LifecycleDependencyResolver.resolveProjectDependencies
(LifecycleDependencyResolver.java:147)
    at org.apache.maven.lifecycle.internal.MojoExecutor.ensureDependenciesAreResolved (MojoExecutor.java:263)
    at org.apache.maven.lifecycle.internal.MojoExecutor.execute (MojoExecutor.java:200)
    at org.apache.maven.lifecycle.internal.MojoExecutor.execute (MojoExecutor.java:154)
    at org.apache.maven.lifecycle.internal.MojoExecutor.execute (MojoExecutor.java:146)
    at org.apache.maven.lifecycle.internal.LifecycleModuleBuilder.buildProject (LifecycleModuleBuilder.java:117)
    at org.apache.maven.lifecycle.internal.LifecycleModuleBuilder.buildProject (LifecycleModuleBuilder.java:81)
    at org.apache.maven.lifecycle.internal.builder.singlethreaded.SingleThreadedBuilder.build
(SingleThreadedBuilder.java:56)
    at org.apache.maven.lifecycle.internal.LifecycleStarter.execute (LifecycleStarter.java:128)
    at org.apache.maven.DefaultMaven.doExecute (DefaultMaven.java:305)
    at org.apache.maven.DefaultMaven.doExecute (DefaultMaven.java:192)
    at org.apache.maven.DefaultMaven.execute (DefaultMaven.java:105)
    at org.jvnet.hudson.maven3.launcher.Maven35Launcher.main (Maven35Launcher.java:130)
    at sun.reflect.NativeMethodAccessorImpl.invoke0 (Native Method)
    at sun.reflect.NativeMethodAccessorImpl.invoke (NativeMethodAccessorImpl.java:62)
    at sun.reflect.DelegatingMethodAccessorImpl.invoke (DelegatingMethodAccessorImpl.java:43)
    at java.lang.reflect.Method.invoke (Method.java:498)
    at org.codehaus.plexus.classworlds.launcher.Launcher.launchEnhanced (Launcher.java:289)
    at org.codehaus.plexus.classworlds.launcher.Launcher.launch (Launcher.java:229)
    at jenkins.maven3.agent.Maven35Main.launch (Maven35Main.java:178)
    at sun.reflect.NativeMethodAccessorImpl.invoke0 (Native Method)
    at sun.reflect.NativeMethodAccessorImpl.invoke (NativeMethodAccessorImpl.java:62)
    at sun.reflect.DelegatingMethodAccessorImpl.invoke (DelegatingMethodAccessorImpl.java:43)
    at java.lang.reflect.Method.invoke (Method.java:498)
    at hudson.maven.Maven3Builder.call (Maven3Builder.java:139)
    at hudson.maven.Maven3Builder.call (Maven3Builder.java:70)
    at hudson.remoting.UserRequest.perform (UserRequest.java:211)
    at hudson.remoting.UserRequest.perform (UserRequest.java:54)
    at hudson.remoting.Request$2.run (Request.java:369)
    at hudson.remoting.InterceptingExecutorService$1.call (InterceptingExecutorService.java:72)
    at java.util.concurrent.FutureTask.run (FutureTask.java:266)
    at java.util.concurrent.ThreadPoolExecutor.runWorker (ThreadPoolExecutor.java:1149)
    at java.util.concurrent.ThreadPoolExecutor$Worker.run (ThreadPoolExecutor.java:624)
    at java.lang.Thread.run (Thread.java:748)
Caused by: org.eclipse.aether.transfer.ArtifactNotFoundException: Could not find artifact
org.apache.jclouds.api:sts:jar:2.2.1-SNAPSHOT in apache-snapshots (https://repository.apache.org/content/repositories/snapshots)
    at org.eclipse.aether.connector.basic.ArtifactTransportListener.transferFailed (ArtifactTransportListener.java:48)
    at org.eclipse.aether.connector.basic.BasicRepositoryConnector$TaskRunner.run (BasicRepositoryConnector.java:365)
    at org.eclipse.aether.util.concurrency.RunnableErrorForwarder$1.run (RunnableErrorForwarder.java:75)
    at java.util.concurrent.ThreadPoolExecutor.runWorker (ThreadPoolExecutor.java:1149)
    at java.util.concurrent.ThreadPoolExecutor$Worker.run (ThreadPoolExecutor.java:624)
    at java.lang.Thread.run (Thread.java:748)
[ERROR] 
[ERROR] Re-run Maven using the -X switch to enable full debug logging.
[ERROR] 
[ERROR] For more information about the errors and possible solutions, please read the following
articles:
[ERROR] [Help 1] http://cwiki.apache.org/confluence/display/MAVEN/DependencyResolutionException
[ERROR] 
[ERROR] After correcting the problems, you can resume the build with the command
[ERROR]   mvn <goals> -rf :elb
[JENKINS] Archiving <https://ci-builds.apache.org/job/JClouds/job/2.2.x/job/jclouds-labs-aws-2.2.x/ws/rds/pom.xml>
to org.apache.jclouds.labs/rds/2.2.1-SNAPSHOT/rds-2.2.1-SNAPSHOT.pom
[Fast Archiver] No prior successful build to compare, so performing full copy of artifacts
[JENKINS] Archiving <https://ci-builds.apache.org/job/JClouds/job/2.2.x/job/jclouds-labs-aws-2.2.x/ws/pom.xml>
to org.apache.jclouds.labs/jclouds-labs-aws/2.2.1-SNAPSHOT/jclouds-labs-aws-2.2.1-SNAPSHOT.pom
[JENKINS] Archiving <https://ci-builds.apache.org/job/JClouds/job/2.2.x/job/jclouds-labs-aws-2.2.x/ws/target/jclouds-labs-aws-2.2.1-SNAPSHOT-tests.jar>
to org.apache.jclouds.labs/jclouds-labs-aws/2.2.1-SNAPSHOT/jclouds-labs-aws-2.2.1-SNAPSHOT-tests.jar
[Fast Archiver] No prior successful build to compare, so performing full copy of artifacts
[JENKINS] Archiving <https://ci-builds.apache.org/job/JClouds/job/2.2.x/job/jclouds-labs-aws-2.2.x/ws/elb/pom.xml>
to org.apache.jclouds.labs/elb/2.2.1-SNAPSHOT/elb-2.2.1-SNAPSHOT.pom
[Fast Archiver] No prior successful build to compare, so performing full copy of artifacts
[JENKINS] Archiving <https://ci-builds.apache.org/job/JClouds/job/2.2.x/job/jclouds-labs-aws-2.2.x/ws/aws-iam/pom.xml>
to org.apache.jclouds.labs/aws-iam/2.2.1-SNAPSHOT/aws-iam-2.2.1-SNAPSHOT.pom
[Fast Archiver] No prior successful build to compare, so performing full copy of artifacts
[JENKINS] Archiving <https://ci-builds.apache.org/job/JClouds/job/2.2.x/job/jclouds-labs-aws-2.2.x/ws/aws-rds/pom.xml>
to org.apache.jclouds.labs/aws-rds/2.2.1-SNAPSHOT/aws-rds-2.2.1-SNAPSHOT.pom
[Fast Archiver] No prior successful build to compare, so performing full copy of artifacts
[JENKINS] Archiving <https://ci-builds.apache.org/job/JClouds/job/2.2.x/job/jclouds-labs-aws-2.2.x/ws/iam/pom.xml>
to org.apache.jclouds.labs/iam/2.2.1-SNAPSHOT/iam-2.2.1-SNAPSHOT.pom
[Fast Archiver] No prior successful build to compare, so performing full copy of artifacts
[JENKINS] Archiving <https://ci-builds.apache.org/job/JClouds/job/2.2.x/job/jclouds-labs-aws-2.2.x/ws/aws-elb/pom.xml>
to org.apache.jclouds.labs/aws-elb/2.2.1-SNAPSHOT/aws-elb-2.2.1-SNAPSHOT.pom
[Fast Archiver] No prior successful build to compare, so performing full copy of artifacts
[JENKINS] Archiving <https://ci-builds.apache.org/job/JClouds/job/2.2.x/job/jclouds-labs-aws-2.2.x/ws/glacier/pom.xml>
to org.apache.jclouds.labs/glacier/2.2.1-SNAPSHOT/glacier-2.2.1-SNAPSHOT.pom
[Fast Archiver] No prior successful build to compare, so performing full copy of artifacts
channel stopped

Mime
View raw message