jclouds-notifications mailing list archives

Site index · List index
Message view « Date » · « Thread »
Top « Date » · « Thread »
From Apache Jenkins Server <jenk...@builds.apache.org>
Subject Build failed in Jenkins: JClouds » jclouds-with-credentials » jclouds-packet-live-tests #6
Date Sat, 26 Sep 2020 18:16:37 GMT
See <https://ci-builds.apache.org/job/JClouds/job/jclouds-with-credentials/job/jclouds-packet-live-tests/6/display/redirect?page=changes>

Changes:

[github] JCLOUDS-1552: Do not attempt to parse empty payload (#82)

[Andrew Gaul] JCLOUDS-1498: Upgrade to Guice 4.2.3


------------------------------------------
[...truncated 69.08 KB...]
[WARNING] 
[WARNING] Some problems were encountered while building the effective model for org.apache.jclouds.provider:profitbricks:bundle:2.3.0-SNAPSHOT
[WARNING] 'reporting.plugins.plugin.version' for org.apache.maven.plugins:maven-checkstyle-plugin
is missing. @ org.apache.jclouds:jclouds-project:2.3.0-SNAPSHOT, <https://ci-builds.apache.org/job/JClouds/job/jclouds-with-credentials/job/jclouds-packet-live-tests/ws/project/pom.xml,>
line 1196, column 15
[WARNING] 
[WARNING] Some problems were encountered while building the effective model for org.apache.jclouds.provider:rackspace-cloudblockstorage-uk:bundle:2.3.0-SNAPSHOT
[WARNING] 'reporting.plugins.plugin.version' for org.apache.maven.plugins:maven-checkstyle-plugin
is missing. @ org.apache.jclouds:jclouds-project:2.3.0-SNAPSHOT, <https://ci-builds.apache.org/job/JClouds/job/jclouds-with-credentials/job/jclouds-packet-live-tests/ws/project/pom.xml,>
line 1196, column 15
[WARNING] 
[WARNING] Some problems were encountered while building the effective model for org.apache.jclouds.provider:rackspace-cloudblockstorage-us:bundle:2.3.0-SNAPSHOT
[WARNING] 'reporting.plugins.plugin.version' for org.apache.maven.plugins:maven-checkstyle-plugin
is missing. @ org.apache.jclouds:jclouds-project:2.3.0-SNAPSHOT, <https://ci-builds.apache.org/job/JClouds/job/jclouds-with-credentials/job/jclouds-packet-live-tests/ws/project/pom.xml,>
line 1196, column 15
[WARNING] 
[WARNING] Some problems were encountered while building the effective model for org.apache.jclouds.provider:rackspace-clouddatabases-uk:bundle:2.3.0-SNAPSHOT
[WARNING] 'reporting.plugins.plugin.version' for org.apache.maven.plugins:maven-checkstyle-plugin
is missing. @ org.apache.jclouds:jclouds-project:2.3.0-SNAPSHOT, <https://ci-builds.apache.org/job/JClouds/job/jclouds-with-credentials/job/jclouds-packet-live-tests/ws/project/pom.xml,>
line 1196, column 15
[WARNING] 
[WARNING] Some problems were encountered while building the effective model for org.apache.jclouds.provider:rackspace-clouddatabases-us:bundle:2.3.0-SNAPSHOT
[WARNING] 'reporting.plugins.plugin.version' for org.apache.maven.plugins:maven-checkstyle-plugin
is missing. @ org.apache.jclouds:jclouds-project:2.3.0-SNAPSHOT, <https://ci-builds.apache.org/job/JClouds/job/jclouds-with-credentials/job/jclouds-packet-live-tests/ws/project/pom.xml,>
line 1196, column 15
[WARNING] 
[WARNING] Some problems were encountered while building the effective model for org.apache.jclouds.provider:rackspace-clouddns-uk:bundle:2.3.0-SNAPSHOT
[WARNING] 'reporting.plugins.plugin.version' for org.apache.maven.plugins:maven-checkstyle-plugin
is missing. @ org.apache.jclouds:jclouds-project:2.3.0-SNAPSHOT, <https://ci-builds.apache.org/job/JClouds/job/jclouds-with-credentials/job/jclouds-packet-live-tests/ws/project/pom.xml,>
line 1196, column 15
[WARNING] 
[WARNING] Some problems were encountered while building the effective model for org.apache.jclouds.provider:rackspace-clouddns-us:bundle:2.3.0-SNAPSHOT
[WARNING] 'reporting.plugins.plugin.version' for org.apache.maven.plugins:maven-checkstyle-plugin
is missing. @ org.apache.jclouds:jclouds-project:2.3.0-SNAPSHOT, <https://ci-builds.apache.org/job/JClouds/job/jclouds-with-credentials/job/jclouds-packet-live-tests/ws/project/pom.xml,>
line 1196, column 15
[WARNING] 
[WARNING] Some problems were encountered while building the effective model for org.apache.jclouds.provider:rackspace-cloudfiles-uk:bundle:2.3.0-SNAPSHOT
[WARNING] 'reporting.plugins.plugin.version' for org.apache.maven.plugins:maven-checkstyle-plugin
is missing. @ org.apache.jclouds:jclouds-project:2.3.0-SNAPSHOT, <https://ci-builds.apache.org/job/JClouds/job/jclouds-with-credentials/job/jclouds-packet-live-tests/ws/project/pom.xml,>
line 1196, column 15
[WARNING] 
[WARNING] Some problems were encountered while building the effective model for org.apache.jclouds.provider:rackspace-cloudfiles-us:bundle:2.3.0-SNAPSHOT
[WARNING] 'reporting.plugins.plugin.version' for org.apache.maven.plugins:maven-checkstyle-plugin
is missing. @ org.apache.jclouds:jclouds-project:2.3.0-SNAPSHOT, <https://ci-builds.apache.org/job/JClouds/job/jclouds-with-credentials/job/jclouds-packet-live-tests/ws/project/pom.xml,>
line 1196, column 15
[WARNING] 
[WARNING] Some problems were encountered while building the effective model for org.apache.jclouds.provider:rackspace-cloudloadbalancers-uk:bundle:2.3.0-SNAPSHOT
[WARNING] 'reporting.plugins.plugin.version' for org.apache.maven.plugins:maven-checkstyle-plugin
is missing. @ org.apache.jclouds:jclouds-project:2.3.0-SNAPSHOT, <https://ci-builds.apache.org/job/JClouds/job/jclouds-with-credentials/job/jclouds-packet-live-tests/ws/project/pom.xml,>
line 1196, column 15
[WARNING] 
[WARNING] Some problems were encountered while building the effective model for org.apache.jclouds.provider:rackspace-cloudloadbalancers-us:bundle:2.3.0-SNAPSHOT
[WARNING] 'reporting.plugins.plugin.version' for org.apache.maven.plugins:maven-checkstyle-plugin
is missing. @ org.apache.jclouds:jclouds-project:2.3.0-SNAPSHOT, <https://ci-builds.apache.org/job/JClouds/job/jclouds-with-credentials/job/jclouds-packet-live-tests/ws/project/pom.xml,>
line 1196, column 15
[WARNING] 
[WARNING] Some problems were encountered while building the effective model for org.apache.jclouds.provider:rackspace-cloudnetworks-uk:bundle:2.3.0-SNAPSHOT
[WARNING] 'reporting.plugins.plugin.version' for org.apache.maven.plugins:maven-checkstyle-plugin
is missing. @ org.apache.jclouds:jclouds-project:2.3.0-SNAPSHOT, <https://ci-builds.apache.org/job/JClouds/job/jclouds-with-credentials/job/jclouds-packet-live-tests/ws/project/pom.xml,>
line 1196, column 15
[WARNING] 
[WARNING] Some problems were encountered while building the effective model for org.apache.jclouds.provider:rackspace-cloudnetworks-us:bundle:2.3.0-SNAPSHOT
[WARNING] 'reporting.plugins.plugin.version' for org.apache.maven.plugins:maven-checkstyle-plugin
is missing. @ org.apache.jclouds:jclouds-project:2.3.0-SNAPSHOT, <https://ci-builds.apache.org/job/JClouds/job/jclouds-with-credentials/job/jclouds-packet-live-tests/ws/project/pom.xml,>
line 1196, column 15
[WARNING] 
[WARNING] Some problems were encountered while building the effective model for org.apache.jclouds.provider:rackspace-cloudservers-uk:bundle:2.3.0-SNAPSHOT
[WARNING] 'reporting.plugins.plugin.version' for org.apache.maven.plugins:maven-checkstyle-plugin
is missing. @ org.apache.jclouds:jclouds-project:2.3.0-SNAPSHOT, <https://ci-builds.apache.org/job/JClouds/job/jclouds-with-credentials/job/jclouds-packet-live-tests/ws/project/pom.xml,>
line 1196, column 15
[WARNING] 
[WARNING] Some problems were encountered while building the effective model for org.apache.jclouds.provider:rackspace-cloudservers-us:bundle:2.3.0-SNAPSHOT
[WARNING] 'reporting.plugins.plugin.version' for org.apache.maven.plugins:maven-checkstyle-plugin
is missing. @ org.apache.jclouds:jclouds-project:2.3.0-SNAPSHOT, <https://ci-builds.apache.org/job/JClouds/job/jclouds-with-credentials/job/jclouds-packet-live-tests/ws/project/pom.xml,>
line 1196, column 15
[WARNING] 
[WARNING] Some problems were encountered while building the effective model for org.apache.jclouds.provider:serverlove-z1-man:bundle:2.3.0-SNAPSHOT
[WARNING] 'reporting.plugins.plugin.version' for org.apache.maven.plugins:maven-checkstyle-plugin
is missing. @ org.apache.jclouds:jclouds-project:2.3.0-SNAPSHOT, <https://ci-builds.apache.org/job/JClouds/job/jclouds-with-credentials/job/jclouds-packet-live-tests/ws/project/pom.xml,>
line 1196, column 15
[WARNING] 
[WARNING] Some problems were encountered while building the effective model for org.apache.jclouds.provider:skalicloud-sdg-my:bundle:2.3.0-SNAPSHOT
[WARNING] 'reporting.plugins.plugin.version' for org.apache.maven.plugins:maven-checkstyle-plugin
is missing. @ org.apache.jclouds:jclouds-project:2.3.0-SNAPSHOT, <https://ci-builds.apache.org/job/JClouds/job/jclouds-with-credentials/job/jclouds-packet-live-tests/ws/project/pom.xml,>
line 1196, column 15
[WARNING] 
[WARNING] Some problems were encountered while building the effective model for org.apache.jclouds.provider:softlayer:bundle:2.3.0-SNAPSHOT
[WARNING] 'reporting.plugins.plugin.version' for org.apache.maven.plugins:maven-checkstyle-plugin
is missing. @ org.apache.jclouds:jclouds-project:2.3.0-SNAPSHOT, <https://ci-builds.apache.org/job/JClouds/job/jclouds-with-credentials/job/jclouds-packet-live-tests/ws/project/pom.xml,>
line 1196, column 15
[WARNING] 
[WARNING] Some problems were encountered while building the effective model for org.apache.jclouds.provider:ultradns-ws:bundle:2.3.0-SNAPSHOT
[WARNING] 'reporting.plugins.plugin.version' for org.apache.maven.plugins:maven-checkstyle-plugin
is missing. @ org.apache.jclouds:jclouds-project:2.3.0-SNAPSHOT, <https://ci-builds.apache.org/job/JClouds/job/jclouds-with-credentials/job/jclouds-packet-live-tests/ws/project/pom.xml,>
line 1196, column 15
[WARNING] 
[WARNING] Some problems were encountered while building the effective model for org.apache.jclouds.provider:jclouds-providers-project:pom:2.3.0-SNAPSHOT
[WARNING] 'reporting.plugins.plugin.version' for org.apache.maven.plugins:maven-checkstyle-plugin
is missing. @ org.apache.jclouds:jclouds-project:2.3.0-SNAPSHOT, <https://ci-builds.apache.org/job/JClouds/job/jclouds-with-credentials/job/jclouds-packet-live-tests/ws/project/pom.xml,>
line 1196, column 15
[WARNING] 
[WARNING] Some problems were encountered while building the effective model for org.apache.jclouds:jclouds-blobstore:bundle:2.3.0-SNAPSHOT
[WARNING] 'reporting.plugins.plugin.version' for org.apache.maven.plugins:maven-checkstyle-plugin
is missing. @ org.apache.jclouds:jclouds-project:2.3.0-SNAPSHOT, <https://ci-builds.apache.org/job/JClouds/job/jclouds-with-credentials/job/jclouds-packet-live-tests/ws/project/pom.xml,>
line 1196, column 15
[WARNING] 
[WARNING] Some problems were encountered while building the effective model for org.apache.jclouds.api:servermanager:bundle:2.3.0-SNAPSHOT
[WARNING] 'reporting.plugins.plugin.version' for org.apache.maven.plugins:maven-checkstyle-plugin
is missing. @ org.apache.jclouds:jclouds-project:2.3.0-SNAPSHOT, <https://ci-builds.apache.org/job/JClouds/job/jclouds-with-credentials/job/jclouds-packet-live-tests/ws/project/pom.xml,>
line 1196, column 15
[WARNING] 
[WARNING] Some problems were encountered while building the effective model for org.apache.jclouds:jclouds-skeletons-project:pom:2.3.0-SNAPSHOT
[WARNING] 'reporting.plugins.plugin.version' for org.apache.maven.plugins:maven-checkstyle-plugin
is missing. @ org.apache.jclouds:jclouds-project:2.3.0-SNAPSHOT, <https://ci-builds.apache.org/job/JClouds/job/jclouds-with-credentials/job/jclouds-packet-live-tests/ws/project/pom.xml,>
line 1196, column 15
[WARNING] 
[WARNING] Some problems were encountered while building the effective model for org.apache.jclouds.driver:jclouds-apachehc:bundle:2.3.0-SNAPSHOT
[WARNING] 'reporting.plugins.plugin.version' for org.apache.maven.plugins:maven-checkstyle-plugin
is missing. @ org.apache.jclouds:jclouds-project:2.3.0-SNAPSHOT, <https://ci-builds.apache.org/job/JClouds/job/jclouds-with-credentials/job/jclouds-packet-live-tests/ws/project/pom.xml,>
line 1196, column 15
[WARNING] 
[WARNING] Some problems were encountered while building the effective model for org.apache.jclouds.driver:jclouds-bouncycastle:bundle:2.3.0-SNAPSHOT
[WARNING] 'reporting.plugins.plugin.version' for org.apache.maven.plugins:maven-checkstyle-plugin
is missing. @ org.apache.jclouds:jclouds-project:2.3.0-SNAPSHOT, <https://ci-builds.apache.org/job/JClouds/job/jclouds-with-credentials/job/jclouds-packet-live-tests/ws/project/pom.xml,>
line 1196, column 15
[WARNING] 
[WARNING] Some problems were encountered while building the effective model for org.apache.jclouds.driver:jclouds-enterprise:bundle:2.3.0-SNAPSHOT
[WARNING] 'reporting.plugins.plugin.version' for org.apache.maven.plugins:maven-checkstyle-plugin
is missing. @ org.apache.jclouds:jclouds-project:2.3.0-SNAPSHOT, <https://ci-builds.apache.org/job/JClouds/job/jclouds-with-credentials/job/jclouds-packet-live-tests/ws/project/pom.xml,>
line 1196, column 15
[WARNING] 
[WARNING] Some problems were encountered while building the effective model for org.apache.jclouds.driver:jclouds-gae:bundle:2.3.0-SNAPSHOT
[WARNING] 'reporting.plugins.plugin.version' for org.apache.maven.plugins:maven-checkstyle-plugin
is missing. @ org.apache.jclouds:jclouds-project:2.3.0-SNAPSHOT, <https://ci-builds.apache.org/job/JClouds/job/jclouds-with-credentials/job/jclouds-packet-live-tests/ws/project/pom.xml,>
line 1196, column 15
[WARNING] 
[WARNING] Some problems were encountered while building the effective model for org.apache.jclouds.driver:jclouds-joda:bundle:2.3.0-SNAPSHOT
[WARNING] 'reporting.plugins.plugin.version' for org.apache.maven.plugins:maven-checkstyle-plugin
is missing. @ org.apache.jclouds:jclouds-project:2.3.0-SNAPSHOT, <https://ci-builds.apache.org/job/JClouds/job/jclouds-with-credentials/job/jclouds-packet-live-tests/ws/project/pom.xml,>
line 1196, column 15
[WARNING] 
[WARNING] Some problems were encountered while building the effective model for org.apache.jclouds.driver:jclouds-jsch:bundle:2.3.0-SNAPSHOT
[WARNING] 'reporting.plugins.plugin.version' for org.apache.maven.plugins:maven-checkstyle-plugin
is missing. @ org.apache.jclouds:jclouds-project:2.3.0-SNAPSHOT, <https://ci-builds.apache.org/job/JClouds/job/jclouds-with-credentials/job/jclouds-packet-live-tests/ws/project/pom.xml,>
line 1196, column 15
[WARNING] 
[WARNING] Some problems were encountered while building the effective model for org.apache.jclouds.driver:jclouds-log4j:bundle:2.3.0-SNAPSHOT
[WARNING] 'reporting.plugins.plugin.version' for org.apache.maven.plugins:maven-checkstyle-plugin
is missing. @ org.apache.jclouds:jclouds-project:2.3.0-SNAPSHOT, <https://ci-builds.apache.org/job/JClouds/job/jclouds-with-credentials/job/jclouds-packet-live-tests/ws/project/pom.xml,>
line 1196, column 15
[WARNING] 
[WARNING] Some problems were encountered while building the effective model for org.apache.jclouds.driver:jclouds-netty:bundle:2.3.0-SNAPSHOT
[WARNING] 'reporting.plugins.plugin.version' for org.apache.maven.plugins:maven-checkstyle-plugin
is missing. @ org.apache.jclouds:jclouds-project:2.3.0-SNAPSHOT, <https://ci-builds.apache.org/job/JClouds/job/jclouds-with-credentials/job/jclouds-packet-live-tests/ws/project/pom.xml,>
line 1196, column 15
[WARNING] 
[WARNING] Some problems were encountered while building the effective model for org.apache.jclouds.driver:jclouds-okhttp:bundle:2.3.0-SNAPSHOT
[WARNING] 'reporting.plugins.plugin.version' for org.apache.maven.plugins:maven-checkstyle-plugin
is missing. @ org.apache.jclouds:jclouds-project:2.3.0-SNAPSHOT, <https://ci-builds.apache.org/job/JClouds/job/jclouds-with-credentials/job/jclouds-packet-live-tests/ws/project/pom.xml,>
line 1196, column 15
[WARNING] 
[WARNING] Some problems were encountered while building the effective model for org.apache.jclouds.driver:jclouds-slf4j:bundle:2.3.0-SNAPSHOT
[WARNING] 'reporting.plugins.plugin.version' for org.apache.maven.plugins:maven-checkstyle-plugin
is missing. @ org.apache.jclouds:jclouds-project:2.3.0-SNAPSHOT, <https://ci-builds.apache.org/job/JClouds/job/jclouds-with-credentials/job/jclouds-packet-live-tests/ws/project/pom.xml,>
line 1196, column 15
[WARNING] 
[WARNING] Some problems were encountered while building the effective model for org.apache.jclouds.driver:jclouds-sshj:bundle:2.3.0-SNAPSHOT
[WARNING] 'reporting.plugins.plugin.version' for org.apache.maven.plugins:maven-checkstyle-plugin
is missing. @ org.apache.jclouds:jclouds-project:2.3.0-SNAPSHOT, <https://ci-builds.apache.org/job/JClouds/job/jclouds-with-credentials/job/jclouds-packet-live-tests/ws/project/pom.xml,>
line 1196, column 15
[WARNING] 
[WARNING] Some problems were encountered while building the effective model for org.apache.jclouds:jclouds-drivers-project:pom:2.3.0-SNAPSHOT
[WARNING] 'reporting.plugins.plugin.version' for org.apache.maven.plugins:maven-checkstyle-plugin
is missing. @ org.apache.jclouds:jclouds-project:2.3.0-SNAPSHOT, <https://ci-builds.apache.org/job/JClouds/job/jclouds-with-credentials/job/jclouds-packet-live-tests/ws/project/pom.xml,>
line 1196, column 15
[WARNING] 
[WARNING] Some problems were encountered while building the effective model for org.apache.jclouds:jclouds-scriptbuilder:bundle:2.3.0-SNAPSHOT
[WARNING] 'reporting.plugins.plugin.version' for org.apache.maven.plugins:maven-checkstyle-plugin
is missing. @ org.apache.jclouds:jclouds-project:2.3.0-SNAPSHOT, <https://ci-builds.apache.org/job/JClouds/job/jclouds-with-credentials/job/jclouds-packet-live-tests/ws/project/pom.xml,>
line 1196, column 15
[WARNING] 
[WARNING] Some problems were encountered while building the effective model for org.apache.jclouds:jclouds-allcompute:jar:2.3.0-SNAPSHOT
[WARNING] 'reporting.plugins.plugin.version' for org.apache.maven.plugins:maven-checkstyle-plugin
is missing. @ org.apache.jclouds:jclouds-project:2.3.0-SNAPSHOT, <https://ci-builds.apache.org/job/JClouds/job/jclouds-with-credentials/job/jclouds-packet-live-tests/ws/project/pom.xml,>
line 1196, column 15
[WARNING] 
[WARNING] Some problems were encountered while building the effective model for org.apache.jclouds:jclouds-allblobstore:jar:2.3.0-SNAPSHOT
[WARNING] 'reporting.plugins.plugin.version' for org.apache.maven.plugins:maven-checkstyle-plugin
is missing. @ org.apache.jclouds:jclouds-project:2.3.0-SNAPSHOT, <https://ci-builds.apache.org/job/JClouds/job/jclouds-with-credentials/job/jclouds-packet-live-tests/ws/project/pom.xml,>
line 1196, column 15
[WARNING] 
[WARNING] Some problems were encountered while building the effective model for org.apache.jclouds:jclouds-allloadbalancer:jar:2.3.0-SNAPSHOT
[WARNING] 'reporting.plugins.plugin.version' for org.apache.maven.plugins:maven-checkstyle-plugin
is missing. @ org.apache.jclouds:jclouds-project:2.3.0-SNAPSHOT, <https://ci-builds.apache.org/job/JClouds/job/jclouds-with-credentials/job/jclouds-packet-live-tests/ws/project/pom.xml,>
line 1196, column 15
[WARNING] 
[WARNING] Some problems were encountered while building the effective model for org.apache.jclouds:jclouds-all:jar:2.3.0-SNAPSHOT
[WARNING] 'reporting.plugins.plugin.version' for org.apache.maven.plugins:maven-checkstyle-plugin
is missing. @ org.apache.jclouds:jclouds-project:2.3.0-SNAPSHOT, <https://ci-builds.apache.org/job/JClouds/job/jclouds-with-credentials/job/jclouds-packet-live-tests/ws/project/pom.xml,>
line 1196, column 15
[WARNING] 
[WARNING] Some problems were encountered while building the effective model for org.apache.jclouds:jclouds:pom:2.3.0-SNAPSHOT
[WARNING] 'build.pluginManagement.plugins.plugin.(groupId:artifactId)' must be unique but
found duplicate declaration of plugin org.apache.rat:apache-rat-plugin @ org.apache.jclouds:jclouds-project:2.3.0-SNAPSHOT,
<https://ci-builds.apache.org/job/JClouds/job/jclouds-with-credentials/job/jclouds-packet-live-tests/ws/project/pom.xml,>
line 997, column 17
[WARNING] 'reporting.plugins.plugin.version' for org.apache.maven.plugins:maven-checkstyle-plugin
is missing. @ org.apache.jclouds:jclouds-project:2.3.0-SNAPSHOT, <https://ci-builds.apache.org/job/JClouds/job/jclouds-with-credentials/job/jclouds-packet-live-tests/ws/project/pom.xml,>
line 1196, column 15
[WARNING] 
[WARNING] It is highly recommended to fix these problems because they threaten the stability
of your build.
[WARNING] 
[WARNING] For this reason, future Maven versions might no longer support building such malformed
projects.
[WARNING] 
[INFO] 
[INFO] -----------------< org.apache.jclouds.provider:packet >-----------------
[INFO] Building jclouds Packet compute API 2.3.0-SNAPSHOT
[INFO] -------------------------------[ bundle ]-------------------------------
Downloading: http://repository.apache.org/snapshots/org/apache/jclouds/jclouds-compute/2.3.0-SNAPSHOT/maven-metadata.xml
Downloading: https://repository.apache.org/content/repositories/snapshots/org/apache/jclouds/jclouds-compute/2.3.0-SNAPSHOT/maven-metadata.xml
Downloaded: http://repository.apache.org/snapshots/org/apache/jclouds/jclouds-compute/2.3.0-SNAPSHOT/maven-metadata.xml
(2 KB at 2.2 KB/sec)
Downloaded: https://repository.apache.org/content/repositories/snapshots/org/apache/jclouds/jclouds-compute/2.3.0-SNAPSHOT/maven-metadata.xml
(2 KB at 1.1 KB/sec)
Downloading: https://repository.apache.org/content/repositories/snapshots/org/apache/jclouds/jclouds-compute/2.3.0-SNAPSHOT/jclouds-compute-2.3.0-20200926.070144-31.pom
Downloaded: https://repository.apache.org/content/repositories/snapshots/org/apache/jclouds/jclouds-compute/2.3.0-SNAPSHOT/jclouds-compute-2.3.0-20200926.070144-31.pom
(3 KB at 8.4 KB/sec)
Downloading: https://repository.apache.org/content/repositories/snapshots/org/apache/jclouds/jclouds-scriptbuilder/2.3.0-SNAPSHOT/maven-metadata.xml
Downloading: http://repository.apache.org/snapshots/org/apache/jclouds/jclouds-scriptbuilder/2.3.0-SNAPSHOT/maven-metadata.xml
Downloaded: https://repository.apache.org/content/repositories/snapshots/org/apache/jclouds/jclouds-scriptbuilder/2.3.0-SNAPSHOT/maven-metadata.xml
(2 KB at 4.9 KB/sec)
Downloaded: http://repository.apache.org/snapshots/org/apache/jclouds/jclouds-scriptbuilder/2.3.0-SNAPSHOT/maven-metadata.xml
(2 KB at 4.4 KB/sec)
Downloading: https://repository.apache.org/content/repositories/snapshots/org/apache/jclouds/jclouds-scriptbuilder/2.3.0-SNAPSHOT/jclouds-scriptbuilder-2.3.0-20200926.070012-31.pom
Downloaded: https://repository.apache.org/content/repositories/snapshots/org/apache/jclouds/jclouds-scriptbuilder/2.3.0-SNAPSHOT/jclouds-scriptbuilder-2.3.0-20200926.070012-31.pom
(3 KB at 8.5 KB/sec)
Downloading: https://repository.apache.org/content/repositories/snapshots/org/apache/jclouds/jclouds-core/2.3.0-SNAPSHOT/maven-metadata.xml
Downloading: http://repository.apache.org/snapshots/org/apache/jclouds/jclouds-core/2.3.0-SNAPSHOT/maven-metadata.xml
Downloaded: https://repository.apache.org/content/repositories/snapshots/org/apache/jclouds/jclouds-core/2.3.0-SNAPSHOT/maven-metadata.xml
(2 KB at 4.9 KB/sec)
Downloaded: http://repository.apache.org/snapshots/org/apache/jclouds/jclouds-core/2.3.0-SNAPSHOT/maven-metadata.xml
(2 KB at 4.8 KB/sec)
Downloading: https://repository.apache.org/content/repositories/snapshots/org/apache/jclouds/jclouds-core/2.3.0-SNAPSHOT/jclouds-core-2.3.0-20200926.065612-31.pom
Downloaded: https://repository.apache.org/content/repositories/snapshots/org/apache/jclouds/jclouds-core/2.3.0-SNAPSHOT/jclouds-core-2.3.0-20200926.065612-31.pom
(6 KB at 16.2 KB/sec)
Downloading: https://repo.maven.apache.org/maven2/com/google/inject/extensions/guice-assistedinject/4.2.3/guice-assistedinject-4.2.3.pom
Downloaded: https://repo.maven.apache.org/maven2/com/google/inject/extensions/guice-assistedinject/4.2.3/guice-assistedinject-4.2.3.pom
(938 B at 6.6 KB/sec)
Downloading: https://repo.maven.apache.org/maven2/com/google/inject/extensions/extensions-parent/4.2.3/extensions-parent-4.2.3.pom
Downloaded: https://repo.maven.apache.org/maven2/com/google/inject/extensions/extensions-parent/4.2.3/extensions-parent-4.2.3.pom
(4 KB at 164.2 KB/sec)
Downloading: https://repo.maven.apache.org/maven2/com/google/inject/guice-parent/4.2.3/guice-parent-4.2.3.pom
Downloaded: https://repo.maven.apache.org/maven2/com/google/inject/guice-parent/4.2.3/guice-parent-4.2.3.pom
(16 KB at 723.4 KB/sec)
Downloading: https://repo.maven.apache.org/maven2/com/google/inject/guice/4.2.3/guice-4.2.3.pom
Downloaded: https://repo.maven.apache.org/maven2/com/google/inject/guice/4.2.3/guice-4.2.3.pom
(11 KB at 534.9 KB/sec)
Downloading: https://repository.apache.org/content/repositories/snapshots/org/apache/jclouds/jclouds-gson/2.3.0-SNAPSHOT/maven-metadata.xml
Downloading: http://repository.apache.org/snapshots/org/apache/jclouds/jclouds-gson/2.3.0-SNAPSHOT/maven-metadata.xml
Downloaded: https://repository.apache.org/content/repositories/snapshots/org/apache/jclouds/jclouds-gson/2.3.0-SNAPSHOT/maven-metadata.xml
(2 KB at 4.3 KB/sec)
Downloaded: http://repository.apache.org/snapshots/org/apache/jclouds/jclouds-gson/2.3.0-SNAPSHOT/maven-metadata.xml
(2 KB at 4.2 KB/sec)
Downloading: https://repository.apache.org/content/repositories/snapshots/org/apache/jclouds/jclouds-gson/2.3.0-SNAPSHOT/jclouds-gson-2.3.0-20200926.065310-35.pom
Downloaded: https://repository.apache.org/content/repositories/snapshots/org/apache/jclouds/jclouds-gson/2.3.0-SNAPSHOT/jclouds-gson-2.3.0-20200926.065310-35.pom
(2 KB at 6.1 KB/sec)
Downloading: https://repository.apache.org/content/repositories/snapshots/org/apache/jclouds/driver/jclouds-slf4j/2.3.0-SNAPSHOT/maven-metadata.xml
Downloading: http://repository.apache.org/snapshots/org/apache/jclouds/driver/jclouds-slf4j/2.3.0-SNAPSHOT/maven-metadata.xml
Downloaded: https://repository.apache.org/content/repositories/snapshots/org/apache/jclouds/driver/jclouds-slf4j/2.3.0-SNAPSHOT/maven-metadata.xml
(2 KB at 4.9 KB/sec)
Downloaded: http://repository.apache.org/snapshots/org/apache/jclouds/driver/jclouds-slf4j/2.3.0-SNAPSHOT/maven-metadata.xml
(2 KB at 4.8 KB/sec)
Downloading: https://repository.apache.org/content/repositories/snapshots/org/apache/jclouds/driver/jclouds-slf4j/2.3.0-SNAPSHOT/jclouds-slf4j-2.3.0-20200926.065650-31.pom
Downloaded: https://repository.apache.org/content/repositories/snapshots/org/apache/jclouds/driver/jclouds-slf4j/2.3.0-SNAPSHOT/jclouds-slf4j-2.3.0-20200926.065650-31.pom
(3 KB at 7.7 KB/sec)
Downloading: https://repository.apache.org/content/repositories/snapshots/org/apache/jclouds/driver/jclouds-sshj/2.3.0-SNAPSHOT/maven-metadata.xml
Downloading: http://repository.apache.org/snapshots/org/apache/jclouds/driver/jclouds-sshj/2.3.0-SNAPSHOT/maven-metadata.xml
Downloaded: https://repository.apache.org/content/repositories/snapshots/org/apache/jclouds/driver/jclouds-sshj/2.3.0-SNAPSHOT/maven-metadata.xml
(2 KB at 5.0 KB/sec)
Downloaded: http://repository.apache.org/snapshots/org/apache/jclouds/driver/jclouds-sshj/2.3.0-SNAPSHOT/maven-metadata.xml
(2 KB at 4.8 KB/sec)
Downloading: https://repository.apache.org/content/repositories/snapshots/org/apache/jclouds/driver/jclouds-sshj/2.3.0-SNAPSHOT/jclouds-sshj-2.3.0-20200926.070600-30.pom
Downloaded: https://repository.apache.org/content/repositories/snapshots/org/apache/jclouds/driver/jclouds-sshj/2.3.0-SNAPSHOT/jclouds-sshj-2.3.0-20200926.070600-30.pom
(6 KB at 17.1 KB/sec)
Downloading: http://repository.apache.org/snapshots/org/apache/jclouds/driver/jclouds-bouncycastle/2.3.0-SNAPSHOT/maven-metadata.xml
Downloading: https://repository.apache.org/content/repositories/snapshots/org/apache/jclouds/driver/jclouds-bouncycastle/2.3.0-SNAPSHOT/maven-metadata.xml
Downloaded: https://repository.apache.org/content/repositories/snapshots/org/apache/jclouds/driver/jclouds-bouncycastle/2.3.0-SNAPSHOT/maven-metadata.xml
(2 KB at 4.6 KB/sec)
Downloaded: http://repository.apache.org/snapshots/org/apache/jclouds/driver/jclouds-bouncycastle/2.3.0-SNAPSHOT/maven-metadata.xml
(2 KB at 4.6 KB/sec)
Downloading: https://repository.apache.org/content/repositories/snapshots/org/apache/jclouds/driver/jclouds-bouncycastle/2.3.0-SNAPSHOT/jclouds-bouncycastle-2.3.0-20200926.070521-30.pom
Downloaded: https://repository.apache.org/content/repositories/snapshots/org/apache/jclouds/driver/jclouds-bouncycastle/2.3.0-SNAPSHOT/jclouds-bouncycastle-2.3.0-20200926.070521-30.pom
(3 KB at 7.2 KB/sec)
Downloading: https://repository.apache.org/content/repositories/snapshots/org/apache/jclouds/jclouds-compute/2.3.0-SNAPSHOT/jclouds-compute-2.3.0-20200926.070144-31.jar
Downloading: https://repository.apache.org/content/repositories/snapshots/org/apache/jclouds/jclouds-scriptbuilder/2.3.0-SNAPSHOT/jclouds-scriptbuilder-2.3.0-20200926.070012-31.jar
Downloading: https://repository.apache.org/content/repositories/snapshots/org/apache/jclouds/jclouds-core/2.3.0-SNAPSHOT/jclouds-core-2.3.0-20200926.065612-31.jar
Downloading: https://repository.apache.org/content/repositories/snapshots/org/apache/jclouds/jclouds-core/2.3.0-SNAPSHOT/jclouds-core-2.3.0-20200926.065612-31-tests.jar
Downloading: https://repository.apache.org/content/repositories/snapshots/org/apache/jclouds/jclouds-gson/2.3.0-SNAPSHOT/jclouds-gson-2.3.0-20200926.065310-35.jar
Downloaded: https://repository.apache.org/content/repositories/snapshots/org/apache/jclouds/jclouds-compute/2.3.0-SNAPSHOT/jclouds-compute-2.3.0-20200926.070144-31.jar
(511 KB at 463.3 KB/sec)
Downloading: https://repository.apache.org/content/repositories/snapshots/org/apache/jclouds/jclouds-compute/2.3.0-SNAPSHOT/jclouds-compute-2.3.0-20200926.070144-31-tests.jar
Downloaded: https://repository.apache.org/content/repositories/snapshots/org/apache/jclouds/jclouds-scriptbuilder/2.3.0-SNAPSHOT/jclouds-scriptbuilder-2.3.0-20200926.070012-31.jar
(170 KB at 153.1 KB/sec)
Downloading: https://repository.apache.org/content/repositories/snapshots/org/apache/jclouds/driver/jclouds-slf4j/2.3.0-SNAPSHOT/jclouds-slf4j-2.3.0-20200926.065650-31-tests.jar
Downloaded: https://repository.apache.org/content/repositories/snapshots/org/apache/jclouds/jclouds-gson/2.3.0-SNAPSHOT/jclouds-gson-2.3.0-20200926.065310-35.jar
(248 KB at 200.4 KB/sec)
Downloading: https://repository.apache.org/content/repositories/snapshots/org/apache/jclouds/driver/jclouds-slf4j/2.3.0-SNAPSHOT/jclouds-slf4j-2.3.0-20200926.065650-31.jar
Downloaded: https://repository.apache.org/content/repositories/snapshots/org/apache/jclouds/jclouds-core/2.3.0-SNAPSHOT/jclouds-core-2.3.0-20200926.065612-31-tests.jar
(601 KB at 407.4 KB/sec)
Downloading: https://repository.apache.org/content/repositories/snapshots/org/apache/jclouds/driver/jclouds-sshj/2.3.0-SNAPSHOT/jclouds-sshj-2.3.0-20200926.070600-30.jar
Downloaded: https://repository.apache.org/content/repositories/snapshots/org/apache/jclouds/jclouds-core/2.3.0-SNAPSHOT/jclouds-core-2.3.0-20200926.065612-31.jar
(739 KB at 479.0 KB/sec)
Downloading: https://repository.apache.org/content/repositories/snapshots/org/apache/jclouds/driver/jclouds-bouncycastle/2.3.0-SNAPSHOT/jclouds-bouncycastle-2.3.0-20200926.070521-30.jar
Downloaded: https://repository.apache.org/content/repositories/snapshots/org/apache/jclouds/driver/jclouds-slf4j/2.3.0-SNAPSHOT/jclouds-slf4j-2.3.0-20200926.065650-31.jar
(12 KB at 35.9 KB/sec)
Downloaded: https://repository.apache.org/content/repositories/snapshots/org/apache/jclouds/driver/jclouds-slf4j/2.3.0-SNAPSHOT/jclouds-slf4j-2.3.0-20200926.065650-31-tests.jar
(10 KB at 19.9 KB/sec)
Downloaded: https://repository.apache.org/content/repositories/snapshots/org/apache/jclouds/jclouds-compute/2.3.0-SNAPSHOT/jclouds-compute-2.3.0-20200926.070144-31-tests.jar
(235 KB at 441.2 KB/sec)
Downloaded: https://repository.apache.org/content/repositories/snapshots/org/apache/jclouds/driver/jclouds-sshj/2.3.0-SNAPSHOT/jclouds-sshj-2.3.0-20200926.070600-30.jar
(39 KB at 120.2 KB/sec)
Downloaded: https://repository.apache.org/content/repositories/snapshots/org/apache/jclouds/driver/jclouds-bouncycastle/2.3.0-SNAPSHOT/jclouds-bouncycastle-2.3.0-20200926.070521-30.jar
(11 KB at 32.8 KB/sec)
Downloading: https://repo.maven.apache.org/maven2/com/google/inject/extensions/guice-assistedinject/4.2.3/guice-assistedinject-4.2.3.jar
Downloading: https://repo.maven.apache.org/maven2/com/google/inject/guice/4.2.3/guice-4.2.3.jar
Downloaded: https://repo.maven.apache.org/maven2/com/google/inject/extensions/guice-assistedinject/4.2.3/guice-assistedinject-4.2.3.jar
(42 KB at 1060.1 KB/sec)
Downloaded: https://repo.maven.apache.org/maven2/com/google/inject/guice/4.2.3/guice-4.2.3.jar
(837 KB at 8902.7 KB/sec)
[INFO] 
[INFO] --- maven-clean-plugin:2.5:clean (default-clean) @ packet ---
[INFO] Deleting <https://ci-builds.apache.org/job/JClouds/job/jclouds-with-credentials/job/jclouds-packet-live-tests/ws/providers/packet/target>
[INFO] 
[INFO] --- maven-enforcer-plugin:1.1.1:enforce (enforce-banned-dependencies) @ packet ---
[INFO] 
[INFO] --- maven-enforcer-plugin:1.1.1:enforce (enforce-java) @ packet ---
[INFO] 
[INFO] --- maven-toolchains-plugin:1.1:toolchain (default) @ packet ---
[INFO] Required toolchain: jdk [ version='1.8' ]
[INFO] Found matching toolchain for type jdk: JDK[/home/jenkins/tools/java/latest1.8/]
[INFO] 
[INFO] --- maven-remote-resources-plugin:1.5:process (default) @ packet ---
[INFO] 
[INFO] --- maven-resources-plugin:2.6:resources (default-resources) @ packet ---
[INFO] Using 'UTF-8' encoding to copy filtered resources.
[INFO] skip non existing resourceDirectory <https://ci-builds.apache.org/job/JClouds/job/jclouds-with-credentials/job/jclouds-packet-live-tests/ws/providers/packet/src/main/resources>
[INFO] skip non existing resourceDirectory <https://ci-builds.apache.org/job/JClouds/job/jclouds-with-credentials/job/jclouds-packet-live-tests/ws/providers/packet/target/classes>
[INFO] Copying 3 resources
[INFO] 
[INFO] --- maven-compiler-plugin:3.8.0:compile (default-compile) @ packet ---
[INFO] Toolchain in maven-compiler-plugin: JDK[/home/jenkins/tools/java/latest1.8/]
[INFO] Changes detected - recompiling the module!
[INFO] Compiling 39 source files to <https://ci-builds.apache.org/job/JClouds/job/jclouds-with-credentials/job/jclouds-packet-live-tests/ws/providers/packet/target/classes>
[JENKINS] Archiving disabled
[INFO] ------------------------------------------------------------------------
[INFO] BUILD FAILURE
[INFO] ------------------------------------------------------------------------
[INFO] Total time: 04:43 min
[INFO] Finished at: 2020-09-26T18:15:41Z
[INFO] ------------------------------------------------------------------------
[JENKINS] Archiving disabled
[ERROR] Failed to execute goal org.apache.maven.plugins:maven-compiler-plugin:3.8.0:compile
(default-compile) on project packet: Fatal error compiling: CompilerException: InvocationTargetException:
NullPointerException -> [Help 1]
[ERROR] 
[ERROR] To see the full stack trace of the errors, re-run Maven with the -e switch.
[ERROR] Re-run Maven using the -X switch to enable full debug logging.
[ERROR] 
[ERROR] For more information about the errors and possible solutions, please read the following
articles:
[ERROR] [Help 1] http://cwiki.apache.org/confluence/display/MAVEN/MojoExecutionException
channel stopped
No JDK named ?JDK 1.8.0_144 (unlimited security)? found
No JDK named ?JDK 1.8.0_144 (unlimited security)? found

Mime
View raw message