jclouds-notifications mailing list archives

Site index · List index
Message view « Date » · « Thread »
Top « Date » · « Thread »
From Apache Jenkins Server <jenk...@builds.apache.org>
Subject Build failed in Jenkins: JClouds » jclouds-labs #6
Date Mon, 26 Oct 2020 14:25:42 GMT
See <https://ci-builds.apache.org/job/JClouds/job/jclouds-labs/6/display/redirect>

Changes:


------------------------------------------
Started by upstream project "JClouds/jclouds" build number 6
originally caused by:
 Started by user Andrew Gaul
Running as SYSTEM
[EnvInject] - Loading node environment variables.
Building remotely on H43 (ubuntu) in workspace <https://ci-builds.apache.org/job/JClouds/job/jclouds-labs/ws/>
No credentials specified
 > git rev-parse --is-inside-work-tree # timeout=10
Fetching changes from the remote Git repository
 > git config remote.origin.url https://gitbox.apache.org/repos/asf/jclouds-labs.git #
timeout=10
Fetching upstream changes from https://gitbox.apache.org/repos/asf/jclouds-labs.git
 > git --version # timeout=10
 > git fetch --tags --progress -- https://gitbox.apache.org/repos/asf/jclouds-labs.git
+refs/heads/*:refs/remotes/origin/* # timeout=10
 > git rev-parse refs/remotes/origin/master^{commit} # timeout=10
 > git rev-parse refs/remotes/origin/origin/master^{commit} # timeout=10
Checking out Revision 0b9344b440af6b1803788ef7b2401b441a0857b2 (refs/remotes/origin/master)
 > git config core.sparsecheckout # timeout=10
 > git checkout -f 0b9344b440af6b1803788ef7b2401b441a0857b2 # timeout=10
Commit message: "Next development version 2.3.0-SNAPSHOT"
 > git rev-list --no-walk 0b9344b440af6b1803788ef7b2401b441a0857b2 # timeout=10
Parsing POMs
Downloaded artifact https://repository.apache.org/content/repositories/snapshots/org/apache/jclouds/jclouds-project/2.3.0-SNAPSHOT/maven-metadata.xml
Downloaded artifact https://repository.apache.org/content/repositories/snapshots/org/apache/jclouds/jclouds-project/2.3.0-SNAPSHOT/jclouds-project-2.3.0-20201026.130247-38.pom
Downloaded artifact http://repository.apache.org/snapshots/org/apache/jclouds/jclouds-project/2.3.0-SNAPSHOT/maven-metadata.xml
Modules changed, recalculating dependency graph
Established TCP socket on 37003
maven35-agent.jar already up to date
maven35-interceptor.jar already up to date
maven3-interceptor-commons.jar already up to date
[jclouds-labs] $ /home/jenkins/tools/java/latest1.8/bin/java -cp /home/jenkins/maven35-agent.jar:/home/jenkins/tools/maven/apache-maven-3.5.4/boot/plexus-classworlds-2.5.2.jar:/home/jenkins/tools/maven/apache-maven-3.5.4/conf/logging
jenkins.maven3.agent.Maven35Main /home/jenkins/tools/maven/apache-maven-3.5.4 /home/jenkins/slave.jar
/home/jenkins/maven35-interceptor.jar /home/jenkins/maven3-interceptor-commons.jar 37003
<===[JENKINS REMOTING CAPACITY]===>   channel started
Executing Maven:  -B -f <https://ci-builds.apache.org/job/JClouds/job/jclouds-labs/ws/pom.xml>
clean install deploy -U -e -Psrc,doc,jenkins
[INFO] Error stacktraces are turned on.
[INFO] Scanning for projects...
[INFO] Downloading from apache-snapshots: https://repository.apache.org/content/repositories/snapshots/org/apache/jclouds/jclouds-project/2.3.0-SNAPSHOT/maven-metadata.xml
[INFO] Downloaded from apache-snapshots: https://repository.apache.org/content/repositories/snapshots/org/apache/jclouds/jclouds-project/2.3.0-SNAPSHOT/maven-metadata.xml
(825 B at 773 B/s)
[INFO] Downloading from Nexus: http://repository.apache.org/snapshots/org/apache/jclouds/jclouds-project/2.3.0-SNAPSHOT/maven-metadata.xml
[INFO] Downloaded from Nexus: http://repository.apache.org/snapshots/org/apache/jclouds/jclouds-project/2.3.0-SNAPSHOT/maven-metadata.xml
(825 B at 1.7 kB/s)
[ERROR] [ERROR] Some problems were encountered while processing the POMs:
[ERROR] Unknown packaging: bundle @ org.apache.jclouds.labs:cdmi:[unknown-version], <https://ci-builds.apache.org/job/JClouds/job/jclouds-labs/ws/cdmi/pom.xml,>
line 33, column 14
[WARNING] Reporting configuration should be done in <reporting> section, not in maven-site-plugin
<configuration> as reportPlugins parameter. @ 
[ERROR] Unknown packaging: bundle @ line 35, column 16
[WARNING] Reporting configuration should be done in <reporting> section, not in maven-site-plugin
<configuration> as reportPlugins parameter. @ 
[ERROR] Unknown packaging: bundle @ line 34, column 14
[WARNING] Reporting configuration should be done in <reporting> section, not in maven-site-plugin
<configuration> as reportPlugins parameter. @ 
[ERROR] Unknown packaging: bundle @ line 34, column 14
[WARNING] Reporting configuration should be done in <reporting> section, not in maven-site-plugin
<configuration> as reportPlugins parameter. @ 
[ERROR] Unknown packaging: bundle @ line 34, column 14
[WARNING] Reporting configuration should be done in <reporting> section, not in maven-site-plugin
<configuration> as reportPlugins parameter. @ 
[ERROR] Unknown packaging: bundle @ line 34, column 14
[WARNING] Reporting configuration should be done in <reporting> section, not in maven-site-plugin
<configuration> as reportPlugins parameter. @ 
[ERROR] Unknown packaging: bundle @ line 34, column 14
[WARNING] Reporting configuration should be done in <reporting> section, not in maven-site-plugin
<configuration> as reportPlugins parameter. @ 
[ERROR] Unknown packaging: bundle @ line 34, column 14
[WARNING] Reporting configuration should be done in <reporting> section, not in maven-site-plugin
<configuration> as reportPlugins parameter. @ 
[ERROR] Unknown packaging: bundle @ org.apache.jclouds.labs:dimensiondata-cloudcontrol:[unknown-version],
<https://ci-builds.apache.org/job/JClouds/job/jclouds-labs/ws/dimensiondata/pom.xml,>
line 35, column 16
[WARNING] Reporting configuration should be done in <reporting> section, not in maven-site-plugin
<configuration> as reportPlugins parameter. @ 
[ERROR] Unknown packaging: bundle @ org.apache.jclouds.labs:joyent-cloudapi:[unknown-version],
<https://ci-builds.apache.org/job/JClouds/job/jclouds-labs/ws/joyent-cloudapi/pom.xml,>
line 33, column 14
[WARNING] Reporting configuration should be done in <reporting> section, not in maven-site-plugin
<configuration> as reportPlugins parameter. @ 
[ERROR] Unknown packaging: bundle @ org.apache.jclouds.labs:joyentcloud:[unknown-version],
<https://ci-builds.apache.org/job/JClouds/job/jclouds-labs/ws/joyentcloud/pom.xml,>
line 33, column 14
[WARNING] Reporting configuration should be done in <reporting> section, not in maven-site-plugin
<configuration> as reportPlugins parameter. @ 
[ERROR] Unknown packaging: bundle @ org.apache.jclouds.labs:abiquo:[unknown-version], <https://ci-builds.apache.org/job/JClouds/job/jclouds-labs/ws/abiquo/pom.xml,>
line 32, column 14
[WARNING] Reporting configuration should be done in <reporting> section, not in maven-site-plugin
<configuration> as reportPlugins parameter. @ 
[ERROR] Unknown packaging: bundle @ org.apache.jclouds.labs:profitbricks-rest:[unknown-version],
<https://ci-builds.apache.org/job/JClouds/job/jclouds-labs/ws/profitbricks-rest/pom.xml,>
line 32, column 16
[WARNING] Reporting configuration should be done in <reporting> section, not in maven-site-plugin
<configuration> as reportPlugins parameter. @ 
[ERROR] Unknown packaging: bundle @ org.apache.jclouds.labs:oneandone:[unknown-version], <https://ci-builds.apache.org/job/JClouds/job/jclouds-labs/ws/oneandone/pom.xml,>
line 32, column 16
[WARNING] Reporting configuration should be done in <reporting> section, not in maven-site-plugin
<configuration> as reportPlugins parameter. @ 
[ERROR] Unknown packaging: bundle @ org.apache.jclouds.labs:vagrant:[unknown-version], <https://ci-builds.apache.org/job/JClouds/job/jclouds-labs/ws/vagrant/pom.xml,>
line 31, column 14
[WARNING] Reporting configuration should be done in <reporting> section, not in maven-site-plugin
<configuration> as reportPlugins parameter. @ 
[ERROR] Unknown packaging: bundle @ org.apache.jclouds.labs:aliyun-ecs:[unknown-version],
<https://ci-builds.apache.org/job/JClouds/job/jclouds-labs/ws/aliyun-ecs/pom.xml,> line
31, column 16
[WARNING] Reporting configuration should be done in <reporting> section, not in maven-site-plugin
<configuration> as reportPlugins parameter. @ 
[WARNING] 'build.pluginManagement.plugins.plugin.(groupId:artifactId)' must be unique but
found duplicate declaration of plugin org.apache.rat:apache-rat-plugin @ org.apache.jclouds:jclouds-project:2.3.0-SNAPSHOT,
/home/jenkins/.m2/repository/org/apache/jclouds/jclouds-project/2.3.0-SNAPSHOT/jclouds-project-2.3.0-SNAPSHOT.pom,
line 988, column 17
[WARNING] Reporting configuration should be done in <reporting> section, not in maven-site-plugin
<configuration> as reportPlugins parameter. @ 
 @ 
[ERROR] The build could not read 16 projects -> [Help 1]
org.apache.maven.project.ProjectBuildingException: Some problems were encountered while processing
the POMs:
[ERROR] Unknown packaging: bundle @ org.apache.jclouds.labs:cdmi:[unknown-version], <https://ci-builds.apache.org/job/JClouds/job/jclouds-labs/ws/cdmi/pom.xml,>
line 33, column 14
[WARNING] Reporting configuration should be done in <reporting> section, not in maven-site-plugin
<configuration> as reportPlugins parameter. @ 
[ERROR] Unknown packaging: bundle @ line 35, column 16
[WARNING] Reporting configuration should be done in <reporting> section, not in maven-site-plugin
<configuration> as reportPlugins parameter. @ 
[ERROR] Unknown packaging: bundle @ line 34, column 14
[WARNING] Reporting configuration should be done in <reporting> section, not in maven-site-plugin
<configuration> as reportPlugins parameter. @ 
[ERROR] Unknown packaging: bundle @ line 34, column 14
[WARNING] Reporting configuration should be done in <reporting> section, not in maven-site-plugin
<configuration> as reportPlugins parameter. @ 
[ERROR] Unknown packaging: bundle @ line 34, column 14
[WARNING] Reporting configuration should be done in <reporting> section, not in maven-site-plugin
<configuration> as reportPlugins parameter. @ 
[ERROR] Unknown packaging: bundle @ line 34, column 14
[WARNING] Reporting configuration should be done in <reporting> section, not in maven-site-plugin
<configuration> as reportPlugins parameter. @ 
[ERROR] Unknown packaging: bundle @ line 34, column 14
[WARNING] Reporting configuration should be done in <reporting> section, not in maven-site-plugin
<configuration> as reportPlugins parameter. @ 
[ERROR] Unknown packaging: bundle @ line 34, column 14
[WARNING] Reporting configuration should be done in <reporting> section, not in maven-site-plugin
<configuration> as reportPlugins parameter. @ 
[ERROR] Unknown packaging: bundle @ org.apache.jclouds.labs:dimensiondata-cloudcontrol:[unknown-version],
<https://ci-builds.apache.org/job/JClouds/job/jclouds-labs/ws/dimensiondata/pom.xml,>
line 35, column 16
[WARNING] Reporting configuration should be done in <reporting> section, not in maven-site-plugin
<configuration> as reportPlugins parameter. @ 
[ERROR] Unknown packaging: bundle @ org.apache.jclouds.labs:joyent-cloudapi:[unknown-version],
<https://ci-builds.apache.org/job/JClouds/job/jclouds-labs/ws/joyent-cloudapi/pom.xml,>
line 33, column 14
[WARNING] Reporting configuration should be done in <reporting> section, not in maven-site-plugin
<configuration> as reportPlugins parameter. @ 
[ERROR] Unknown packaging: bundle @ org.apache.jclouds.labs:joyentcloud:[unknown-version],
<https://ci-builds.apache.org/job/JClouds/job/jclouds-labs/ws/joyentcloud/pom.xml,>
line 33, column 14
[WARNING] Reporting configuration should be done in <reporting> section, not in maven-site-plugin
<configuration> as reportPlugins parameter. @ 
[ERROR] Unknown packaging: bundle @ org.apache.jclouds.labs:abiquo:[unknown-version], <https://ci-builds.apache.org/job/JClouds/job/jclouds-labs/ws/abiquo/pom.xml,>
line 32, column 14
[WARNING] Reporting configuration should be done in <reporting> section, not in maven-site-plugin
<configuration> as reportPlugins parameter. @ 
[ERROR] Unknown packaging: bundle @ org.apache.jclouds.labs:profitbricks-rest:[unknown-version],
<https://ci-builds.apache.org/job/JClouds/job/jclouds-labs/ws/profitbricks-rest/pom.xml,>
line 32, column 16
[WARNING] Reporting configuration should be done in <reporting> section, not in maven-site-plugin
<configuration> as reportPlugins parameter. @ 
[ERROR] Unknown packaging: bundle @ org.apache.jclouds.labs:oneandone:[unknown-version], <https://ci-builds.apache.org/job/JClouds/job/jclouds-labs/ws/oneandone/pom.xml,>
line 32, column 16
[WARNING] Reporting configuration should be done in <reporting> section, not in maven-site-plugin
<configuration> as reportPlugins parameter. @ 
[ERROR] Unknown packaging: bundle @ org.apache.jclouds.labs:vagrant:[unknown-version], <https://ci-builds.apache.org/job/JClouds/job/jclouds-labs/ws/vagrant/pom.xml,>
line 31, column 14
[WARNING] Reporting configuration should be done in <reporting> section, not in maven-site-plugin
<configuration> as reportPlugins parameter. @ 
[ERROR] Unknown packaging: bundle @ org.apache.jclouds.labs:aliyun-ecs:[unknown-version],
<https://ci-builds.apache.org/job/JClouds/job/jclouds-labs/ws/aliyun-ecs/pom.xml,> line
31, column 16
[WARNING] Reporting configuration should be done in <reporting> section, not in maven-site-plugin
<configuration> as reportPlugins parameter. @ 
[WARNING] 'build.pluginManagement.plugins.plugin.(groupId:artifactId)' must be unique but
found duplicate declaration of plugin org.apache.rat:apache-rat-plugin @ org.apache.jclouds:jclouds-project:2.3.0-SNAPSHOT,
/home/jenkins/.m2/repository/org/apache/jclouds/jclouds-project/2.3.0-SNAPSHOT/jclouds-project-2.3.0-SNAPSHOT.pom,
line 988, column 17
[WARNING] Reporting configuration should be done in <reporting> section, not in maven-site-plugin
<configuration> as reportPlugins parameter. @ 

    at org.apache.maven.project.DefaultProjectBuilder.build (DefaultProjectBuilder.java:383)
    at org.apache.maven.graph.DefaultGraphBuilder.collectProjects (DefaultGraphBuilder.java:414)
    at org.apache.maven.graph.DefaultGraphBuilder.getProjectsForMavenReactor (DefaultGraphBuilder.java:405)
    at org.apache.maven.graph.DefaultGraphBuilder.build (DefaultGraphBuilder.java:82)
    at org.apache.maven.DefaultMaven.buildGraph (DefaultMaven.java:507)
    at org.apache.maven.DefaultMaven.doExecute (DefaultMaven.java:219)
    at org.apache.maven.DefaultMaven.doExecute (DefaultMaven.java:192)
    at org.apache.maven.DefaultMaven.execute (DefaultMaven.java:105)
    at org.jvnet.hudson.maven3.launcher.Maven35Launcher.main (Maven35Launcher.java:130)
    at sun.reflect.NativeMethodAccessorImpl.invoke0 (Native Method)
    at sun.reflect.NativeMethodAccessorImpl.invoke (NativeMethodAccessorImpl.java:62)
    at sun.reflect.DelegatingMethodAccessorImpl.invoke (DelegatingMethodAccessorImpl.java:43)
    at java.lang.reflect.Method.invoke (Method.java:498)
    at org.codehaus.plexus.classworlds.launcher.Launcher.launchEnhanced (Launcher.java:289)
    at org.codehaus.plexus.classworlds.launcher.Launcher.launch (Launcher.java:229)
    at jenkins.maven3.agent.Maven35Main.launch (Maven35Main.java:178)
    at sun.reflect.NativeMethodAccessorImpl.invoke0 (Native Method)
    at sun.reflect.NativeMethodAccessorImpl.invoke (NativeMethodAccessorImpl.java:62)
    at sun.reflect.DelegatingMethodAccessorImpl.invoke (DelegatingMethodAccessorImpl.java:43)
    at java.lang.reflect.Method.invoke (Method.java:498)
    at hudson.maven.Maven3Builder.call (Maven3Builder.java:139)
    at hudson.maven.Maven3Builder.call (Maven3Builder.java:70)
    at hudson.remoting.UserRequest.perform (UserRequest.java:211)
    at hudson.remoting.UserRequest.perform (UserRequest.java:54)
    at hudson.remoting.Request$2.run (Request.java:369)
    at hudson.remoting.InterceptingExecutorService$1.call (InterceptingExecutorService.java:72)
    at java.util.concurrent.FutureTask.run (FutureTask.java:266)
    at java.util.concurrent.ThreadPoolExecutor.runWorker (ThreadPoolExecutor.java:1149)
    at java.util.concurrent.ThreadPoolExecutor$Worker.run (ThreadPoolExecutor.java:624)
    at java.lang.Thread.run (Thread.java:748)
[ERROR]   
[ERROR]   The project org.apache.jclouds.labs:cdmi:2.3.0-SNAPSHOT (<https://ci-builds.apache.org/job/JClouds/job/jclouds-labs/ws/cdmi/pom.xml)>
has 1 error
[ERROR]     Unknown packaging: bundle @ org.apache.jclouds.labs:cdmi:[unknown-version], <https://ci-builds.apache.org/job/JClouds/job/jclouds-labs/ws/cdmi/pom.xml,>
line 33, column 14
[ERROR]   
[ERROR]   The project org.apache.jclouds.labs:cloudsigma2:2.3.0-SNAPSHOT (<https://ci-builds.apache.org/job/JClouds/job/jclouds-labs/ws/cloudsigma2/pom.xml)>
has 1 error
[ERROR]     Unknown packaging: bundle @ line 35, column 16
[ERROR]   
[ERROR]   The project org.apache.jclouds.labs:cloudsigma2-hnl:2.3.0-SNAPSHOT (<https://ci-builds.apache.org/job/JClouds/job/jclouds-labs/ws/cloudsigma2-hnl/pom.xml)>
has 1 error
[ERROR]     Unknown packaging: bundle @ line 34, column 14
[ERROR]   
[ERROR]   The project org.apache.jclouds.labs:cloudsigma2-lvs:2.3.0-SNAPSHOT (<https://ci-builds.apache.org/job/JClouds/job/jclouds-labs/ws/cloudsigma2-lvs/pom.xml)>
has 1 error
[ERROR]     Unknown packaging: bundle @ line 34, column 14
[ERROR]   
[ERROR]   The project org.apache.jclouds.labs:cloudsigma2-mia:2.3.0-SNAPSHOT (<https://ci-builds.apache.org/job/JClouds/job/jclouds-labs/ws/cloudsigma2-mia/pom.xml)>
has 1 error
[ERROR]     Unknown packaging: bundle @ line 34, column 14
[ERROR]   
[ERROR]   The project org.apache.jclouds.labs:cloudsigma2-sjc:2.3.0-SNAPSHOT (<https://ci-builds.apache.org/job/JClouds/job/jclouds-labs/ws/cloudsigma2-sjc/pom.xml)>
has 1 error
[ERROR]     Unknown packaging: bundle @ line 34, column 14
[ERROR]   
[ERROR]   The project org.apache.jclouds.labs:cloudsigma2-wdc:2.3.0-SNAPSHOT (<https://ci-builds.apache.org/job/JClouds/job/jclouds-labs/ws/cloudsigma2-wdc/pom.xml)>
has 1 error
[ERROR]     Unknown packaging: bundle @ line 34, column 14
[ERROR]   
[ERROR]   The project org.apache.jclouds.labs:cloudsigma2-zrh:2.3.0-SNAPSHOT (<https://ci-builds.apache.org/job/JClouds/job/jclouds-labs/ws/cloudsigma2-zrh/pom.xml)>
has 1 error
[ERROR]     Unknown packaging: bundle @ line 34, column 14
[ERROR]   
[ERROR]   The project org.apache.jclouds.labs:dimensiondata-cloudcontrol:2.3.0-SNAPSHOT (<https://ci-builds.apache.org/job/JClouds/job/jclouds-labs/ws/dimensiondata/pom.xml)>
has 1 error
[ERROR]     Unknown packaging: bundle @ org.apache.jclouds.labs:dimensiondata-cloudcontrol:[unknown-version],
<https://ci-builds.apache.org/job/JClouds/job/jclouds-labs/ws/dimensiondata/pom.xml,>
line 35, column 16
[ERROR]   
[ERROR]   The project org.apache.jclouds.labs:joyent-cloudapi:2.3.0-SNAPSHOT (<https://ci-builds.apache.org/job/JClouds/job/jclouds-labs/ws/joyent-cloudapi/pom.xml)>
has 1 error
[ERROR]     Unknown packaging: bundle @ org.apache.jclouds.labs:joyent-cloudapi:[unknown-version],
<https://ci-builds.apache.org/job/JClouds/job/jclouds-labs/ws/joyent-cloudapi/pom.xml,>
line 33, column 14
[ERROR]   
[ERROR]   The project org.apache.jclouds.labs:joyentcloud:2.3.0-SNAPSHOT (<https://ci-builds.apache.org/job/JClouds/job/jclouds-labs/ws/joyentcloud/pom.xml)>
has 1 error
[ERROR]     Unknown packaging: bundle @ org.apache.jclouds.labs:joyentcloud:[unknown-version],
<https://ci-builds.apache.org/job/JClouds/job/jclouds-labs/ws/joyentcloud/pom.xml,>
line 33, column 14
[ERROR]   
[ERROR]   The project org.apache.jclouds.labs:abiquo:2.3.0-SNAPSHOT (<https://ci-builds.apache.org/job/JClouds/job/jclouds-labs/ws/abiquo/pom.xml)>
has 1 error
[ERROR]     Unknown packaging: bundle @ org.apache.jclouds.labs:abiquo:[unknown-version],
<https://ci-builds.apache.org/job/JClouds/job/jclouds-labs/ws/abiquo/pom.xml,> line
32, column 14
[ERROR]   
[ERROR]   The project org.apache.jclouds.labs:profitbricks-rest:2.3.0-SNAPSHOT (<https://ci-builds.apache.org/job/JClouds/job/jclouds-labs/ws/profitbricks-rest/pom.xml)>
has 1 error
[ERROR]     Unknown packaging: bundle @ org.apache.jclouds.labs:profitbricks-rest:[unknown-version],
<https://ci-builds.apache.org/job/JClouds/job/jclouds-labs/ws/profitbricks-rest/pom.xml,>
line 32, column 16
[ERROR]   
[ERROR]   The project org.apache.jclouds.labs:oneandone:2.3.0-SNAPSHOT (<https://ci-builds.apache.org/job/JClouds/job/jclouds-labs/ws/oneandone/pom.xml)>
has 1 error
[ERROR]     Unknown packaging: bundle @ org.apache.jclouds.labs:oneandone:[unknown-version],
<https://ci-builds.apache.org/job/JClouds/job/jclouds-labs/ws/oneandone/pom.xml,> line
32, column 16
[ERROR]   
[ERROR]   The project org.apache.jclouds.labs:vagrant:2.3.0-SNAPSHOT (<https://ci-builds.apache.org/job/JClouds/job/jclouds-labs/ws/vagrant/pom.xml)>
has 1 error
[ERROR]     Unknown packaging: bundle @ org.apache.jclouds.labs:vagrant:[unknown-version],
<https://ci-builds.apache.org/job/JClouds/job/jclouds-labs/ws/vagrant/pom.xml,> line
31, column 14
[ERROR]   
[ERROR]   The project org.apache.jclouds.labs:aliyun-ecs:2.3.0-SNAPSHOT (<https://ci-builds.apache.org/job/JClouds/job/jclouds-labs/ws/aliyun-ecs/pom.xml)>
has 1 error
[ERROR]     Unknown packaging: bundle @ org.apache.jclouds.labs:aliyun-ecs:[unknown-version],
<https://ci-builds.apache.org/job/JClouds/job/jclouds-labs/ws/aliyun-ecs/pom.xml,> line
31, column 16
[ERROR] 
[ERROR] Re-run Maven using the -X switch to enable full debug logging.
[ERROR] 
[ERROR] For more information about the errors and possible solutions, please read the following
articles:
[ERROR] [Help 1] http://cwiki.apache.org/confluence/display/MAVEN/ProjectBuildingException
channel stopped

Mime
View raw message