jmeter-dev mailing list archives

Site index · List index
Message view « Date » · « Thread »
Top « Date » · « Thread »
From Apache Jenkins Server <jenk...@builds.apache.org>
Subject Build failed in Jenkins: JMeter-trunk #2172
Date Tue, 01 May 2012 09:03:43 GMT
See <https://builds.apache.org/job/JMeter-trunk/2172/changes>

Changes:

[pmouawad] Add information about version change

------------------------------------------
[...truncated 607 lines...]
      [jar] Building jar: /x1/jenkins/jenkins-slave/workspace/JMeter-trunk/trunk/lib/ext/ApacheJMeter_native.jar
      [jar] Building jar: /x1/jenkins/jenkins-slave/workspace/JMeter-trunk/trunk/lib/jorphan.jar

package:

check-anakia:

report-old-velocity:

report-anakia-missing:

init-docs:
     [echo] eclipse.anakia = .

docs-printable:
   [anakia] Transforming into: /x1/jenkins/jenkins-slave/workspace/JMeter-trunk/trunk/printable_docs
   [anakia] Input:  building.xml
   [anakia] Output: /x1/jenkins/jenkins-slave/workspace/JMeter-trunk/trunk/printable_docs/building.html
   [anakia] Input:  changes.xml
   [anakia] Output: /x1/jenkins/jenkins-slave/workspace/JMeter-trunk/trunk/printable_docs/changes.html
   [anakia] Input:  changes_history.xml
   [anakia] Output: /x1/jenkins/jenkins-slave/workspace/JMeter-trunk/trunk/printable_docs/changes_history.html
   [anakia] Input:  download_jmeter.xml
   [anakia] Output: /x1/jenkins/jenkins-slave/workspace/JMeter-trunk/trunk/printable_docs/download_jmeter.html
   [anakia] Input:  index.xml
   [anakia] Output: /x1/jenkins/jenkins-slave/workspace/JMeter-trunk/trunk/printable_docs/index.html
   [anakia] Input:  issues.xml
   [anakia] Output: /x1/jenkins/jenkins-slave/workspace/JMeter-trunk/trunk/printable_docs/issues.html
   [anakia] Input:  jmeter_irc.xml
   [anakia] Output: /x1/jenkins/jenkins-slave/workspace/JMeter-trunk/trunk/printable_docs/jmeter_irc.html
   [anakia] Input:  localising/index.xml
   [anakia] Output: /x1/jenkins/jenkins-slave/workspace/JMeter-trunk/trunk/printable_docs/localising/index.html
   [anakia] Input:  mail.xml
   [anakia] Output: /x1/jenkins/jenkins-slave/workspace/JMeter-trunk/trunk/printable_docs/mail.html
   [anakia] Input:  mail2.xml
   [anakia] Output: /x1/jenkins/jenkins-slave/workspace/JMeter-trunk/trunk/printable_docs/mail2.html
   [anakia] Input:  nightly.xml
   [anakia] Output: /x1/jenkins/jenkins-slave/workspace/JMeter-trunk/trunk/printable_docs/nightly.html
   [anakia] Input:  svnindex.xml
   [anakia] Output: /x1/jenkins/jenkins-slave/workspace/JMeter-trunk/trunk/printable_docs/svnindex.html
   [anakia] Input:  usermanual/best-practices.xml
   [anakia] Output: /x1/jenkins/jenkins-slave/workspace/JMeter-trunk/trunk/printable_docs/usermanual/best-practices.html
   [anakia] Input:  usermanual/boss.xml
   [anakia] Output: /x1/jenkins/jenkins-slave/workspace/JMeter-trunk/trunk/printable_docs/usermanual/boss.html
   [anakia] Input:  usermanual/build-adv-web-test-plan.xml
   [anakia] Output: /x1/jenkins/jenkins-slave/workspace/JMeter-trunk/trunk/printable_docs/usermanual/build-adv-web-test-plan.html
   [anakia] Input:  usermanual/build-db-test-plan.xml
   [anakia] Output: /x1/jenkins/jenkins-slave/workspace/JMeter-trunk/trunk/printable_docs/usermanual/build-db-test-plan.html
   [anakia] Input:  usermanual/build-ftp-test-plan.xml
   [anakia] Output: /x1/jenkins/jenkins-slave/workspace/JMeter-trunk/trunk/printable_docs/usermanual/build-ftp-test-plan.html
   [anakia] Input:  usermanual/build-jms-point-to-point-test-plan.xml
   [anakia] Output: /x1/jenkins/jenkins-slave/workspace/JMeter-trunk/trunk/printable_docs/usermanual/build-jms-point-to-point-test-plan.html
   [anakia] Input:  usermanual/build-jms-topic-test-plan.xml
   [anakia] Output: /x1/jenkins/jenkins-slave/workspace/JMeter-trunk/trunk/printable_docs/usermanual/build-jms-topic-test-plan.html
   [anakia] Input:  usermanual/build-ldap-test-plan.xml
   [anakia] Output: /x1/jenkins/jenkins-slave/workspace/JMeter-trunk/trunk/printable_docs/usermanual/build-ldap-test-plan.html
   [anakia] Input:  usermanual/build-ldapext-test-plan.xml
   [anakia] Output: /x1/jenkins/jenkins-slave/workspace/JMeter-trunk/trunk/printable_docs/usermanual/build-ldapext-test-plan.html
   [anakia] Input:  usermanual/build-monitor-test-plan.xml
   [anakia] Output: /x1/jenkins/jenkins-slave/workspace/JMeter-trunk/trunk/printable_docs/usermanual/build-monitor-test-plan.html
   [anakia] Input:  usermanual/build-test-plan.xml
   [anakia] Output: /x1/jenkins/jenkins-slave/workspace/JMeter-trunk/trunk/printable_docs/usermanual/build-test-plan.html
   [anakia] Input:  usermanual/build-web-test-plan.xml
   [anakia] Output: /x1/jenkins/jenkins-slave/workspace/JMeter-trunk/trunk/printable_docs/usermanual/build-web-test-plan.html
   [anakia] Input:  usermanual/build-ws-test-plan.xml
   [anakia] Output: /x1/jenkins/jenkins-slave/workspace/JMeter-trunk/trunk/printable_docs/usermanual/build-ws-test-plan.html
   [anakia] Input:  usermanual/component_reference.xml
   [anakia] Output: /x1/jenkins/jenkins-slave/workspace/JMeter-trunk/trunk/printable_docs/usermanual/component_reference.html
   [anakia] Input:  usermanual/functions.xml
   [anakia] Output: /x1/jenkins/jenkins-slave/workspace/JMeter-trunk/trunk/printable_docs/usermanual/functions.html
   [anakia] Input:  usermanual/get-started.xml
   [anakia] Output: /x1/jenkins/jenkins-slave/workspace/JMeter-trunk/trunk/printable_docs/usermanual/get-started.html
   [anakia] Input:  usermanual/glossary.xml
   [anakia] Output: /x1/jenkins/jenkins-slave/workspace/JMeter-trunk/trunk/printable_docs/usermanual/glossary.html
   [anakia] Input:  usermanual/hints_and_tips.xml
   [anakia] Output: /x1/jenkins/jenkins-slave/workspace/JMeter-trunk/trunk/printable_docs/usermanual/hints_and_tips.html
   [anakia] Input:  usermanual/index.xml
   [anakia] Output: /x1/jenkins/jenkins-slave/workspace/JMeter-trunk/trunk/printable_docs/usermanual/index.html
   [anakia] Input:  usermanual/intro.xml
   [anakia] Output: /x1/jenkins/jenkins-slave/workspace/JMeter-trunk/trunk/printable_docs/usermanual/intro.html
   [anakia] Input:  usermanual/ldapanswer_xml.xml
   [anakia] Output: /x1/jenkins/jenkins-slave/workspace/JMeter-trunk/trunk/printable_docs/usermanual/ldapanswer_xml.html
   [anakia] Input:  usermanual/ldapops_tutor.xml
   [anakia] Output: /x1/jenkins/jenkins-slave/workspace/JMeter-trunk/trunk/printable_docs/usermanual/ldapops_tutor.html
   [anakia] Input:  usermanual/listeners.xml
   [anakia] Output: /x1/jenkins/jenkins-slave/workspace/JMeter-trunk/trunk/printable_docs/usermanual/listeners.html
   [anakia] Input:  usermanual/regular_expressions.xml
   [anakia] Output: /x1/jenkins/jenkins-slave/workspace/JMeter-trunk/trunk/printable_docs/usermanual/regular_expressions.html
   [anakia] Input:  usermanual/remote-test.xml
   [anakia] Output: /x1/jenkins/jenkins-slave/workspace/JMeter-trunk/trunk/printable_docs/usermanual/remote-test.html
   [anakia] Input:  usermanual/test_plan.xml
   [anakia] Output: /x1/jenkins/jenkins-slave/workspace/JMeter-trunk/trunk/printable_docs/usermanual/test_plan.html
     [echo] Fixing EOL
     [echo] Removing unnecessary </br> tags
     [echo] Copying files
     [copy] Copying 15 files to /x1/jenkins/jenkins-slave/workspace/JMeter-trunk/trunk/printable_docs/demos
     [copy] Copying 5 files to /x1/jenkins/jenkins-slave/workspace/JMeter-trunk/trunk/printable_docs/usermanual
     [copy] Copying 1 file to /x1/jenkins/jenkins-slave/workspace/JMeter-trunk/trunk/printable_docs/extending

pack-nightly:

_pack-binaries:
      [tar] Building tar: /x1/jenkins/jenkins-slave/workspace/JMeter-trunk/trunk/dist/apache-jmeter-r1332580_bin.tar
     [gzip] Building: /x1/jenkins/jenkins-slave/workspace/JMeter-trunk/trunk/dist/apache-jmeter-r1332580_bin.tgz
   [delete] Deleting: /x1/jenkins/jenkins-slave/workspace/JMeter-trunk/trunk/dist/apache-jmeter-r1332580_bin.tar
      [zip] Building zip: /x1/jenkins/jenkins-slave/workspace/JMeter-trunk/trunk/dist/apache-jmeter-r1332580_bin.zip

_pack-libraries:
      [tar] Building tar: /x1/jenkins/jenkins-slave/workspace/JMeter-trunk/trunk/dist/apache-jmeter-r1332580_lib.tar
     [gzip] Building: /x1/jenkins/jenkins-slave/workspace/JMeter-trunk/trunk/dist/apache-jmeter-r1332580_lib.tgz
   [delete] Deleting: /x1/jenkins/jenkins-slave/workspace/JMeter-trunk/trunk/dist/apache-jmeter-r1332580_lib.tar
      [zip] Building zip: /x1/jenkins/jenkins-slave/workspace/JMeter-trunk/trunk/dist/apache-jmeter-r1332580_lib.zip

_pack-source:
      [tar] Building tar: /x1/jenkins/jenkins-slave/workspace/JMeter-trunk/trunk/dist/apache-jmeter-r1332580_src.tar
     [gzip] Building: /x1/jenkins/jenkins-slave/workspace/JMeter-trunk/trunk/dist/apache-jmeter-r1332580_src.tgz
   [delete] Deleting: /x1/jenkins/jenkins-slave/workspace/JMeter-trunk/trunk/dist/apache-jmeter-r1332580_src.tar
      [zip] Building zip: /x1/jenkins/jenkins-slave/workspace/JMeter-trunk/trunk/dist/apache-jmeter-r1332580_src.zip

nightly:

compile-tests:
    [javac] Compiling 96 source files to /x1/jenkins/jenkins-slave/workspace/JMeter-trunk/trunk/build/test

_test:
     [echo] 
     [echo]    gump.run = false
     [echo]    java.awt.headless = true
     [echo]    test.headless = true
     [echo]    user.dir = /x1/jenkins/jenkins-slave/workspace/JMeter-trunk/trunk
     [echo]    basedir = /x1/jenkins/jenkins-slave/workspace/JMeter-trunk/trunk
     [echo]    test dir = build/test
     [echo]    test dir gump = build/test
     [echo]    testsaveservice.saveout = ${testsaveservice.saveout}
     [echo]    test.encoding = UTF-8
     [echo]    
     [java] Setting JMeterHome: /x1/jenkins/jenkins-slave/workspace/JMeter-trunk/trunk
     [java] Setting up logging props using file: /x1/jenkins/jenkins-slave/workspace/JMeter-trunk/trunk/bin/testfiles/jmetertest.properties
     [java] Using initializeProperties() from org.apache.jmeter.util.JMeterUtils
     [java] Setting up initial properties using: /x1/jenkins/jenkins-slave/workspace/JMeter-trunk/trunk/bin/testfiles/jmetertest.properties
     [java] Initializing Properties: /x1/jenkins/jenkins-slave/workspace/JMeter-trunk/trunk/bin/testfiles/jmetertest.properties
     [java] JMeterVersion=r1332580
     [java] java.version=1.5.0_22
     [java] java.home=/x1/jenkins/tools/java/jdk1.5.0_22-32/jre
     [java] file.encoding=UTF-8
     [java] default encoding=UTF-8
     [java] user.dir=/x1/jenkins/jenkins-slave/workspace/JMeter-trunk/trunk/bin
     [java] Locale=en_US
     [java] os.name=Linux
     [java] os.version=2.6.32-32-server
     [java] +++++++++++
     [java] java.awt.headless=true
     [java] java.awt.graphicsenv=sun.awt.X11GraphicsEnvironment
     [java] ------------
     [java] Creating test suite
     [java] Scanning build/test for test cases
     [java] ClassFinder found: 87 TestCase classes
     [java] o.a.j.junit.JMeterTest INFO: JMeterGUIComponent: skipping some tests org.apache.jmeter.testbeans.gui.TestBeanGUI
     [java] o.a.j.junit.JMeterTest Error creating org.apache.jmeter.config.gui.RowDetailDialog
java.awt.HeadlessException
     [java] o.a.j.junit.JMeterTest Error creating org.apache.jmeter.functions.gui.FunctionHelper
java.awt.HeadlessException
     [java] o.a.j.junit.JMeterTest Error creating org.apache.jmeter.gui.MainFrame java.awt.HeadlessException
     [java] o.a.j.junit.JMeterTest Error creating org.apache.jmeter.gui.ReportMainFrame java.awt.HeadlessException
     [java] o.a.j.junit.JMeterTest Error creating org.apache.jmeter.gui.SavePropertyDialog
java.awt.HeadlessException
     [java] o.a.j.junit.JMeterTest Error creating org.apache.jmeter.gui.action.SearchTreeDialog
java.awt.HeadlessException
     [java] Last class=org.apache.jmeter.gui.util.JMeterMenuBar
     [java] objects.size=105
     [java] Last error=java.awt.HeadlessException
     [java] ERROR: (see logfile) could not add test for class org.apache.jmeter.junit.JMeterTest
java.lang.reflect.InvocationTargetException
     [java] Created: 86 tests including 7 suites
     [java] Starting test run, test count = 1361
     [java] .........................................
     [java] .........................................
     [java] .........................................
     [java] .........................................
     [java] .........................................
     [java] .........................................
     [java] .........................................
     [java] .........................................
     [java] .........................................
     [java] .........................................
     [java] .........................................
     [java] .........................................
     [java] .........................................
     [java] .........................................
     [java] .........................................
     [java] .........................................
     [java] .........................................
     [java] .........................................
     [java] .........................................
     [java] .........................................
     [java] .........................................
     [java] .........................................
     [java] .........................................
     [java] .........................................
     [java] .........................................
     [java] .........................................
     [java] .........................................
     [java] .........................................
     [java] .........................................
     [java] .........................................
     [java] .........................................
     [java] .........................................
     [java] .........................................
     [java] ........
     [java] Time: 22.718
     [java] 
     [java] OK (1361 tests)
     [java] 

batchtest:
     [echo] Starting BatchTestLocal using -X
   [jmeter] Created the tree successfully using testfiles/BatchTestLocal.jmx
   [jmeter] Starting the test @ Tue May 01 09:02:08 GMT 2012 (1335862928520)
   [jmeter] Waiting for possible shutdown message on port 4446
   [jmeter] Tidying up ...    @ Tue May 01 09:02:49 GMT 2012 (1335862969419)
   [jmeter] ... end of run
     [echo] BatchTestLocal output files compared OK

batchtestserver:
   [server] Created remote object: UnicastServerRef [liveRef: [endpoint:[140.211.11.27:42482](local),objID:[0]]]
   [server] Problem creating registry: java.rmi.server.ExportException: Port already in use:
2099; nested exception is: 
   [server] 	java.net.BindException: Address already in use
   [server] Continuing...

batchtest:
     [echo] Starting BatchTestLocal using -Rlocalhost:2099
   [client] Created the tree successfully using testfiles/BatchTestLocal.jmx
   [client] Configuring remote engine for localhost:2099
   [client] Using remote object: UnicastRef [liveRef: [endpoint:[140.211.11.27:42482](remote),objID:[4a267e20:13707a3496f:-8000,
0]]]
   [client] Starting remote engines
   [client] Starting the test @ Tue May 01 09:02:52 GMT 2012 (1335862972147)
   [server] Starting the test on host localhost:2099 @ Tue May 01 09:02:52 GMT 2012 (1335862972836)
   [client] Remote engines have been started
   [client] Waiting for possible shutdown message on port 4446
   [server] Finished the test on host localhost:2099 @ Tue May 01 09:03:34 GMT 2012 (1335863014906)
- exit requested.
   [client] Tidying up remote @ Tue May 01 09:03:34 GMT 2012 (1335863014906)
   [client] ... end of run
     [echo] BatchTestLocal output files compared OK
   [concat] 2012/05/01 09:02:50 WARN  - jmeter.engine.RemoteJMeterEngineImpl: Problem creating
registry: java.rmi.server.ExportException: Port already in use: 2099; nested exception is:

   [concat] 	java.net.BindException: Address already in use 

BUILD FAILED
/x1/jenkins/jenkins-slave/workspace/JMeter-trunk/trunk/build.xml:2081: Error detected in server
log file. See above.

Total time: 2 minutes 24 seconds
Build step 'Invoke Ant' marked build as failure
[locks-and-latches] Releasing all the locks
[locks-and-latches] All the locks released
Archiving artifacts

Mime
View raw message