jmeter-dev mailing list archives

Site index · List index
Message view « Date » · « Thread »
Top « Date » · « Thread »
From Apache Jenkins Server <jenk...@builds.apache.org>
Subject Build failed in Jenkins: JMeter-trunk #3378
Date Sun, 08 Sep 2013 21:06:18 GMT
See <https://builds.apache.org/job/JMeter-trunk/3378/changes>

Changes:

[pmouawad] Bug 55518 - Add ability to limit number of cached PreparedStatements per connection
when "Prepared Select Statement", "Prepared Update Statement" or "Callable Statement" query
type is selected
Documentation
Bugzilla Id: 55518

[pmouawad] Bug 55518 - Add ability to limit number of cached PreparedStatements per connection
when "Prepared Select Statement", "Prepared Update Statement" or "Callable Statement" query
type is selected
Bugzilla Id: 55518

------------------------------------------
[...truncated 850 lines...]
_pack-source:
      [tar] Building tar: /x1/jenkins/jenkins-slave/workspace/JMeter-trunk/trunk/dist/apache-jmeter-r1520927_src.tar
     [gzip] Building: /x1/jenkins/jenkins-slave/workspace/JMeter-trunk/trunk/dist/apache-jmeter-r1520927_src.tgz
   [delete] Deleting: /x1/jenkins/jenkins-slave/workspace/JMeter-trunk/trunk/dist/apache-jmeter-r1520927_src.tar
      [zip] Building zip: /x1/jenkins/jenkins-slave/workspace/JMeter-trunk/trunk/dist/apache-jmeter-r1520927_src.zip

nightly:

compile-tests:
    [javac] Compiling 99 source files to /x1/jenkins/jenkins-slave/workspace/JMeter-trunk/trunk/build/test

_test:
     [echo] 
     [echo]    gump.run = false
     [echo]    java.awt.headless = true
     [echo]    test.headless = true
     [echo]    user.dir = /x1/jenkins/jenkins-slave/workspace/JMeter-trunk/trunk
     [echo]    basedir = /x1/jenkins/jenkins-slave/workspace/JMeter-trunk/trunk
     [echo]    test dir = build/test
     [echo]    test dir gump = build/test
     [echo]    testsaveservice.saveout = ${testsaveservice.saveout}
     [echo]    test.encoding = UTF-8
     [echo]    
     [java] Setting JMeterHome: /x1/jenkins/jenkins-slave/workspace/JMeter-trunk/trunk
     [java] Setting up logging props using file: /x1/jenkins/jenkins-slave/workspace/JMeter-trunk/trunk/bin/testfiles/jmetertest.properties
     [java] Using initializeProperties() from org.apache.jmeter.util.JMeterUtils
     [java] Setting up initial properties using: /x1/jenkins/jenkins-slave/workspace/JMeter-trunk/trunk/bin/testfiles/jmetertest.properties
     [java] Initializing Properties: /x1/jenkins/jenkins-slave/workspace/JMeter-trunk/trunk/bin/testfiles/jmetertest.properties
     [java] JMeterVersion=r1520927
     [java] java.version=1.6.0_45
     [java] java.home=/x1/jenkins/tools/java/jdk1.6.0_45-32/jre
     [java] file.encoding=UTF-8
     [java] default encoding=UTF-8
     [java] user.dir=/x1/jenkins/jenkins-slave/workspace/JMeter-trunk/trunk/bin
     [java] Locale=en_US
     [java] os.name=Linux
     [java] os.version=3.2.0-51-generic
     [java] +++++++++++
     [java] java.awt.headless=true
     [java] java.awt.graphicsenv=sun.awt.X11GraphicsEnvironment
     [java] ------------
     [java] Creating test suite
     [java] Scanning build/test for test cases
     [java] ClassFinder found: 88 TestCase classes
     [java] o.a.j.junit.JMeterTest Error creating org.apache.jmeter.assertions.gui.BeanShellAssertionGui
java.awt.HeadlessException
     [java] o.a.j.junit.JMeterTest Error creating org.apache.jmeter.assertions.gui.XPathAssertionGui
java.awt.HeadlessException
     [java] o.a.j.junit.JMeterTest Error creating org.apache.jmeter.protocol.java.control.gui.BeanShellSamplerGui
java.awt.HeadlessException
     [java] o.a.j.junit.JMeterTest Error creating org.apache.jmeter.protocol.tcp.config.gui.TCPConfigGui
java.awt.HeadlessException
     [java] o.a.j.junit.JMeterTest Error creating org.apache.jmeter.protocol.tcp.control.gui.TCPSamplerGui
java.awt.HeadlessException
     [java] Last class=org.apache.jmeter.visualizers.ViewResultsFullVisualizer
     [java] objects.size=101
     [java] Last error=java.awt.HeadlessException
     [java] ERROR: (see logfile) could not add test for class org.apache.jmeter.junit.JMeterTest
java.lang.reflect.InvocationTargetException
     [java] 	at sun.reflect.NativeMethodAccessorImpl.invoke0(Native Method)
     [java] 	at sun.reflect.NativeMethodAccessorImpl.invoke(NativeMethodAccessorImpl.java:39)
     [java] 	at sun.reflect.DelegatingMethodAccessorImpl.invoke(DelegatingMethodAccessorImpl.java:25)
     [java] 	at java.lang.reflect.Method.invoke(Method.java:597)
     [java] 	at org.apache.jorphan.test.AllTests.suite(AllTests.java:356)
     [java] 	at org.apache.jorphan.test.AllTests.main(AllTests.java:213)
     [java] Caused by: java.lang.ExceptionInInitializerError
     [java] 	at org.apache.jmeter.visualizers.SearchTextExtension.createSearchTextPanel(SearchTextExtension.java:208)
     [java] 	at org.apache.jmeter.visualizers.SearchTextExtension.createSearchTextExtensionPane(SearchTextExtension.java:220)
     [java] 	at org.apache.jmeter.visualizers.SamplerResultTab.createResponseDataPanel(SamplerResultTab.java:462)
     [java] 	at org.apache.jmeter.visualizers.SamplerResultTab.init(SamplerResultTab.java:208)
     [java] 	at org.apache.jmeter.visualizers.ViewResultsFullVisualizer.init(ViewResultsFullVisualizer.java:229)
     [java] 	at org.apache.jmeter.visualizers.ViewResultsFullVisualizer.<init>(ViewResultsFullVisualizer.java:122)
     [java] 	at sun.reflect.NativeConstructorAccessorImpl.newInstance0(Native Method)
     [java] 	at sun.reflect.NativeConstructorAccessorImpl.newInstance(NativeConstructorAccessorImpl.java:39)
     [java] 	at sun.reflect.DelegatingConstructorAccessorImpl.newInstance(DelegatingConstructorAccessorImpl.java:27)
     [java] 	at java.lang.reflect.Constructor.newInstance(Constructor.java:513)
     [java] 	at java.lang.Class.newInstance0(Class.java:357)
     [java] 	at java.lang.Class.newInstance(Class.java:310)
     [java] 	at org.apache.jmeter.junit.JMeterTest.getObjects(JMeterTest.java:578)
     [java] 	at org.apache.jmeter.junit.JMeterTest.suiteGUIComponents(JMeterTest.java:279)
     [java] 	at org.apache.jmeter.junit.JMeterTest.suite(JMeterTest.java:141)
     [java] 	... 6 more
     [java] Caused by: java.awt.HeadlessException
     [java] 	at sun.awt.HeadlessToolkit.getMenuShortcutKeyMask(HeadlessToolkit.java:213)
     [java] 	at org.apache.jmeter.gui.action.KeyStrokes.<clinit>(KeyStrokes.java:37)
     [java] 	... 21 more
     [java] 
     [java] Created: 87 tests including 7 suites
     [java] Starting test run, test count = 1500
     [java] .........................................
     [java] .........................................
     [java] .........................................
     [java] .........................................
     [java] .........................................
     [java] .........................................
     [java] .........................................
     [java] .........................................
     [java] .........................................
     [java] .........................................
     [java] .........................................
     [java] .........................................
     [java] .........................................
     [java] .........................................
     [java] .........................................
     [java] .........................................
     [java] .........................................
     [java] .........................................
     [java] .........................................
     [java] .........................................
     [java] .........................................
     [java] .........................................
     [java] .........................................
     [java] .........................................
     [java] .........................................
     [java] .........................................
     [java] .........................................
     [java] .........................................
     [java] .........................................
     [java] .........................................
     [java] .........................................
     [java] .........................................
     [java] .........................................
     [java] .........................................
     [java] .........................................
     [java] .........................................
     [java] ........................
     [java] Time: 55.87
     [java] 
     [java] OK (1500 tests)
     [java] 

batchtest:
     [echo] Starting BatchTestLocal using -X
   [jmeter] Created the tree successfully using testfiles/BatchTestLocal.jmx
   [jmeter] Starting the test @ Sun Sep 08 21:04:05 UTC 2013 (1378674245889)
   [jmeter] Waiting for possible shutdown message on port 4445
   [jmeter] Tidying up ...    @ Sun Sep 08 21:04:42 UTC 2013 (1378674282799)
   [jmeter] ... end of run
     [echo] BatchTestLocal output files compared OK

batchtestserver:
   [server] Created remote object: UnicastServerRef [liveRef: [endpoint:[140.211.11.27:41493](local),objID:[5837a49a:140ff64161d:-7fff,
-518934976873429346]]]

batchtest:
     [echo] Starting BatchTestLocal using -Rlocalhost:2099
   [client] Created the tree successfully using testfiles/BatchTestLocal.jmx
   [client] Configuring remote engine for localhost:2099
   [client] Using remote object: UnicastRef [liveRef: [endpoint:[140.211.11.27:41493](remote),objID:[5837a49a:140ff64161d:-7fff,
-518934976873429346]]]
   [client] Starting remote engines
   [client] Starting the test @ Sun Sep 08 21:04:45 UTC 2013 (1378674285609)
   [client] Remote engines have been started
   [client] Waiting for possible shutdown message on port 4445
   [server] Starting the test on host localhost:2099 @ Sun Sep 08 21:04:46 UTC 2013 (1378674286385)
   [server] Finished the test on host localhost:2099 @ Sun Sep 08 21:05:25 UTC 2013 (1378674325011)
- exit requested.
   [client] Tidying up remote @ Sun Sep 08 21:05:25 UTC 2013 (1378674325011)
   [client] ... end of run
     [echo] BatchTestLocal output files compared OK

batch_scripts:

batchtest:
     [echo] Starting HTMLParserTestFile_2 using -X
   [jmeter] Created the tree successfully using testfiles/HTMLParserTestFile_2.jmx
   [jmeter] Starting the test @ Sun Sep 08 21:05:31 UTC 2013 (1378674331427)
   [jmeter] Waiting for possible shutdown message on port 4445
   [jmeter] Tidying up ...    @ Sun Sep 08 21:05:32 UTC 2013 (1378674332184)
   [jmeter] ... end of run
     [echo] HTMLParserTestFile_2 output files compared OK

batchtest:
     [echo] Starting Bug47165 using -X
   [jmeter] Created the tree successfully using testfiles/Bug47165.jmx
   [jmeter] Starting the test @ Sun Sep 08 21:05:33 UTC 2013 (1378674333626)
   [jmeter] Waiting for possible shutdown message on port 4445
   [jmeter] Tidying up ...    @ Sun Sep 08 21:05:34 UTC 2013 (1378674334175)
   [jmeter] ... end of run
     [echo] Bug47165 output files compared OK

batchtest:
     [echo] Starting Bug52310 using -X
   [jmeter] Created the tree successfully using testfiles/Bug52310.jmx
   [jmeter] Starting the test @ Sun Sep 08 21:05:35 UTC 2013 (1378674335627)
   [jmeter] Waiting for possible shutdown message on port 4445
   [jmeter] Tidying up ...    @ Sun Sep 08 21:05:40 UTC 2013 (1378674340044)
   [jmeter] ... end of run
     [echo] Bug52310 output files compared OK

batchtest:
     [echo] Starting Bug52968 using -X
   [jmeter] Created the tree successfully using testfiles/Bug52968.jmx
   [jmeter] Starting the test @ Sun Sep 08 21:05:41 UTC 2013 (1378674341536)
   [jmeter] Waiting for possible shutdown message on port 4445
   [jmeter] Tidying up ...    @ Sun Sep 08 21:05:55 UTC 2013 (1378674355176)
   [jmeter] ... end of run
     [echo] Bug52968 output files compared OK

batchtest:
     [echo] Starting Bug50898 using -X
   [jmeter] Created the tree successfully using testfiles/Bug50898.jmx
   [jmeter] Starting the test @ Sun Sep 08 21:05:56 UTC 2013 (1378674356539)
   [jmeter] Waiting for possible shutdown message on port 4445
   [jmeter] Tidying up ...    @ Sun Sep 08 21:05:57 UTC 2013 (1378674357502)
   [jmeter] ... end of run
     [echo] Bug50898 output files compared OK

batchtest:
     [echo] Starting Bug54685 using -X
   [jmeter] Created the tree successfully using testfiles/Bug54685.jmx
   [jmeter] Starting the test @ Sun Sep 08 21:05:58 UTC 2013 (1378674358915)
   [jmeter] Waiting for possible shutdown message on port 4445
   [jmeter] Tidying up ...    @ Sun Sep 08 21:05:59 UTC 2013 (1378674359799)
   [jmeter] ... end of run
     [echo] Bug54685 output files compared OK

batchtest:
     [echo] Starting Bug55375 using -X
   [jmeter] Created the tree successfully using testfiles/Bug55375.jmx
   [jmeter] Starting the test @ Sun Sep 08 21:06:01 UTC 2013 (1378674361255)
   [jmeter] Waiting for possible shutdown message on port 4445
   [jmeter] Tidying up ...    @ Sun Sep 08 21:06:02 UTC 2013 (1378674362116)
   [jmeter] ... end of run
     [echo] Bug55375 output files compared OK

batchtestserver:
   [server] Problem creating registry: java.rmi.server.ExportException: Port already in use:
2099; nested exception is: 
   [server] 	java.net.BindExcepCreated remote object: UnicastServerRef [liveRef: [endpoint:[140.211.11.27:58140](local),objID:[2d6f0dfd:140ff654bd4:-7fff,
7619tion: Address already in use
   [server] Continuing...
   [server] 029677743072893]]]

batchtest:
     [echo] Starting Bug54685 using -Rlocalhost:2099
   [client] Created the tree successfully using testfiles/Bug54685.jmx
   [client] Configuring remote engine for localhost:2099
   [client] Using remote object: UnicastRef [liveRef: [endpoint:[140.211.11.27:58140](remote),objID:[2d6f0dfd:140ff654bd4:-7fff,
7619029677743072893]]]
   [client] Starting remote engines
   [client] Starting the test @ Sun Sep 08 21:06:04 UTC 2013 (1378674364609)
   [server] Starting the test on host localhost:2099 @ Sun Sep 08 21:06:05 UTC 2013 (1378674365269)
   [client] Remote engines have been started
   [client] Waiting for possible shutdown message on port 4445
   [server] Finished the test on host localhost:2099 @ Sun Sep 08 21:06:06 UTC 2013 (1378674366199)
- exit requested.
   [client] Tidying up remote @ Sun Sep 08 21:06:06 UTC 2013 (1378674366198)
   [client] ... end of run
     [echo] Bug54685 output files compared OK
   [concat] 2013/09/08 21:06:03 WARN  - jmeter.engine.RemoteJMeterEngineImpl: Problem creating
registry: java.rmi.server.ExportException: Port already in use: 2099; nested exception is:

   [concat] 	java.net.BindException: Address already in use 

BUILD FAILED
/x1/jenkins/jenkins-slave/workspace/JMeter-trunk/trunk/build.xml:2605: The following error
occurred while executing this line:
/x1/jenkins/jenkins-slave/workspace/JMeter-trunk/trunk/build.xml:2441: Error detected in server
log file. See above.

Total time: 3 minutes 36 seconds
Build step 'Invoke Ant' marked build as failure
[locks-and-latches] Releasing all the locks
[locks-and-latches] All the locks released
Archiving artifacts

Mime
View raw message