jmeter-dev mailing list archives

Site index · List index
Message view « Date » · « Thread »
Top « Date » · « Thread »
From Apache Jenkins Server <jenk...@builds.apache.org>
Subject Build failed in Jenkins: JMeter-trunk #5007
Date Sun, 28 Feb 2016 14:01:16 GMT
See <https://builds.apache.org/job/JMeter-trunk/5007/changes>

Changes:

[pmouawad] Bug 56554 - JSR223 Test Element : Generate compilation cache key automatically
Update documentation 
Remove also mention of old versions
Bugzilla Id: 56554

[pmouawad] Remove plastic style so that all badges look the same

[pmouawad] Bug 57182 - Better defaults : Save idle time by default 
Bugzilla Id: 57182

------------------------------------------
[...truncated 813 lines...]
   [anakia] Output: <https://builds.apache.org/job/JMeter-trunk/ws/trunk/printable_docs/building.html>
   [anakia] Input:  changes.xml
   [anakia] Output: <https://builds.apache.org/job/JMeter-trunk/ws/trunk/printable_docs/changes.html>
   [anakia] Input:  changes_history.xml
   [anakia] Output: <https://builds.apache.org/job/JMeter-trunk/ws/trunk/printable_docs/changes_history.html>
   [anakia] Input:  devguide-dashboard.xml
   [anakia] Output: <https://builds.apache.org/job/JMeter-trunk/ws/trunk/printable_docs/devguide-dashboard.html>
   [anakia] Input:  download_jmeter.xml
   [anakia] Output: <https://builds.apache.org/job/JMeter-trunk/ws/trunk/printable_docs/download_jmeter.html>
   [anakia] Input:  index.xml
   [anakia] Output: <https://builds.apache.org/job/JMeter-trunk/ws/trunk/printable_docs/index.html>
   [anakia] Input:  issues.xml
   [anakia] Output: <https://builds.apache.org/job/JMeter-trunk/ws/trunk/printable_docs/issues.html>
   [anakia] Input:  jmeter_irc.xml
   [anakia] Output: <https://builds.apache.org/job/JMeter-trunk/ws/trunk/printable_docs/jmeter_irc.html>
   [anakia] Input:  localising/index.xml
   [anakia] Output: <https://builds.apache.org/job/JMeter-trunk/ws/trunk/printable_docs/localising/index.html>
   [anakia] Input:  mail.xml
   [anakia] Output: <https://builds.apache.org/job/JMeter-trunk/ws/trunk/printable_docs/mail.html>
   [anakia] Input:  mail2.xml
   [anakia] Output: <https://builds.apache.org/job/JMeter-trunk/ws/trunk/printable_docs/mail2.html>
   [anakia] Input:  nightly.xml
   [anakia] Output: <https://builds.apache.org/job/JMeter-trunk/ws/trunk/printable_docs/nightly.html>
   [anakia] Input:  svnindex.xml
   [anakia] Output: <https://builds.apache.org/job/JMeter-trunk/ws/trunk/printable_docs/svnindex.html>
   [anakia] Input:  usermanual/best-practices.xml
   [anakia] Output: <https://builds.apache.org/job/JMeter-trunk/ws/trunk/printable_docs/usermanual/best-practices.html>
   [anakia] Input:  usermanual/boss.xml
   [anakia] Output: <https://builds.apache.org/job/JMeter-trunk/ws/trunk/printable_docs/usermanual/boss.html>
   [anakia] Input:  usermanual/build-adv-web-test-plan.xml
   [anakia] Output: <https://builds.apache.org/job/JMeter-trunk/ws/trunk/printable_docs/usermanual/build-adv-web-test-plan.html>
   [anakia] Input:  usermanual/build-db-test-plan.xml
   [anakia] Output: <https://builds.apache.org/job/JMeter-trunk/ws/trunk/printable_docs/usermanual/build-db-test-plan.html>
   [anakia] Input:  usermanual/build-ftp-test-plan.xml
   [anakia] Output: <https://builds.apache.org/job/JMeter-trunk/ws/trunk/printable_docs/usermanual/build-ftp-test-plan.html>
   [anakia] Input:  usermanual/build-jms-point-to-point-test-plan.xml
   [anakia] Output: <https://builds.apache.org/job/JMeter-trunk/ws/trunk/printable_docs/usermanual/build-jms-point-to-point-test-plan.html>
   [anakia] Input:  usermanual/build-jms-topic-test-plan.xml
   [anakia] Output: <https://builds.apache.org/job/JMeter-trunk/ws/trunk/printable_docs/usermanual/build-jms-topic-test-plan.html>
   [anakia] Input:  usermanual/build-ldap-test-plan.xml
   [anakia] Output: <https://builds.apache.org/job/JMeter-trunk/ws/trunk/printable_docs/usermanual/build-ldap-test-plan.html>
   [anakia] Input:  usermanual/build-ldapext-test-plan.xml
   [anakia] Output: <https://builds.apache.org/job/JMeter-trunk/ws/trunk/printable_docs/usermanual/build-ldapext-test-plan.html>
   [anakia] Input:  usermanual/build-monitor-test-plan.xml
   [anakia] Output: <https://builds.apache.org/job/JMeter-trunk/ws/trunk/printable_docs/usermanual/build-monitor-test-plan.html>
   [anakia] Input:  usermanual/build-test-plan.xml
   [anakia] Output: <https://builds.apache.org/job/JMeter-trunk/ws/trunk/printable_docs/usermanual/build-test-plan.html>
   [anakia] Input:  usermanual/build-web-test-plan.xml
   [anakia] Output: <https://builds.apache.org/job/JMeter-trunk/ws/trunk/printable_docs/usermanual/build-web-test-plan.html>
   [anakia] Input:  usermanual/build-ws-test-plan.xml
   [anakia] Output: <https://builds.apache.org/job/JMeter-trunk/ws/trunk/printable_docs/usermanual/build-ws-test-plan.html>
   [anakia] Input:  usermanual/component_reference.xml
   [anakia] Output: <https://builds.apache.org/job/JMeter-trunk/ws/trunk/printable_docs/usermanual/component_reference.html>
   [anakia] Input:  usermanual/functions.xml
   [anakia] Output: <https://builds.apache.org/job/JMeter-trunk/ws/trunk/printable_docs/usermanual/functions.html>
   [anakia] Input:  usermanual/generating-dashboard.xml
   [anakia] Output: <https://builds.apache.org/job/JMeter-trunk/ws/trunk/printable_docs/usermanual/generating-dashboard.html>
   [anakia] Input:  usermanual/get-started.xml
   [anakia] Output: <https://builds.apache.org/job/JMeter-trunk/ws/trunk/printable_docs/usermanual/get-started.html>
   [anakia] Input:  usermanual/glossary.xml
   [anakia] Output: <https://builds.apache.org/job/JMeter-trunk/ws/trunk/printable_docs/usermanual/glossary.html>
   [anakia] Input:  usermanual/hints_and_tips.xml
   [anakia] Output: <https://builds.apache.org/job/JMeter-trunk/ws/trunk/printable_docs/usermanual/hints_and_tips.html>
   [anakia] Input:  usermanual/index.xml
   [anakia] Output: <https://builds.apache.org/job/JMeter-trunk/ws/trunk/printable_docs/usermanual/index.html>
   [anakia] Input:  usermanual/intro.xml
   [anakia] Output: <https://builds.apache.org/job/JMeter-trunk/ws/trunk/printable_docs/usermanual/intro.html>
   [anakia] Input:  usermanual/ldapanswer_xml.xml
   [anakia] Output: <https://builds.apache.org/job/JMeter-trunk/ws/trunk/printable_docs/usermanual/ldapanswer_xml.html>
   [anakia] Input:  usermanual/ldapops_tutor.xml
   [anakia] Output: <https://builds.apache.org/job/JMeter-trunk/ws/trunk/printable_docs/usermanual/ldapops_tutor.html>
   [anakia] Input:  usermanual/listeners.xml
   [anakia] Output: <https://builds.apache.org/job/JMeter-trunk/ws/trunk/printable_docs/usermanual/listeners.html>
   [anakia] Input:  usermanual/realtime-results.xml
   [anakia] Output: <https://builds.apache.org/job/JMeter-trunk/ws/trunk/printable_docs/usermanual/realtime-results.html>
   [anakia] Input:  usermanual/regular_expressions.xml
   [anakia] Output: <https://builds.apache.org/job/JMeter-trunk/ws/trunk/printable_docs/usermanual/regular_expressions.html>
   [anakia] Input:  usermanual/remote-test.xml
   [anakia] Output: <https://builds.apache.org/job/JMeter-trunk/ws/trunk/printable_docs/usermanual/remote-test.html>
   [anakia] Input:  usermanual/test_plan.xml
   [anakia] Output: <https://builds.apache.org/job/JMeter-trunk/ws/trunk/printable_docs/usermanual/test_plan.html>
     [echo] Fixing EOL
     [echo] Removing unnecessary </br> tags
     [echo] Copying files
     [copy] Copying 16 files to <https://builds.apache.org/job/JMeter-trunk/ws/trunk/printable_docs/demos>
     [copy] Copying 5 files to <https://builds.apache.org/job/JMeter-trunk/ws/trunk/printable_docs/usermanual>
     [copy] Copying 1 file to <https://builds.apache.org/job/JMeter-trunk/ws/trunk/printable_docs/extending>

pack-nightly:

_pack-binaries:
      [tar] Building tar: <https://builds.apache.org/job/JMeter-trunk/5007/artifact/trunk/dist/apache-jmeter-r1732732_bin.tar>
     [gzip] Building: <https://builds.apache.org/job/JMeter-trunk/5007/artifact/trunk/dist/apache-jmeter-r1732732_bin.tgz>
   [delete] Deleting: <https://builds.apache.org/job/JMeter-trunk/5007/artifact/trunk/dist/apache-jmeter-r1732732_bin.tar>
      [zip] Building zip: <https://builds.apache.org/job/JMeter-trunk/5007/artifact/trunk/dist/apache-jmeter-r1732732_bin.zip>

_pack-libraries:
      [tar] Building tar: <https://builds.apache.org/job/JMeter-trunk/5007/artifact/trunk/dist/apache-jmeter-r1732732_lib.tar>
     [gzip] Building: <https://builds.apache.org/job/JMeter-trunk/5007/artifact/trunk/dist/apache-jmeter-r1732732_lib.tgz>
   [delete] Deleting: <https://builds.apache.org/job/JMeter-trunk/5007/artifact/trunk/dist/apache-jmeter-r1732732_lib.tar>
      [zip] Building zip: <https://builds.apache.org/job/JMeter-trunk/5007/artifact/trunk/dist/apache-jmeter-r1732732_lib.zip>

_pack-source:
      [tar] Building tar: <https://builds.apache.org/job/JMeter-trunk/5007/artifact/trunk/dist/apache-jmeter-r1732732_src.tar>
     [gzip] Building: <https://builds.apache.org/job/JMeter-trunk/5007/artifact/trunk/dist/apache-jmeter-r1732732_src.tgz>
   [delete] Deleting: <https://builds.apache.org/job/JMeter-trunk/5007/artifact/trunk/dist/apache-jmeter-r1732732_src.tar>
      [zip] Building zip: <https://builds.apache.org/job/JMeter-trunk/5007/artifact/trunk/dist/apache-jmeter-r1732732_src.zip>

nightly:

compile-tests:
    [javac] Compiling 125 source files to <https://builds.apache.org/job/JMeter-trunk/ws/trunk/build/test>
    [javac] Note: Some input files use or override a deprecated API.
    [javac] Note: Recompile with -Xlint:deprecation for details.

_test:
     [echo] 
     [echo]    gump.run = false
     [echo]    java.awt.headless = true
     [echo]    test.headless = true
     [echo]    user.dir = <https://builds.apache.org/job/JMeter-trunk/ws/trunk>
     [echo]    basedir = <https://builds.apache.org/job/JMeter-trunk/ws/trunk>
     [echo]    test dir = build/test
     [echo]    test dir gump = build/test
     [echo]    testsaveservice.saveout = ${testsaveservice.saveout}
     [echo]    test.encoding = UTF-8
     [echo]    
     [java] Setting JMeterHome: <https://builds.apache.org/job/JMeter-trunk/ws/trunk>
     [java] Setting up logging props using file: <https://builds.apache.org/job/JMeter-trunk/ws/trunk/bin/testfiles/jmetertest.properties>
     [java] Writing log file to:<https://builds.apache.org/job/JMeter-trunk/ws/trunk/bin/jmeter-test.log>
     [java] Using initializeProperties() from org.apache.jmeter.util.JMeterUtils
     [java] Setting up initial properties using: <https://builds.apache.org/job/JMeter-trunk/ws/trunk/bin/testfiles/jmetertest.properties>
     [java] Initializing Properties: <https://builds.apache.org/job/JMeter-trunk/ws/trunk/bin/testfiles/jmetertest.properties>
     [java] Writing log file to:<https://builds.apache.org/job/JMeter-trunk/ws/trunk/bin/jmeter-test.log>
     [java] JMeterVersion=r1732732
     [java] java.version=1.7.0_80
     [java] java.home=/home/jenkins/jenkins-slave/tools/hudson.model.JDK/latest1.7/jre
     [java] file.encoding=UTF-8
     [java] default encoding=UTF-8
     [java] user.dir=<https://builds.apache.org/job/JMeter-trunk/ws/trunk/bin>
     [java] Locale=en_US
     [java] os.name=Linux
     [java] os.version=3.13.0-36-lowlatency
     [java] +++++++++++
     [java] java.awt.headless=true
     [java] java.awt.graphicsenv=sun.awt.X11GraphicsEnvironment
     [java] ------------
     [java] Searching junit tests in : build/test
     [java] Skipping test:org.apache.jmeter.junit.JMeterTest, cannot run in Headless mode
     [java] ................................................................................................................................................................................................................................................................................................................................................................................................................................................................................................................................................................................................................................................................................................................................................................................................................................................................................................................................................................................................................................................................................................................................................................................................................................................................................................
     [java] Loading file testfiles/AssertionTestPlan.jmx and saving it back changes its size
from 6214 to 6292.
     [java] Number of lines changes from 121 to 123
     [java] 
     [java] Loading file testfiles/AuthManagerTestPlan.jmx and saving it back changes its
size from 7879 to 7918.
     [java] Number of lines changes from 136 to 137
     [java] 
     [java] Loading file testfiles/HeaderManagerTestPlan.jmx and saving it back changes its
size from 4768 to 4807.
     [java] Number of lines changes from 89 to 90
     [java] 
     [java] Loading file testfiles/InterleaveTestPlan2.jmx and saving it back changes its
size from 9395 to 9434.
     [java] Number of lines changes from 156 to 157
     [java] 
     [java] Loading file testfiles/InterleaveTestPlan.jmx and saving it back changes its size
from 7528 to 7567.
     [java] Number of lines changes from 129 to 130
     [java] 
     [java] Loading file testfiles/LoopTestPlan.jmx and saving it back changes its size from
6379 to 6418.
     [java] Number of lines changes from 113 to 114
     [java] 
     [java] Loading file testfiles/OnceOnlyTestPlan.jmx and saving it back changes its size
from 6235 to 6274.
     [java] Number of lines changes from 110 to 111
     [java] 
     [java] Loading file testfiles/SimpleTestPlan.jmx and saving it back changes its size
from 8776 to 8815.
     [java] Number of lines changes from 147 to 148
     [java] 
     [java] Loading file testfiles/GuiTest.jmx and saving it back changes its size from 44884
to 45171.
     [java] Number of lines changes from 794 to 801
     [java] 
     [java] Loading file testfiles/GuiTest231.jmx and saving it back changes its size from
65545 to 66037.
     [java] Number of lines changes from 1153 to 1165
     [java] 
     [java] Loading file testfiles/GenTest27.jmx and saving it back changes its size from
80101 to 80634.
     [java] Number of lines changes from 1393 to 1406
     [java] 
     [java] Loading file testfiles/GenTest210.jmx and saving it back changes its size from
86563 to 87137.
     [java] Number of lines changes from 1505 to 1519
     [java] 
     [java] Loading file testfiles/GuiTest231_original.jmx and saving it back changes its
size from 69615 to 70060.
     [java] Number of lines changes from 1222 to 1235
     [java] 
     [java] Loading file testfiles/GenTest25.jmx and saving it back changes its size from
79764 to 80262.
     [java] Number of lines changes from 1396 to 1410
     [java] 
     [java] Loading file testfiles/GenTest251.jmx and saving it back changes its size from
79622 to 80120.
     [java] Number of lines changes from 1394 to 1408
     [java] 
     [java] Loading file testfiles/GenTest26.jmx and saving it back changes its size from
81792 to 82329.
     [java] Number of lines changes from 1431 to 1445
     [java] 
     [java] Loading file testfiles/GenTest27_original.jmx and saving it back changes its size
from 81591 to 82096.
     [java] Number of lines changes from 1415 to 1428
     [java] E.....................................................................................................................................................................................................................................................................................................................................................................................................I.............................................................................................................................................................................................................................................
     [java] Time: 95.001
     [java] There was 1 failure:
     [java] 1) testLoadAndSave(org.apache.jmeter.save.TestSaveService)
     [java] java.lang.AssertionError: One or more failures detected
     [java] 	at org.junit.Assert.fail(Assert.java:88)
     [java] 	at org.apache.jmeter.save.TestSaveService.testLoadAndSave(TestSaveService.java:110)
     [java] 	at sun.reflect.NativeMethodAccessorImpl.invoke0(Native Method)
     [java] 	at sun.reflect.NativeMethodAccessorImpl.invoke(NativeMethodAccessorImpl.java:57)
     [java] 	at sun.reflect.DelegatingMethodAccessorImpl.invoke(DelegatingMethodAccessorImpl.java:43)
     [java] 	at java.lang.reflect.Method.invoke(Method.java:606)
     [java] 	at org.junit.runners.model.FrameworkMethod$1.runReflectiveCall(FrameworkMethod.java:50)
     [java] 	at org.junit.internal.runners.model.ReflectiveCallable.run(ReflectiveCallable.java:12)
     [java] 	at org.junit.runners.model.FrameworkMethod.invokeExplosively(FrameworkMethod.java:47)
     [java] 	at org.junit.internal.runners.statements.InvokeMethod.evaluate(InvokeMethod.java:17)
     [java] 	at org.junit.runners.ParentRunner.runLeaf(ParentRunner.java:325)
     [java] 	at org.junit.runners.BlockJUnit4ClassRunner.runChild(BlockJUnit4ClassRunner.java:78)
     [java] 	at org.junit.runners.BlockJUnit4ClassRunner.runChild(BlockJUnit4ClassRunner.java:57)
     [java] 	at org.junit.runners.ParentRunner$3.run(ParentRunner.java:290)
     [java] 	at org.junit.runners.ParentRunner$1.schedule(ParentRunner.java:71)
     [java] 	at org.junit.runners.ParentRunner.runChildren(ParentRunner.java:288)
     [java] 	at org.junit.runners.ParentRunner.access$000(ParentRunner.java:58)
     [java] 	at org.junit.runners.ParentRunner$2.evaluate(ParentRunner.java:268)
     [java] 	at org.junit.runners.ParentRunner.run(ParentRunner.java:363)
     [java] 	at org.junit.runners.Suite.runChild(Suite.java:128)
     [java] 	at org.junit.runners.Suite.runChild(Suite.java:27)
     [java] 	at org.junit.runners.ParentRunner$3.run(ParentRunner.java:290)
     [java] 	at org.junit.runners.ParentRunner$1.schedule(ParentRunner.java:71)
     [java] 	at org.junit.runners.ParentRunner.runChildren(ParentRunner.java:288)
     [java] 	at org.junit.runners.ParentRunner.access$000(ParentRunner.java:58)
     [java] 	at org.junit.runners.ParentRunner$2.evaluate(ParentRunner.java:268)
     [java] 	at org.junit.runners.ParentRunner.run(ParentRunner.java:363)
     [java] 	at org.junit.runner.JUnitCore.run(JUnitCore.java:137)
     [java] 	at org.junit.runner.JUnitCore.run(JUnitCore.java:115)
     [java] 	at org.apache.jorphan.test.AllTests.main(AllTests.java:212)
     [java] 
     [java] FAILURES!!!
     [java] Tests run: 1874,  Failures: 1
     [java] 

BUILD FAILED
<https://builds.apache.org/job/JMeter-trunk/ws/trunk/build.xml>:2630: Java returned:
1

Total time: 2 minutes 54 seconds
Build step 'Invoke Ant' marked build as failure
[locks-and-latches] Releasing all the locks
[locks-and-latches] All the locks released
Archiving artifacts
Compressed 102.39 MB of artifacts by 27.1% relative to #5006

Mime
View raw message