jmeter-dev mailing list archives

Site index · List index
Message view « Date » · « Thread »
Top « Date » · « Thread »
From Apache Jenkins Server <jenk...@builds.apache.org>
Subject Build failed in Jenkins: JMeter-trunk #5016
Date Sun, 28 Feb 2016 19:00:04 GMT
See <https://builds.apache.org/job/JMeter-trunk/5016/changes>

Changes:

[pmouawad] Remove since JMeter 2.X when too old or meaningless
Update docs for CookieManager
Fix some typos and errors

[pmouawad] Test distributing full bundle for nightly build, see Bug 58936
Update nightly build documentation
Bugzilla Id: 58936

------------------------------------------
[...truncated 1036 lines...]
  [javadoc] Loading source files for package org.apache.jmeter.protocol.system.gui...
  [javadoc] Loading source files for package org.apache.jmeter.protocol.mongodb.config...
  [javadoc] Loading source files for package org.apache.jmeter.protocol.mongodb.mongo...
  [javadoc] Loading source files for package org.apache.jmeter.protocol.mongodb.sampler...
  [javadoc] Constructing Javadoc information...
  [javadoc] Standard Doclet version 1.7.0_80
  [javadoc] Building tree for all the packages and classes...
  [javadoc] <https://builds.apache.org/job/JMeter-trunk/ws/trunk/src/protocol/http/org/apache/jmeter/protocol/http/sampler/HTTPHC4Impl.java>:783:
warning - Tag @see:illegal character: "58" in "https://bz.apache.org/bugzilla/show_bug.cgi?id=58099"
  [javadoc] <https://builds.apache.org/job/JMeter-trunk/ws/trunk/src/protocol/http/org/apache/jmeter/protocol/http/sampler/HTTPHC4Impl.java>:783:
warning - Tag @see:illegal character: "47" in "https://bz.apache.org/bugzilla/show_bug.cgi?id=58099"
  [javadoc] <https://builds.apache.org/job/JMeter-trunk/ws/trunk/src/protocol/http/org/apache/jmeter/protocol/http/sampler/HTTPHC4Impl.java>:783:
warning - Tag @see:illegal character: "47" in "https://bz.apache.org/bugzilla/show_bug.cgi?id=58099"
  [javadoc] <https://builds.apache.org/job/JMeter-trunk/ws/trunk/src/protocol/http/org/apache/jmeter/protocol/http/sampler/HTTPHC4Impl.java>:783:
warning - Tag @see:illegal character: "47" in "https://bz.apache.org/bugzilla/show_bug.cgi?id=58099"
  [javadoc] <https://builds.apache.org/job/JMeter-trunk/ws/trunk/src/protocol/http/org/apache/jmeter/protocol/http/sampler/HTTPHC4Impl.java>:783:
warning - Tag @see:illegal character: "47" in "https://bz.apache.org/bugzilla/show_bug.cgi?id=58099"
  [javadoc] <https://builds.apache.org/job/JMeter-trunk/ws/trunk/src/protocol/http/org/apache/jmeter/protocol/http/sampler/HTTPHC4Impl.java>:783:
warning - Tag @see:illegal character: "63" in "https://bz.apache.org/bugzilla/show_bug.cgi?id=58099"
  [javadoc] <https://builds.apache.org/job/JMeter-trunk/ws/trunk/src/protocol/http/org/apache/jmeter/protocol/http/sampler/HTTPHC4Impl.java>:783:
warning - Tag @see:illegal character: "61" in "https://bz.apache.org/bugzilla/show_bug.cgi?id=58099"
  [javadoc] <https://builds.apache.org/job/JMeter-trunk/ws/trunk/src/protocol/http/org/apache/jmeter/protocol/http/sampler/LazySchemeSocketFactory.java>:78:
warning - @return tag has no arguments.
  [javadoc] <https://builds.apache.org/job/JMeter-trunk/ws/trunk/src/protocol/http/org/apache/jmeter/protocol/http/sampler/LazySchemeSocketFactory.java>:94:
warning - @return tag has no arguments.
  [javadoc] <https://builds.apache.org/job/JMeter-trunk/ws/trunk/src/protocol/http/org/apache/jmeter/protocol/http/sampler/LazySchemeSocketFactory.java>:107:
warning - @return tag has no arguments.
  [javadoc] <https://builds.apache.org/job/JMeter-trunk/ws/trunk/src/protocol/http/org/apache/jmeter/protocol/http/sampler/MeasuringConnectionManager.java>:73:
warning - Tag @see:illegal character: "58" in "https://bz.apache.org/bugzilla/show_bug.cgi?id=57935"
  [javadoc] <https://builds.apache.org/job/JMeter-trunk/ws/trunk/src/protocol/http/org/apache/jmeter/protocol/http/sampler/MeasuringConnectionManager.java>:73:
warning - Tag @see:illegal character: "47" in "https://bz.apache.org/bugzilla/show_bug.cgi?id=57935"
  [javadoc] <https://builds.apache.org/job/JMeter-trunk/ws/trunk/src/protocol/http/org/apache/jmeter/protocol/http/sampler/MeasuringConnectionManager.java>:73:
warning - Tag @see:illegal character: "47" in "https://bz.apache.org/bugzilla/show_bug.cgi?id=57935"
  [javadoc] <https://builds.apache.org/job/JMeter-trunk/ws/trunk/src/protocol/http/org/apache/jmeter/protocol/http/sampler/MeasuringConnectionManager.java>:73:
warning - Tag @see:illegal character: "47" in "https://bz.apache.org/bugzilla/show_bug.cgi?id=57935"
  [javadoc] <https://builds.apache.org/job/JMeter-trunk/ws/trunk/src/protocol/http/org/apache/jmeter/protocol/http/sampler/MeasuringConnectionManager.java>:73:
warning - Tag @see:illegal character: "47" in "https://bz.apache.org/bugzilla/show_bug.cgi?id=57935"
  [javadoc] <https://builds.apache.org/job/JMeter-trunk/ws/trunk/src/protocol/http/org/apache/jmeter/protocol/http/sampler/MeasuringConnectionManager.java>:73:
warning - Tag @see:illegal character: "63" in "https://bz.apache.org/bugzilla/show_bug.cgi?id=57935"
  [javadoc] <https://builds.apache.org/job/JMeter-trunk/ws/trunk/src/protocol/http/org/apache/jmeter/protocol/http/sampler/MeasuringConnectionManager.java>:73:
warning - Tag @see:illegal character: "61" in "https://bz.apache.org/bugzilla/show_bug.cgi?id=57935"
  [javadoc] <https://builds.apache.org/job/JMeter-trunk/ws/trunk/src/protocol/http/org/apache/jmeter/protocol/http/sampler/MeasuringConnectionManager.java>:73:
warning - Tag @see: reference not found: https://bz.apache.org/bugzilla/show_bug.cgi?id=57935
  [javadoc] Building index for all the packages and classes...
  [javadoc] Building index for all classes...
  [javadoc] Generating <https://builds.apache.org/job/JMeter-trunk/ws/trunk/docs/api/help-doc.html...>
  [javadoc] 18 warnings

docs-site:
     [xslt] Transforming into <https://builds.apache.org/job/JMeter-trunk/ws/trunk/docs>
     [xslt] Processing <https://builds.apache.org/job/JMeter-trunk/ws/trunk/xdocs/building.xml>
to <https://builds.apache.org/job/JMeter-trunk/ws/trunk/docs/building.html>
     [xslt] Loading stylesheet <https://builds.apache.org/job/JMeter-trunk/ws/trunk/xdocs/stylesheets/website-style.xsl>
     [xslt] Processing <https://builds.apache.org/job/JMeter-trunk/ws/trunk/xdocs/changes.xml>
to <https://builds.apache.org/job/JMeter-trunk/ws/trunk/docs/changes.html>
     [xslt] Processing <https://builds.apache.org/job/JMeter-trunk/ws/trunk/xdocs/changes_history.xml>
to <https://builds.apache.org/job/JMeter-trunk/ws/trunk/docs/changes_history.html>
     [xslt] Processing <https://builds.apache.org/job/JMeter-trunk/ws/trunk/xdocs/devguide-dashboard.xml>
to <https://builds.apache.org/job/JMeter-trunk/ws/trunk/docs/devguide-dashboard.html>
     [xslt] Processing <https://builds.apache.org/job/JMeter-trunk/ws/trunk/xdocs/download_jmeter.xml>
to <https://builds.apache.org/job/JMeter-trunk/ws/trunk/docs/download_jmeter.html>
     [xslt] Processing <https://builds.apache.org/job/JMeter-trunk/ws/trunk/xdocs/index.xml>
to <https://builds.apache.org/job/JMeter-trunk/ws/trunk/docs/index.html>
     [xslt] Processing <https://builds.apache.org/job/JMeter-trunk/ws/trunk/xdocs/issues.xml>
to <https://builds.apache.org/job/JMeter-trunk/ws/trunk/docs/issues.html>
     [xslt] Processing <https://builds.apache.org/job/JMeter-trunk/ws/trunk/xdocs/jmeter_irc.xml>
to <https://builds.apache.org/job/JMeter-trunk/ws/trunk/docs/jmeter_irc.html>
     [xslt] Processing <https://builds.apache.org/job/JMeter-trunk/ws/trunk/xdocs/mail.xml>
to <https://builds.apache.org/job/JMeter-trunk/ws/trunk/docs/mail.html>
     [xslt] Processing <https://builds.apache.org/job/JMeter-trunk/ws/trunk/xdocs/mail2.xml>
to <https://builds.apache.org/job/JMeter-trunk/ws/trunk/docs/mail2.html>
     [xslt] Processing <https://builds.apache.org/job/JMeter-trunk/ws/trunk/xdocs/nightly.xml>
to <https://builds.apache.org/job/JMeter-trunk/ws/trunk/docs/nightly.html>
     [xslt] : Error! The element type "ul" must be terminated by the matching end-tag "</ul>".
     [xslt] : Error! com.sun.org.apache.xml.internal.utils.WrappedRuntimeException: The element
type "ul" must be terminated by the matching end-tag "</ul>".
     [xslt] Failed to process null

BUILD FAILED
<https://builds.apache.org/job/JMeter-trunk/ws/trunk/build.xml>:2274: javax.xml.transform.TransformerException:
javax.xml.transform.TransformerException: com.sun.org.apache.xml.internal.utils.WrappedRuntimeException:
The element type "ul" must be terminated by the matching end-tag "</ul>".
	at com.sun.org.apache.xalan.internal.xsltc.trax.TransformerImpl.transform(TransformerImpl.java:758)
	at com.sun.org.apache.xalan.internal.xsltc.trax.TransformerImpl.transform(TransformerImpl.java:359)
	at org.apache.tools.ant.taskdefs.optional.TraXLiaison.transform(TraXLiaison.java:195)
	at org.apache.tools.ant.taskdefs.XSLTProcess.process(XSLTProcess.java:842)
	at org.apache.tools.ant.taskdefs.XSLTProcess.execute(XSLTProcess.java:432)
	at org.apache.tools.ant.UnknownElement.execute(UnknownElement.java:292)
	at sun.reflect.GeneratedMethodAccessor5.invoke(Unknown Source)
	at sun.reflect.DelegatingMethodAccessorImpl.invoke(DelegatingMethodAccessorImpl.java:43)
	at java.lang.reflect.Method.invoke(Method.java:606)
	at org.apache.tools.ant.dispatch.DispatchUtils.execute(DispatchUtils.java:106)
	at org.apache.tools.ant.Task.perform(Task.java:348)
	at org.apache.tools.ant.Target.execute(Target.java:435)
	at org.apache.tools.ant.Target.performTasks(Target.java:456)
	at org.apache.tools.ant.Project.executeSortedTargets(Project.java:1393)
	at org.apache.tools.ant.Project.executeTarget(Project.java:1364)
	at org.apache.tools.ant.helper.DefaultExecutor.executeTargets(DefaultExecutor.java:41)
	at org.apache.tools.ant.Project.executeTargets(Project.java:1248)
	at org.apache.tools.ant.Main.runBuild(Main.java:851)
	at org.apache.tools.ant.Main.startAnt(Main.java:235)
	at org.apache.tools.ant.launch.Launcher.run(Launcher.java:280)
	at org.apache.tools.ant.launch.Launcher.main(Launcher.java:109)
Caused by: javax.xml.transform.TransformerException: com.sun.org.apache.xml.internal.utils.WrappedRuntimeException:
The element type "ul" must be terminated by the matching end-tag "</ul>".
	at com.sun.org.apache.xalan.internal.xsltc.trax.TransformerImpl.getDOM(TransformerImpl.java:587)
	at com.sun.org.apache.xalan.internal.xsltc.trax.TransformerImpl.transform(TransformerImpl.java:748)
	... 20 more
Caused by: com.sun.org.apache.xml.internal.utils.WrappedRuntimeException: The element type
"ul" must be terminated by the matching end-tag "</ul>".
	at com.sun.org.apache.xalan.internal.xsltc.dom.XSLTCDTMManager.getDTM(XSLTCDTMManager.java:464)
	at com.sun.org.apache.xalan.internal.xsltc.dom.XSLTCDTMManager.getDTM(XSLTCDTMManager.java:252)
	at com.sun.org.apache.xalan.internal.xsltc.trax.TransformerImpl.getDOM(TransformerImpl.java:565)
	... 21 more
---------
javax.xml.transform.TransformerException: com.sun.org.apache.xml.internal.utils.WrappedRuntimeException:
The element type "ul" must be terminated by the matching end-tag "</ul>".
	at com.sun.org.apache.xalan.internal.xsltc.trax.TransformerImpl.getDOM(TransformerImpl.java:587)
	at com.sun.org.apache.xalan.internal.xsltc.trax.TransformerImpl.transform(TransformerImpl.java:748)
	at com.sun.org.apache.xalan.internal.xsltc.trax.TransformerImpl.transform(TransformerImpl.java:359)
	at org.apache.tools.ant.taskdefs.optional.TraXLiaison.transform(TraXLiaison.java:195)
	at org.apache.tools.ant.taskdefs.XSLTProcess.process(XSLTProcess.java:842)
	at org.apache.tools.ant.taskdefs.XSLTProcess.execute(XSLTProcess.java:432)
	at org.apache.tools.ant.UnknownElement.execute(UnknownElement.java:292)
	at sun.reflect.GeneratedMethodAccessor5.invoke(Unknown Source)
	at sun.reflect.DelegatingMethodAccessorImpl.invoke(DelegatingMethodAccessorImpl.java:43)
	at java.lang.reflect.Method.invoke(Method.java:606)
	at org.apache.tools.ant.dispatch.DispatchUtils.execute(DispatchUtils.java:106)
	at org.apache.tools.ant.Task.perform(Task.java:348)
	at org.apache.tools.ant.Target.execute(Target.java:435)
	at org.apache.tools.ant.Target.performTasks(Target.java:456)
	at org.apache.tools.ant.Project.executeSortedTargets(Project.java:1393)
	at org.apache.tools.ant.Project.executeTarget(Project.java:1364)
	at org.apache.tools.ant.helper.DefaultExecutor.executeTargets(DefaultExecutor.java:41)
	at org.apache.tools.ant.Project.executeTargets(Project.java:1248)
	at org.apache.tools.ant.Main.runBuild(Main.java:851)
	at org.apache.tools.ant.Main.startAnt(Main.java:235)
	at org.apache.tools.ant.launch.Launcher.run(Launcher.java:280)
	at org.apache.tools.ant.launch.Launcher.main(Launcher.java:109)
Caused by: com.sun.org.apache.xml.internal.utils.WrappedRuntimeException: The element type
"ul" must be terminated by the matching end-tag "</ul>".
	at com.sun.org.apache.xalan.internal.xsltc.dom.XSLTCDTMManager.getDTM(XSLTCDTMManager.java:464)
	at com.sun.org.apache.xalan.internal.xsltc.dom.XSLTCDTMManager.getDTM(XSLTCDTMManager.java:252)
	at com.sun.org.apache.xalan.internal.xsltc.trax.TransformerImpl.getDOM(TransformerImpl.java:565)
	... 21 more
---------
com.sun.org.apache.xml.internal.utils.WrappedRuntimeException: The element type "ul" must
be terminated by the matching end-tag "</ul>".
	at com.sun.org.apache.xalan.internal.xsltc.dom.XSLTCDTMManager.getDTM(XSLTCDTMManager.java:464)
	at com.sun.org.apache.xalan.internal.xsltc.dom.XSLTCDTMManager.getDTM(XSLTCDTMManager.java:252)
	at com.sun.org.apache.xalan.internal.xsltc.trax.TransformerImpl.getDOM(TransformerImpl.java:565)
	at com.sun.org.apache.xalan.internal.xsltc.trax.TransformerImpl.transform(TransformerImpl.java:748)
	at com.sun.org.apache.xalan.internal.xsltc.trax.TransformerImpl.transform(TransformerImpl.java:359)
	at org.apache.tools.ant.taskdefs.optional.TraXLiaison.transform(TraXLiaison.java:195)
	at org.apache.tools.ant.taskdefs.XSLTProcess.process(XSLTProcess.java:842)
	at org.apache.tools.ant.taskdefs.XSLTProcess.execute(XSLTProcess.java:432)
	at org.apache.tools.ant.UnknownElement.execute(UnknownElement.java:292)
	at sun.reflect.GeneratedMethodAccessor5.invoke(Unknown Source)
	at sun.reflect.DelegatingMethodAccessorImpl.invoke(DelegatingMethodAccessorImpl.java:43)
	at java.lang.reflect.Method.invoke(Method.java:606)
	at org.apache.tools.ant.dispatch.DispatchUtils.execute(DispatchUtils.java:106)
	at org.apache.tools.ant.Task.perform(Task.java:348)
	at org.apache.tools.ant.Target.execute(Target.java:435)
	at org.apache.tools.ant.Target.performTasks(Target.java:456)
	at org.apache.tools.ant.Project.executeSortedTargets(Project.java:1393)
	at org.apache.tools.ant.Project.executeTarget(Project.java:1364)
	at org.apache.tools.ant.helper.DefaultExecutor.executeTargets(DefaultExecutor.java:41)
	at org.apache.tools.ant.Project.executeTargets(Project.java:1248)
	at org.apache.tools.ant.Main.runBuild(Main.java:851)
	at org.apache.tools.ant.Main.startAnt(Main.java:235)
	at org.apache.tools.ant.launch.Launcher.run(Launcher.java:280)
	at org.apache.tools.ant.launch.Launcher.main(Launcher.java:109)
---------
org.xml.sax.SAXParseException; systemId: <https://builds.apache.org/job/JMeter-trunk/ws/trunk/xdocs/nightly.xml;>
lineNumber: 60; columnNumber: 3; The element type "ul" must be terminated by the matching
end-tag "</ul>".
	at com.sun.org.apache.xerces.internal.util.ErrorHandlerWrapper.createSAXParseException(ErrorHandlerWrapper.java:198)
	at com.sun.org.apache.xerces.internal.util.ErrorHandlerWrapper.fatalError(ErrorHandlerWrapper.java:177)
	at com.sun.org.apache.xerces.internal.impl.XMLErrorReporter.reportError(XMLErrorReporter.java:441)
	at com.sun.org.apache.xerces.internal.impl.XMLErrorReporter.reportError(XMLErrorReporter.java:368)
	at com.sun.org.apache.xerces.internal.impl.XMLScanner.reportFatalError(XMLScanner.java:1436)
	at com.sun.org.apache.xerces.internal.impl.XMLDocumentFragmentScannerImpl.scanEndElement(XMLDocumentFragmentScannerImpl.java:1749)
	at com.sun.org.apache.xerces.internal.impl.XMLDocumentFragmentScannerImpl$FragmentContentDriver.next(XMLDocumentFragmentScannerImpl.java:2973)
	at com.sun.org.apache.xerces.internal.impl.XMLDocumentScannerImpl.next(XMLDocumentScannerImpl.java:606)
	at com.sun.org.apache.xerces.internal.impl.XMLNSDocumentScannerImpl.next(XMLNSDocumentScannerImpl.java:117)
	at com.sun.org.apache.xerces.internal.impl.XMLDocumentFragmentScannerImpl.scanDocument(XMLDocumentFragmentScannerImpl.java:510)
	at com.sun.org.apache.xerces.internal.parsers.XML11Configuration.parse(XML11Configuration.java:848)
	at com.sun.org.apache.xerces.internal.parsers.XML11Configuration.parse(XML11Configuration.java:777)
	at com.sun.org.apache.xerces.internal.parsers.XMLParser.parse(XMLParser.java:141)
	at com.sun.org.apache.xerces.internal.parsers.AbstractSAXParser.parse(AbstractSAXParser.java:1213)
	at com.sun.org.apache.xerces.internal.jaxp.SAXParserImpl$JAXPSAXParser.parse(SAXParserImpl.java:648)
	at com.sun.org.apache.xalan.internal.xsltc.dom.XSLTCDTMManager.getDTM(XSLTCDTMManager.java:458)
	at com.sun.org.apache.xalan.internal.xsltc.dom.XSLTCDTMManager.getDTM(XSLTCDTMManager.java:252)
	at com.sun.org.apache.xalan.internal.xsltc.trax.TransformerImpl.getDOM(TransformerImpl.java:565)
	at com.sun.org.apache.xalan.internal.xsltc.trax.TransformerImpl.transform(TransformerImpl.java:748)
	at com.sun.org.apache.xalan.internal.xsltc.trax.TransformerImpl.transform(TransformerImpl.java:359)
	at org.apache.tools.ant.taskdefs.optional.TraXLiaison.transform(TraXLiaison.java:195)
	at org.apache.tools.ant.taskdefs.XSLTProcess.process(XSLTProcess.java:842)
	at org.apache.tools.ant.taskdefs.XSLTProcess.execute(XSLTProcess.java:432)
	at org.apache.tools.ant.UnknownElement.execute(UnknownElement.java:292)
	at sun.reflect.GeneratedMethodAccessor5.invoke(Unknown Source)
	at sun.reflect.DelegatingMethodAccessorImpl.invoke(DelegatingMethodAccessorImpl.java:43)
	at java.lang.reflect.Method.invoke(Method.java:606)
	at org.apache.tools.ant.dispatch.DispatchUtils.execute(DispatchUtils.java:106)
	at org.apache.tools.ant.Task.perform(Task.java:348)
	at org.apache.tools.ant.Target.execute(Target.java:435)
	at org.apache.tools.ant.Target.performTasks(Target.java:456)
	at org.apache.tools.ant.Project.executeSortedTargets(Project.java:1393)
	at org.apache.tools.ant.Project.executeTarget(Project.java:1364)
	at org.apache.tools.ant.helper.DefaultExecutor.executeTargets(DefaultExecutor.java:41)
	at org.apache.tools.ant.Project.executeTargets(Project.java:1248)
	at org.apache.tools.ant.Main.runBuild(Main.java:851)
	at org.apache.tools.ant.Main.startAnt(Main.java:235)
	at org.apache.tools.ant.launch.Launcher.run(Launcher.java:280)
	at org.apache.tools.ant.launch.Launcher.main(Launcher.java:109)
---------
com.sun.org.apache.xml.internal.utils.WrappedRuntimeException: The element type "ul" must
be terminated by the matching end-tag "</ul>".
	at com.sun.org.apache.xalan.internal.xsltc.dom.XSLTCDTMManager.getDTM(XSLTCDTMManager.java:464)
	at com.sun.org.apache.xalan.internal.xsltc.dom.XSLTCDTMManager.getDTM(XSLTCDTMManager.java:252)
	at com.sun.org.apache.xalan.internal.xsltc.trax.TransformerImpl.getDOM(TransformerImpl.java:565)
	at com.sun.org.apache.xalan.internal.xsltc.trax.TransformerImpl.transform(TransformerImpl.java:748)
	at com.sun.org.apache.xalan.internal.xsltc.trax.TransformerImpl.transform(TransformerImpl.java:359)
	at org.apache.tools.ant.taskdefs.optional.TraXLiaison.transform(TraXLiaison.java:195)
	at org.apache.tools.ant.taskdefs.XSLTProcess.process(XSLTProcess.java:842)
	at org.apache.tools.ant.taskdefs.XSLTProcess.execute(XSLTProcess.java:432)
	at org.apache.tools.ant.UnknownElement.execute(UnknownElement.java:292)
	at sun.reflect.GeneratedMethodAccessor5.invoke(Unknown Source)
	at sun.reflect.DelegatingMethodAccessorImpl.invoke(DelegatingMethodAccessorImpl.java:43)
	at java.lang.reflect.Method.invoke(Method.java:606)
	at org.apache.tools.ant.dispatch.DispatchUtils.execute(DispatchUtils.java:106)
	at org.apache.tools.ant.Task.perform(Task.java:348)
	at org.apache.tools.ant.Target.execute(Target.java:435)
	at org.apache.tools.ant.Target.performTasks(Target.java:456)
	at org.apache.tools.ant.Project.executeSortedTargets(Project.java:1393)
	at org.apache.tools.ant.Project.executeTarget(Project.java:1364)
	at org.apache.tools.ant.helper.DefaultExecutor.executeTargets(DefaultExecutor.java:41)
	at org.apache.tools.ant.Project.executeTargets(Project.java:1248)
	at org.apache.tools.ant.Main.runBuild(Main.java:851)
	at org.apache.tools.ant.Main.startAnt(Main.java:235)
	at org.apache.tools.ant.launch.Launcher.run(Launcher.java:280)
	at org.apache.tools.ant.launch.Launcher.main(Launcher.java:109)
---------
org.xml.sax.SAXParseException; systemId: <https://builds.apache.org/job/JMeter-trunk/ws/trunk/xdocs/nightly.xml;>
lineNumber: 60; columnNumber: 3; The element type "ul" must be terminated by the matching
end-tag "</ul>".
	at com.sun.org.apache.xerces.internal.util.ErrorHandlerWrapper.createSAXParseException(ErrorHandlerWrapper.java:198)
	at com.sun.org.apache.xerces.internal.util.ErrorHandlerWrapper.fatalError(ErrorHandlerWrapper.java:177)
	at com.sun.org.apache.xerces.internal.impl.XMLErrorReporter.reportError(XMLErrorReporter.java:441)
	at com.sun.org.apache.xerces.internal.impl.XMLErrorReporter.reportError(XMLErrorReporter.java:368)
	at com.sun.org.apache.xerces.internal.impl.XMLScanner.reportFatalError(XMLScanner.java:1436)
	at com.sun.org.apache.xerces.internal.impl.XMLDocumentFragmentScannerImpl.scanEndElement(XMLDocumentFragmentScannerImpl.java:1749)
	at com.sun.org.apache.xerces.internal.impl.XMLDocumentFragmentScannerImpl$FragmentContentDriver.next(XMLDocumentFragmentScannerImpl.java:2973)
	at com.sun.org.apache.xerces.internal.impl.XMLDocumentScannerImpl.next(XMLDocumentScannerImpl.java:606)
	at com.sun.org.apache.xerces.internal.impl.XMLNSDocumentScannerImpl.next(XMLNSDocumentScannerImpl.java:117)
	at com.sun.org.apache.xerces.internal.impl.XMLDocumentFragmentScannerImpl.scanDocument(XMLDocumentFragmentScannerImpl.java:510)
	at com.sun.org.apache.xerces.internal.parsers.XML11Configuration.parse(XML11Configuration.java:848)
	at com.sun.org.apache.xerces.internal.parsers.XML11Configuration.parse(XML11Configuration.java:777)
	at com.sun.org.apache.xerces.internal.parsers.XMLParser.parse(XMLParser.java:141)
	at com.sun.org.apache.xerces.internal.parsers.AbstractSAXParser.parse(AbstractSAXParser.java:1213)
	at com.sun.org.apache.xerces.internal.jaxp.SAXParserImpl$JAXPSAXParser.parse(SAXParserImpl.java:648)
	at com.sun.org.apache.xalan.internal.xsltc.dom.XSLTCDTMManager.getDTM(XSLTCDTMManager.java:458)
	at com.sun.org.apache.xalan.internal.xsltc.dom.XSLTCDTMManager.getDTM(XSLTCDTMManager.java:252)
	at com.sun.org.apache.xalan.internal.xsltc.trax.TransformerImpl.getDOM(TransformerImpl.java:565)
	at com.sun.org.apache.xalan.internal.xsltc.trax.TransformerImpl.transform(TransformerImpl.java:748)
	at com.sun.org.apache.xalan.internal.xsltc.trax.TransformerImpl.transform(TransformerImpl.java:359)
	at org.apache.tools.ant.taskdefs.optional.TraXLiaison.transform(TraXLiaison.java:195)
	at org.apache.tools.ant.taskdefs.XSLTProcess.process(XSLTProcess.java:842)
	at org.apache.tools.ant.taskdefs.XSLTProcess.execute(XSLTProcess.java:432)
	at org.apache.tools.ant.UnknownElement.execute(UnknownElement.java:292)
	at sun.reflect.GeneratedMethodAccessor5.invoke(Unknown Source)
	at sun.reflect.DelegatingMethodAccessorImpl.invoke(DelegatingMethodAccessorImpl.java:43)
	at java.lang.reflect.Method.invoke(Method.java:606)
	at org.apache.tools.ant.dispatch.DispatchUtils.execute(DispatchUtils.java:106)
	at org.apache.tools.ant.Task.perform(Task.java:348)
	at org.apache.tools.ant.Target.execute(Target.java:435)
	at org.apache.tools.ant.Target.performTasks(Target.java:456)
	at org.apache.tools.ant.Project.executeSortedTargets(Project.java:1393)
	at org.apache.tools.ant.Project.executeTarget(Project.java:1364)
	at org.apache.tools.ant.helper.DefaultExecutor.executeTargets(DefaultExecutor.java:41)
	at org.apache.tools.ant.Project.executeTargets(Project.java:1248)
	at org.apache.tools.ant.Main.runBuild(Main.java:851)
	at org.apache.tools.ant.Main.startAnt(Main.java:235)
	at org.apache.tools.ant.launch.Launcher.run(Launcher.java:280)
	at org.apache.tools.ant.launch.Launcher.main(Launcher.java:109)

Total time: 2 minutes 28 seconds
Build step 'Invoke Ant' marked build as failure
[locks-and-latches] Releasing all the locks
[locks-and-latches] All the locks released
Archiving artifacts

Mime
View raw message