jmeter-dev mailing list archives

Site index · List index
Message view « Date » · « Thread »
Top « Date » · « Thread »
From Apache Jenkins Server <jenk...@builds.apache.org>
Subject Build failed in Jenkins: JMeter-trunk #5795
Date Sun, 05 Feb 2017 14:01:07 GMT
See <https://builds.apache.org/job/JMeter-trunk/5795/changes>

Changes:

[pmouawad] Bug 60589 - Migrate LogKit to SLF4J - Drop avalon, logkit and excalibur with backward
compatibility for 3rd party modules
Remove mention of commons-logging in docs
Bugzilla Id: 60589

[pmouawad] Bug 60589 - Migrate LogKit to SLF4J - Drop avalon, logkit and excalibur with backward
compatibility for 3rd party modules
Part 8 of PR 254
This closes #254
Contributed by Woonsan Ko

Bugzilla Id: 60589

[pmouawad] Bug 60589 - Migrate LogKit to SLF4J - Drop avalon, logkit and excalibur with backward
compatibility for 3rd party modules
Part 7 of PR #254
Contributed by Woonsan Ko

[pmouawad] Bug 60589 - Migrate LogKit to SLF4J - Drop avalon, logkit and excalibur with backward
compatibility for 3rd party modules
Part 6 of PR #254
Contributed by Woonsan Ko

Bugzilla Id: 60589

[pmouawad] Bug 60589 - Migrate LogKit to SLF4J - Drop avalon, logkit and excalibur with backward
compatibility for 3rd party modules
Part 5 of PR #254
Contributed by Woonsan Ko

Bugzilla Id: 60589

[pmouawad] Bug 60589 - Migrate LogKit to SLF4J - Drop avalon, logkit and excalibur with backward
compatibility for 3rd party modules
Part 4 of PR #254
Contributed by Woonsan Ko

Bugzilla Id: 60589

[pmouawad] Bug 60589 - Migrate LogKit to SLF4J - Drop avalon, logkit and excalibur with backward
compatibility for 3rd party modules
Part 3 of PR #254
Contributed by Woonsan Ko

Bugzilla Id: 60589

[pmouawad] Bug 60589 - Migrate LogKit to SLF4J - Drop avalon, logkit and excalibur with backward
compatibility for 3rd party modules
Part 2 of PR #254
Contributed by Woonsan Ko

Bugzilla Id: 60589

[pmouawad] Bug 60589 - Migrate LogKit to SLF4J - Drop avalon, logkit and excalibur with backward
compatibility for 3rd party modules
Part 1 of PR #254
Contributed by Woonsan Ko

Bugzilla Id: 60589

------------------------------------------
[...truncated 1773 lines...]
     [java] 	at org.apache.jmeter.engine.DistributedRunner.init(DistributedRunner.java:93)
[ApacheJMeter_core.jar:?]
     [java] 	at org.apache.jmeter.engine.DistributedRunnerTest.initRunner(DistributedRunnerTest.java:92)
[test/:?]
     [java] 	at org.apache.jmeter.engine.DistributedRunnerTest.testFailure2(DistributedRunnerTest.java:107)
[test/:?]
     [java] 	at sun.reflect.NativeMethodAccessorImpl.invoke0(Native Method) ~[?:1.8.0_102]
     [java] 	at sun.reflect.NativeMethodAccessorImpl.invoke(NativeMethodAccessorImpl.java:62)
~[?:1.8.0_102]
     [java] 	at sun.reflect.DelegatingMethodAccessorImpl.invoke(DelegatingMethodAccessorImpl.java:43)
~[?:1.8.0_102]
     [java] 	at java.lang.reflect.Method.invoke(Method.java:498) ~[?:1.8.0_102]
     [java] 	at org.junit.runners.model.FrameworkMethod$1.runReflectiveCall(FrameworkMethod.java:50)
[junit-4.12.jar:4.12]
     [java] 	at org.junit.internal.runners.model.ReflectiveCallable.run(ReflectiveCallable.java:12)
[junit-4.12.jar:4.12]
     [java] 	at org.junit.runners.model.FrameworkMethod.invokeExplosively(FrameworkMethod.java:47)
[junit-4.12.jar:4.12]
     [java] 	at org.junit.internal.runners.statements.InvokeMethod.evaluate(InvokeMethod.java:17)
[junit-4.12.jar:4.12]
     [java] 	at org.junit.runners.ParentRunner.runLeaf(ParentRunner.java:325) [junit-4.12.jar:4.12]
     [java] 	at org.junit.runners.BlockJUnit4ClassRunner.runChild(BlockJUnit4ClassRunner.java:78)
[junit-4.12.jar:4.12]
     [java] 	at org.junit.runners.BlockJUnit4ClassRunner.runChild(BlockJUnit4ClassRunner.java:57)
[junit-4.12.jar:4.12]
     [java] 	at org.junit.runners.ParentRunner$3.run(ParentRunner.java:290) [junit-4.12.jar:4.12]
     [java] 	at org.junit.runners.ParentRunner$1.schedule(ParentRunner.java:71) [junit-4.12.jar:4.12]
     [java] 	at org.junit.runners.ParentRunner.runChildren(ParentRunner.java:288) [junit-4.12.jar:4.12]
     [java] 	at org.junit.runners.ParentRunner.access$000(ParentRunner.java:58) [junit-4.12.jar:4.12]
     [java] 	at org.junit.runners.ParentRunner$2.evaluate(ParentRunner.java:268) [junit-4.12.jar:4.12]
     [java] 	at org.junit.runners.ParentRunner.run(ParentRunner.java:363) [junit-4.12.jar:4.12]
     [java] 	at org.junit.runners.Suite.runChild(Suite.java:128) [junit-4.12.jar:4.12]
     [java] 	at org.junit.runners.Suite.runChild(Suite.java:27) [junit-4.12.jar:4.12]
     [java] 	at org.junit.runners.ParentRunner$3.run(ParentRunner.java:290) [junit-4.12.jar:4.12]
     [java] 	at org.junit.runners.ParentRunner$1.schedule(ParentRunner.java:71) [junit-4.12.jar:4.12]
     [java] 	at org.junit.runners.ParentRunner.runChildren(ParentRunner.java:288) [junit-4.12.jar:4.12]
     [java] 	at org.junit.runners.ParentRunner.access$000(ParentRunner.java:58) [junit-4.12.jar:4.12]
     [java] 	at org.junit.runners.ParentRunner$2.evaluate(ParentRunner.java:268) [junit-4.12.jar:4.12]
     [java] 	at org.junit.runners.ParentRunner.run(ParentRunner.java:363) [junit-4.12.jar:4.12]
     [java] 	at org.junit.runner.JUnitCore.run(JUnitCore.java:137) [junit-4.12.jar:4.12]
     [java] 	at org.junit.runner.JUnitCore.run(JUnitCore.java:115) [junit-4.12.jar:4.12]
     [java] 	at org.apache.jorphan.test.AllTests.main(AllTests.java:222) [test/:?]
     [java] 14:00:05.929 [main] ERROR org.apache.jmeter.util.JMeterUtils - Throwing on Engine
creation to simulate failure
     [java] .14:00:05.930 [main] ERROR org.apache.jmeter.util.JMeterUtils - Could not find
resources for 'ignoreresources'
     [java] 14:00:05.931 [main] ERROR org.apache.jmeter.engine.DistributedRunner - Failed
to create engine at test1
     [java] java.lang.IllegalArgumentException: Throwing on Engine creation to simulate failure
     [java] 	at org.apache.jmeter.engine.DistributedRunnerTest$DistributedRunnerEmul.createEngine(DistributedRunnerTest.java:131)
~[test/:?]
     [java] 	at org.apache.jmeter.engine.DistributedRunner.getClientEngine(DistributedRunner.java:213)
[ApacheJMeter_core.jar:?]
     [java] 	at org.apache.jmeter.engine.DistributedRunner.init(DistributedRunner.java:93)
[ApacheJMeter_core.jar:?]
     [java] 	at org.apache.jmeter.engine.DistributedRunnerTest.initRunner(DistributedRunnerTest.java:92)
[test/:?]
     [java] 	at org.apache.jmeter.engine.DistributedRunnerTest.testFailure3(DistributedRunnerTest.java:118)
[test/:?]
     [java] 	at sun.reflect.NativeMethodAccessorImpl.invoke0(Native Method) ~[?:1.8.0_102]
     [java] 	at sun.reflect.NativeMethodAccessorImpl.invoke(NativeMethodAccessorImpl.java:62)
~[?:1.8.0_102]
     [java] 	at sun.reflect.DelegatingMethodAccessorImpl.invoke(DelegatingMethodAccessorImpl.java:43)
~[?:1.8.0_102]
     [java] 	at java.lang.reflect.Method.invoke(Method.java:498) ~[?:1.8.0_102]
     [java] 	at org.junit.runners.model.FrameworkMethod$1.runReflectiveCall(FrameworkMethod.java:50)
[junit-4.12.jar:4.12]
     [java] 	at org.junit.internal.runners.model.ReflectiveCallable.run(ReflectiveCallable.java:12)
[junit-4.12.jar:4.12]
     [java] 	at org.junit.runners.model.FrameworkMethod.invokeExplosively(FrameworkMethod.java:47)
[junit-4.12.jar:4.12]
     [java] 	at org.junit.internal.runners.statements.InvokeMethod.evaluate(InvokeMethod.java:17)
[junit-4.12.jar:4.12]
     [java] 	at org.junit.runners.ParentRunner.runLeaf(ParentRunner.java:325) [junit-4.12.jar:4.12]
     [java] 	at org.junit.runners.BlockJUnit4ClassRunner.runChild(BlockJUnit4ClassRunner.java:78)
[junit-4.12.jar:4.12]
     [java] 	at org.junit.runners.BlockJUnit4ClassRunner.runChild(BlockJUnit4ClassRunner.java:57)
[junit-4.12.jar:4.12]
     [java] 	at org.junit.runners.ParentRunner$3.run(ParentRunner.java:290) [junit-4.12.jar:4.12]
     [java] 	at org.junit.runners.ParentRunner$1.schedule(ParentRunner.java:71) [junit-4.12.jar:4.12]
     [java] 	at org.junit.runners.ParentRunner.runChildren(ParentRunner.java:288) [junit-4.12.jar:4.12]
     [java] 	at org.junit.runners.ParentRunner.access$000(ParentRunner.java:58) [junit-4.12.jar:4.12]
     [java] 	at org.junit.runners.ParentRunner$2.evaluate(ParentRunner.java:268) [junit-4.12.jar:4.12]
     [java] 	at org.junit.runners.ParentRunner.run(ParentRunner.java:363) [junit-4.12.jar:4.12]
     [java] 	at org.junit.runners.Suite.runChild(Suite.java:128) [junit-4.12.jar:4.12]
     [java] 	at org.junit.runners.Suite.runChild(Suite.java:27) [junit-4.12.jar:4.12]
     [java] 	at org.junit.runners.ParentRunner$3.run(ParentRunner.java:290) [junit-4.12.jar:4.12]
     [java] 	at org.junit.runners.ParentRunner$1.schedule(ParentRunner.java:71) [junit-4.12.jar:4.12]
     [java] 	at org.junit.runners.ParentRunner.runChildren(ParentRunner.java:288) [junit-4.12.jar:4.12]
     [java] 	at org.junit.runners.ParentRunner.access$000(ParentRunner.java:58) [junit-4.12.jar:4.12]
     [java] 	at org.junit.runners.ParentRunner$2.evaluate(ParentRunner.java:268) [junit-4.12.jar:4.12]
     [java] 	at org.junit.runners.ParentRunner.run(ParentRunner.java:363) [junit-4.12.jar:4.12]
     [java] 	at org.junit.runner.JUnitCore.run(JUnitCore.java:137) [junit-4.12.jar:4.12]
     [java] 	at org.junit.runner.JUnitCore.run(JUnitCore.java:115) [junit-4.12.jar:4.12]
     [java] 	at org.apache.jorphan.test.AllTests.main(AllTests.java:222) [test/:?]
     [java] 14:00:05.932 [main] ERROR org.apache.jmeter.util.JMeterUtils - Throwing on Engine
creation to simulate failure
     [java] 14:00:05.932 [main] ERROR org.apache.jmeter.engine.DistributedRunner - Failed
to create engine at test2
     [java] java.lang.IllegalArgumentException: Throwing on Engine creation to simulate failure
     [java] 	at org.apache.jmeter.engine.DistributedRunnerTest$DistributedRunnerEmul.createEngine(DistributedRunnerTest.java:131)
~[test/:?]
     [java] 	at org.apache.jmeter.engine.DistributedRunner.getClientEngine(DistributedRunner.java:213)
[ApacheJMeter_core.jar:?]
     [java] 	at org.apache.jmeter.engine.DistributedRunner.init(DistributedRunner.java:93)
[ApacheJMeter_core.jar:?]
     [java] 	at org.apache.jmeter.engine.DistributedRunnerTest.initRunner(DistributedRunnerTest.java:92)
[test/:?]
     [java] 	at org.apache.jmeter.engine.DistributedRunnerTest.testFailure3(DistributedRunnerTest.java:118)
[test/:?]
     [java] 	at sun.reflect.NativeMethodAccessorImpl.invoke0(Native Method) ~[?:1.8.0_102]
     [java] 	at sun.reflect.NativeMethodAccessorImpl.invoke(NativeMethodAccessorImpl.java:62)
~[?:1.8.0_102]
     [java] 	at sun.reflect.DelegatingMethodAccessorImpl.invoke(DelegatingMethodAccessorImpl.java:43)
~[?:1.8.0_102]
     [java] 	at java.lang.reflect.Method.invoke(Method.java:498) ~[?:1.8.0_102]
     [java] 	at org.junit.runners.model.FrameworkMethod$1.runReflectiveCall(FrameworkMethod.java:50)
[junit-4.12.jar:4.12]
     [java] 	at org.junit.internal.runners.model.ReflectiveCallable.run(ReflectiveCallable.java:12)
[junit-4.12.jar:4.12]
     [java] 	at org.junit.runners.model.FrameworkMethod.invokeExplosively(FrameworkMethod.java:47)
[junit-4.12.jar:4.12]
     [java] 	at org.junit.internal.runners.statements.InvokeMethod.evaluate(InvokeMethod.java:17)
[junit-4.12.jar:4.12]
     [java] 	at org.junit.runners.ParentRunner.runLeaf(ParentRunner.java:325) [junit-4.12.jar:4.12]
     [java] 	at org.junit.runners.BlockJUnit4ClassRunner.runChild(BlockJUnit4ClassRunner.java:78)
[junit-4.12.jar:4.12]
     [java] 	at org.junit.runners.BlockJUnit4ClassRunner.runChild(BlockJUnit4ClassRunner.java:57)
[junit-4.12.jar:4.12]
     [java] 	at org.junit.runners.ParentRunner$3.run(ParentRunner.java:290) [junit-4.12.jar:4.12]
     [java] 	at org.junit.runners.ParentRunner$1.schedule(ParentRunner.java:71) [junit-4.12.jar:4.12]
     [java] 	at org.junit.runners.ParentRunner.runChildren(ParentRunner.java:288) [junit-4.12.jar:4.12]
     [java] 	at org.junit.runners.ParentRunner.access$000(ParentRunner.java:58) [junit-4.12.jar:4.12]
     [java] 	at org.junit.runners.ParentRunner$2.evaluate(ParentRunner.java:268) [junit-4.12.jar:4.12]
     [java] 	at org.junit.runners.ParentRunner.run(ParentRunner.java:363) [junit-4.12.jar:4.12]
     [java] 	at org.junit.runners.Suite.runChild(Suite.java:128) [junit-4.12.jar:4.12]
     [java] 	at org.junit.runners.Suite.runChild(Suite.java:27) [junit-4.12.jar:4.12]
     [java] 	at org.junit.runners.ParentRunner$3.run(ParentRunner.java:290) [junit-4.12.jar:4.12]
     [java] 	at org.junit.runners.ParentRunner$1.schedule(ParentRunner.java:71) [junit-4.12.jar:4.12]
     [java] 	at org.junit.runners.ParentRunner.runChildren(ParentRunner.java:288) [junit-4.12.jar:4.12]
     [java] 	at org.junit.runners.ParentRunner.access$000(ParentRunner.java:58) [junit-4.12.jar:4.12]
     [java] 	at org.junit.runners.ParentRunner$2.evaluate(ParentRunner.java:268) [junit-4.12.jar:4.12]
     [java] 	at org.junit.runners.ParentRunner.run(ParentRunner.java:363) [junit-4.12.jar:4.12]
     [java] 	at org.junit.runner.JUnitCore.run(JUnitCore.java:137) [junit-4.12.jar:4.12]
     [java] 	at org.junit.runner.JUnitCore.run(JUnitCore.java:115) [junit-4.12.jar:4.12]
     [java] 	at org.apache.jorphan.test.AllTests.main(AllTests.java:222) [test/:?]
     [java] 14:00:05.933 [main] ERROR org.apache.jmeter.util.JMeterUtils - Throwing on Engine
creation to simulate failure
     [java] .14:00:05.934 [main] ERROR org.apache.jmeter.util.JMeterUtils - Could not find
resources for 'ignoreresources'
     [java] .............................................................14:00:06.173 [main]
ERROR org.apache.jmeter.util.XPathUtil - Type=Val=false Tol=false org.xml.sax.SAXParseException;
lineNumber: 1; columnNumber: 4; XML document structures must start and end within the same
entity.
     [java] .................................................................................................14:00:06.910
[main] ERROR org.apache.jmeter.functions.XPathWrapper - XPathFileContainer is null!
     [java] 14:00:06.910 [main] ERROR org.apache.jmeter.functions.XPathWrapper - XPathFileContainer
is null!
     [java] 14:00:06.911 [main] ERROR org.apache.jmeter.functions.XPathWrapper - XPathFileContainer
is null!
     [java] ...14:00:06.919 [main] ERROR org.apache.jmeter.functions.XPathWrapper - XPathFileContainer
is null!
     [java] ............14:00:07.938 [main] ERROR org.apache.jmeter.functions.StringFromFile
- openFile() error: java.io.FileNotFoundException: xxtestfiles/SFFTest1.txt (No such file
or directory)
     [java] ...........................................................................................................................E............................................................................................................................................................................................................................................................................................................................................................................................................................................................................................................................................................................................................................................................................................................................................................................................................................................................................................................................................................................................................................................................................................................................................................................................................................................................................................................................................................................................................................................................................................................................................................................................14:00:54.593
[main] ERROR org.apache.jmeter.samplers.SampleResult - samplePause called twice
     [java] java.lang.Throwable: Invalid call sequence
     [java] 	at org.apache.jmeter.samplers.SampleResult.samplePause(SampleResult.java:1109)
[ApacheJMeter_core.jar:r1781764]
     [java] 	at org.apache.jmeter.samplers.TestSampleResult.testPause2True(TestSampleResult.java:124)
[test/:r1781764]
     [java] 	at sun.reflect.NativeMethodAccessorImpl.invoke0(Native Method) ~[?:1.8.0_102]
     [java] 	at sun.reflect.NativeMethodAccessorImpl.invoke(NativeMethodAccessorImpl.java:62)
~[?:1.8.0_102]
     [java] 	at sun.reflect.DelegatingMethodAccessorImpl.invoke(DelegatingMethodAccessorImpl.java:43)
~[?:1.8.0_102]
     [java] 	at java.lang.reflect.Method.invoke(Method.java:498) ~[?:1.8.0_102]
     [java] 	at org.junit.runners.model.FrameworkMethod$1.runReflectiveCall(FrameworkMethod.java:50)
[junit-4.12.jar:4.12]
     [java] 	at org.junit.internal.runners.model.ReflectiveCallable.run(ReflectiveCallable.java:12)
[junit-4.12.jar:4.12]
     [java] 	at org.junit.runners.model.FrameworkMethod.invokeExplosively(FrameworkMethod.java:47)
[junit-4.12.jar:4.12]
     [java] 	at org.junit.internal.runners.statements.InvokeMethod.evaluate(InvokeMethod.java:17)
[junit-4.12.jar:4.12]
     [java] 	at org.junit.runners.ParentRunner.runLeaf(ParentRunner.java:325) [junit-4.12.jar:4.12]
     [java] 	at org.junit.runners.BlockJUnit4ClassRunner.runChild(BlockJUnit4ClassRunner.java:78)
[junit-4.12.jar:4.12]
     [java] 	at org.junit.runners.BlockJUnit4ClassRunner.runChild(BlockJUnit4ClassRunner.java:57)
[junit-4.12.jar:4.12]
     [java] 	at org.junit.runners.ParentRunner$3.run(ParentRunner.java:290) [junit-4.12.jar:4.12]
     [java] 	at org.junit.runners.ParentRunner$1.schedule(ParentRunner.java:71) [junit-4.12.jar:4.12]
     [java] 	at org.junit.runners.ParentRunner.runChildren(ParentRunner.java:288) [junit-4.12.jar:4.12]
     [java] 	at org.junit.runners.ParentRunner.access$000(ParentRunner.java:58) [junit-4.12.jar:4.12]
     [java] 	at org.junit.runners.ParentRunner$2.evaluate(ParentRunner.java:268) [junit-4.12.jar:4.12]
     [java] 	at org.junit.runners.ParentRunner.run(ParentRunner.java:363) [junit-4.12.jar:4.12]
     [java] 	at org.junit.runners.Suite.runChild(Suite.java:128) [junit-4.12.jar:4.12]
     [java] 	at org.junit.runners.Suite.runChild(Suite.java:27) [junit-4.12.jar:4.12]
     [java] 	at org.junit.runners.ParentRunner$3.run(ParentRunner.java:290) [junit-4.12.jar:4.12]
     [java] 	at org.junit.runners.ParentRunner$1.schedule(ParentRunner.java:71) [junit-4.12.jar:4.12]
     [java] 	at org.junit.runners.ParentRunner.runChildren(ParentRunner.java:288) [junit-4.12.jar:4.12]
     [java] 	at org.junit.runners.ParentRunner.access$000(ParentRunner.java:58) [junit-4.12.jar:4.12]
     [java] 	at org.junit.runners.ParentRunner$2.evaluate(ParentRunner.java:268) [junit-4.12.jar:4.12]
     [java] 	at org.junit.runners.ParentRunner.run(ParentRunner.java:363) [junit-4.12.jar:4.12]
     [java] 	at org.junit.runner.JUnitCore.run(JUnitCore.java:137) [junit-4.12.jar:4.12]
     [java] 	at org.junit.runner.JUnitCore.run(JUnitCore.java:115) [junit-4.12.jar:4.12]
     [java] 	at org.apache.jorphan.test.AllTests.main(AllTests.java:222) [test/:?]
     [java] ......14:00:56.096 [main] ERROR org.apache.jmeter.samplers.SampleResult - samplePause
called twice
     [java] java.lang.Throwable: Invalid call sequence
     [java] 	at org.apache.jmeter.samplers.SampleResult.samplePause(SampleResult.java:1109)
[ApacheJMeter_core.jar:r1781764]
     [java] 	at org.apache.jmeter.samplers.TestSampleResult.testPause2False(TestSampleResult.java:135)
[test/:r1781764]
     [java] 	at sun.reflect.NativeMethodAccessorImpl.invoke0(Native Method) ~[?:1.8.0_102]
     [java] 	at sun.reflect.NativeMethodAccessorImpl.invoke(NativeMethodAccessorImpl.java:62)
~[?:1.8.0_102]
     [java] 	at sun.reflect.DelegatingMethodAccessorImpl.invoke(DelegatingMethodAccessorImpl.java:43)
~[?:1.8.0_102]
     [java] 	at java.lang.reflect.Method.invoke(Method.java:498) ~[?:1.8.0_102]
     [java] 	at org.junit.runners.model.FrameworkMethod$1.runReflectiveCall(FrameworkMethod.java:50)
[junit-4.12.jar:4.12]
     [java] 	at org.junit.internal.runners.model.ReflectiveCallable.run(ReflectiveCallable.java:12)
[junit-4.12.jar:4.12]
     [java] 	at org.junit.runners.model.FrameworkMethod.invokeExplosively(FrameworkMethod.java:47)
[junit-4.12.jar:4.12]
     [java] 	at org.junit.internal.runners.statements.InvokeMethod.evaluate(InvokeMethod.java:17)
[junit-4.12.jar:4.12]
     [java] 	at org.junit.runners.ParentRunner.runLeaf(ParentRunner.java:325) [junit-4.12.jar:4.12]
     [java] 	at org.junit.runners.BlockJUnit4ClassRunner.runChild(BlockJUnit4ClassRunner.java:78)
[junit-4.12.jar:4.12]
     [java] 	at org.junit.runners.BlockJUnit4ClassRunner.runChild(BlockJUnit4ClassRunner.java:57)
[junit-4.12.jar:4.12]
     [java] 	at org.junit.runners.ParentRunner$3.run(ParentRunner.java:290) [junit-4.12.jar:4.12]
     [java] 	at org.junit.runners.ParentRunner$1.schedule(ParentRunner.java:71) [junit-4.12.jar:4.12]
     [java] 	at org.junit.runners.ParentRunner.runChildren(ParentRunner.java:288) [junit-4.12.jar:4.12]
     [java] 	at org.junit.runners.ParentRunner.access$000(ParentRunner.java:58) [junit-4.12.jar:4.12]
     [java] 	at org.junit.runners.ParentRunner$2.evaluate(ParentRunner.java:268) [junit-4.12.jar:4.12]
     [java] 	at org.junit.runners.ParentRunner.run(ParentRunner.java:363) [junit-4.12.jar:4.12]
     [java] 	at org.junit.runners.Suite.runChild(Suite.java:128) [junit-4.12.jar:4.12]
     [java] 	at org.junit.runners.Suite.runChild(Suite.java:27) [junit-4.12.jar:4.12]
     [java] 	at org.junit.runners.ParentRunner$3.run(ParentRunner.java:290) [junit-4.12.jar:4.12]
     [java] 	at org.junit.runners.ParentRunner$1.schedule(ParentRunner.java:71) [junit-4.12.jar:4.12]
     [java] 	at org.junit.runners.ParentRunner.runChildren(ParentRunner.java:288) [junit-4.12.jar:4.12]
     [java] 	at org.junit.runners.ParentRunner.access$000(ParentRunner.java:58) [junit-4.12.jar:4.12]
     [java] 	at org.junit.runners.ParentRunner$2.evaluate(ParentRunner.java:268) [junit-4.12.jar:4.12]
     [java] 	at org.junit.runners.ParentRunner.run(ParentRunner.java:363) [junit-4.12.jar:4.12]
     [java] 	at org.junit.runner.JUnitCore.run(JUnitCore.java:137) [junit-4.12.jar:4.12]
     [java] 	at org.junit.runner.JUnitCore.run(JUnitCore.java:115) [junit-4.12.jar:4.12]
     [java] 	at org.apache.jorphan.test.AllTests.main(AllTests.java:222) [test/:?]
     [java] ...E.............................................................................................................................................................................................................................................................................................................................................................................................................................................................................................................................................................................................................................................................................................................................
     [java] Time: 65.588
     [java] There were 2 failures:
     [java] 1) org.apache.jmeter.gui.logging.TestGuiLogEventAppender
     [java] java.lang.NullPointerException
     [java] 	at org.apache.jmeter.gui.logging.TestGuiLogEventAppender.beforeClass(TestGuiLogEventAppender.java:77)
     [java] 	at sun.reflect.NativeMethodAccessorImpl.invoke0(Native Method)
     [java] 	at sun.reflect.NativeMethodAccessorImpl.invoke(NativeMethodAccessorImpl.java:62)
     [java] 	at sun.reflect.DelegatingMethodAccessorImpl.invoke(DelegatingMethodAccessorImpl.java:43)
     [java] 	at java.lang.reflect.Method.invoke(Method.java:498)
     [java] 	at org.junit.runners.model.FrameworkMethod$1.runReflectiveCall(FrameworkMethod.java:50)
     [java] 	at org.junit.internal.runners.model.ReflectiveCallable.run(ReflectiveCallable.java:12)
     [java] 	at org.junit.runners.model.FrameworkMethod.invokeExplosively(FrameworkMethod.java:47)
     [java] 	at org.junit.internal.runners.statements.RunBefores.evaluate(RunBefores.java:24)
     [java] 	at org.junit.runners.ParentRunner.run(ParentRunner.java:363)
     [java] 	at org.junit.runners.Suite.runChild(Suite.java:128)
     [java] 	at org.junit.runners.Suite.runChild(Suite.java:27)
     [java] 	at org.junit.runners.ParentRunner$3.run(ParentRunner.java:290)
     [java] 	at org.junit.runners.ParentRunner$1.schedule(ParentRunner.java:71)
     [java] 	at org.junit.runners.ParentRunner.runChildren(ParentRunner.java:288)
     [java] 	at org.junit.runners.ParentRunner.access$000(ParentRunner.java:58)
     [java] 	at org.junit.runners.ParentRunner$2.evaluate(ParentRunner.java:268)
     [java] 	at org.junit.runners.ParentRunner.run(ParentRunner.java:363)
     [java] 	at org.junit.runner.JUnitCore.run(JUnitCore.java:137)
     [java] 	at org.junit.runner.JUnitCore.run(JUnitCore.java:115)
     [java] 	at org.apache.jorphan.test.AllTests.main(AllTests.java:222)
     [java] 2) testSubResultsTrue(org.apache.jmeter.samplers.TestSampleResult)
     [java] java.lang.AssertionError: ParentElapsed: 304 -  sum(samples): 300 = 4 not in [0,3];
nanotime=true
     [java] 	at org.junit.Assert.fail(Assert.java:88)
     [java] 	at org.apache.jmeter.samplers.TestSampleResult.testSubResults(TestSampleResult.java:285)
     [java] 	at org.apache.jmeter.samplers.TestSampleResult.testSubResults(TestSampleResult.java:200)
     [java] 	at org.apache.jmeter.samplers.TestSampleResult.testSubResultsTrue(TestSampleResult.java:153)
     [java] 	at sun.reflect.NativeMethodAccessorImpl.invoke0(Native Method)
     [java] 	at sun.reflect.NativeMethodAccessorImpl.invoke(NativeMethodAccessorImpl.java:62)
     [java] 	at sun.reflect.DelegatingMethodAccessorImpl.invoke(DelegatingMethodAccessorImpl.java:43)
     [java] 	at java.lang.reflect.Method.invoke(Method.java:498)
     [java] 	at org.junit.runners.model.FrameworkMethod$1.runReflectiveCall(FrameworkMethod.java:50)
     [java] 	at org.junit.internal.runners.model.ReflectiveCallable.run(ReflectiveCallable.java:12)
     [java] 	at org.junit.runners.model.FrameworkMethod.invokeExplosively(FrameworkMethod.java:47)
     [java] 	at org.junit.internal.runners.statements.InvokeMethod.evaluate(InvokeMethod.java:17)
     [java] 	at org.junit.runners.ParentRunner.runLeaf(ParentRunner.java:325)
     [java] 	at org.junit.runners.BlockJUnit4ClassRunner.runChild(BlockJUnit4ClassRunner.java:78)
     [java] 	at org.junit.runners.BlockJUnit4ClassRunner.runChild(BlockJUnit4ClassRunner.java:57)
     [java] 	at org.junit.runners.ParentRunner$3.run(ParentRunner.java:290)
     [java] 	at org.junit.runners.ParentRunner$1.schedule(ParentRunner.java:71)
     [java] 	at org.junit.runners.ParentRunner.runChildren(ParentRunner.java:288)
     [java] 	at org.junit.runners.ParentRunner.access$000(ParentRunner.java:58)
     [java] 	at org.junit.runners.ParentRunner$2.evaluate(ParentRunner.java:268)
     [java] 	at org.junit.runners.ParentRunner.run(ParentRunner.java:363)
     [java] 	at org.junit.runners.Suite.runChild(Suite.java:128)
     [java] 	at org.junit.runners.Suite.runChild(Suite.java:27)
     [java] 	at org.junit.runners.ParentRunner$3.run(ParentRunner.java:290)
     [java] 	at org.junit.runners.ParentRunner$1.schedule(ParentRunner.java:71)
     [java] 	at org.junit.runners.ParentRunner.runChildren(ParentRunner.java:288)
     [java] 	at org.junit.runners.ParentRunner.access$000(ParentRunner.java:58)
     [java] 	at org.junit.runners.ParentRunner$2.evaluate(ParentRunner.java:268)
     [java] 	at org.junit.runners.ParentRunner.run(ParentRunner.java:363)
     [java] 	at org.junit.runner.JUnitCore.run(JUnitCore.java:137)
     [java] 	at org.junit.runner.JUnitCore.run(JUnitCore.java:115)
     [java] 	at org.apache.jorphan.test.AllTests.main(AllTests.java:222)
     [java] 
     [java] FAILURES!!!
     [java] Tests run: 2689,  Failures: 2
     [java] 

BUILD FAILED
<https://builds.apache.org/job/JMeter-trunk/ws/trunk/build.xml>:2748: Java returned:
1

Total time: 2 minutes 40 seconds
Build step 'Invoke Ant' marked build as failure
[locks-and-latches] Releasing all the locks
[locks-and-latches] All the locks released
Archiving artifacts

Mime
View raw message