jmeter-dev mailing list archives

Site index · List index
Message view « Date » · « Thread »
Top « Date » · « Thread »
From Apache Jenkins Server <jenk...@builds.apache.org>
Subject Build failed in Jenkins: JMeter trunk #5922
Date Wed, 22 Feb 2017 18:42:21 GMT
See <https://builds.apache.org/job/JMeter%20trunk/5922/display/redirect?page=changes>

Changes:

[fschumacher] javadoc: add missing param and return tags.

------------------------------------------
[...truncated 205.11 KB...]
[sonar:sonar] Source encoding: ISO-8859-1, default locale: en_US
[sonar:sonar] Index files
[sonar:sonar] 188 files indexed
[sonar:sonar] Quality profile for java: Sonar way
[sonar:sonar] Sensor Lines Sensor
[sonar:sonar] Sensor Lines Sensor (done) | time=1ms
[sonar:sonar] Sensor JavaSquidSensor
[sonar:sonar] Configured Java source version (sonar.java.source): none
[sonar:sonar] JavaClasspath initialization
[sonar:sonar] JavaClasspath initialization (done) | time=2ms
[sonar:sonar] JavaTestClasspath initialization
[sonar:sonar] JavaTestClasspath initialization (done) | time=3ms
[sonar:sonar] Java Main Files AST scan
[sonar:sonar] 188 source files to be analyzed
[sonar:sonar] 120/188 files analyzed, current file: <https://builds.apache.org/job/JMeter%20trunk/ws/trunk/src/components/org/apache/jmeter/visualizers/AxisGraph.java>
[sonar:sonar] Java Main Files AST scan (done) | time=18191ms
[sonar:sonar] Java Test Files AST scan
[sonar:sonar] 0 source files to be analyzed
[sonar:sonar] Java Test Files AST scan (done) | time=1ms
[sonar:sonar] Sensor JavaSquidSensor (done) | time=18205ms
[sonar:sonar] 188/188 source files have been analyzed
[sonar:sonar] Sensor SCM Sensor
[sonar:sonar] 0/0 source files have been analyzed
[sonar:sonar] SCM provider for this project is: svn
[sonar:sonar] 1 files to be analyzed
[sonar:sonar] 1/1 files analyzed
[sonar:sonar] Sensor SCM Sensor (done) | time=389ms
[sonar:sonar] Sensor Coverage Report Import
[sonar:sonar] Sensor Coverage Report Import (done) | time=0ms
[sonar:sonar] Sensor Coverage Report Import
[sonar:sonar] Sensor Coverage Report Import (done) | time=0ms
[sonar:sonar] Sensor Unit Test Results Import
[sonar:sonar] Sensor Unit Test Results Import (done) | time=0ms
[sonar:sonar] Sensor SurefireSensor
[sonar:sonar] parsing <https://builds.apache.org/job/JMeter%20trunk/ws/trunk/reports>
[sonar:sonar] Reports path contains no files matching TEST-.*.xml : <https://builds.apache.org/job/JMeter%20trunk/ws/trunk/reports>
[sonar:sonar] Sensor SurefireSensor (done) | time=0ms
[sonar:sonar] Sensor JaCoCoSensor
[sonar:sonar] Analysing <https://builds.apache.org/job/JMeter%20trunk/ws/trunk/reports/jacoco.exec>
[sonar:sonar] No information about coverage per test.
[sonar:sonar] Sensor JaCoCoSensor (done) | time=318ms
[sonar:sonar] Sensor JaCoCoItSensor
[sonar:sonar] JaCoCoItSensor: JaCoCo IT report not found: <https://builds.apache.org/job/JMeter%20trunk/ws/trunk/target/jacoco-it.exec>
[sonar:sonar] Sensor JaCoCoItSensor (done) | time=0ms
[sonar:sonar] Sensor JaCoCoOverallSensor
[sonar:sonar] Analysing <https://builds.apache.org/job/JMeter%20trunk/ws/trunk/reports/jacoco.exec>
[sonar:sonar] Analysing <https://builds.apache.org/job/JMeter%20trunk/ws/trunk/.sonar/org.apache.jmeter_JMeter_components/jacoco-overall.exec>
[sonar:sonar] No information about coverage per test.
[sonar:sonar] Sensor JaCoCoOverallSensor (done) | time=287ms
[sonar:sonar] Sensor XmlFileSensor
[sonar:sonar] Sensor XmlFileSensor (done) | time=1ms
[sonar:sonar] Sensor Zero Coverage Sensor
[sonar:sonar] Sensor Zero Coverage Sensor (done) | time=26ms
[sonar:sonar] Sensor Code Colorizer Sensor
[sonar:sonar] Sensor Code Colorizer Sensor (done) | time=2ms
[sonar:sonar] Sensor CPD Block Indexer
[sonar:sonar] JavaCpdBlockIndexer is used for java
[sonar:sonar] Sensor CPD Block Indexer (done) | time=188ms
[sonar:sonar] -------------  Scan functions
[sonar:sonar] Language is forced to java
[sonar:sonar] Excluded sources for coverage: 
[sonar:sonar]   **/BSF*.java
[sonar:sonar]   **/org/apache/log/**.java
[sonar:sonar]   **/org/apache/jorphan/logging/LoggingManager.java
[sonar:sonar] Base dir: <https://builds.apache.org/job/JMeter%20trunk/ws/trunk>
[sonar:sonar] Working dir: <https://builds.apache.org/job/JMeter%20trunk/ws/trunk/.sonar/org.apache.jmeter_JMeter_functions>
[sonar:sonar] Source paths: src/functions
[sonar:sonar] Source encoding: ISO-8859-1, default locale: en_US
[sonar:sonar] Index files
[sonar:sonar] 44 files indexed
[sonar:sonar] Quality profile for java: Sonar way
[sonar:sonar] Sensor Lines Sensor
[sonar:sonar] Sensor Lines Sensor (done) | time=0ms
[sonar:sonar] Sensor JavaSquidSensor
[sonar:sonar] Configured Java source version (sonar.java.source): none
[sonar:sonar] JavaClasspath initialization
[sonar:sonar] JavaClasspath initialization (done) | time=1ms
[sonar:sonar] JavaTestClasspath initialization
[sonar:sonar] JavaTestClasspath initialization (done) | time=3ms
[sonar:sonar] Java Main Files AST scan
[sonar:sonar] 44 source files to be analyzed
[sonar:sonar] Java Main Files AST scan (done) | time=2757ms
[sonar:sonar] Java Test Files AST scan
[sonar:sonar] 0 source files to be analyzed
[sonar:sonar] 44/44 source files have been analyzed
[sonar:sonar] Java Test Files AST scan (done) | time=1ms
[sonar:sonar] Sensor JavaSquidSensor (done) | time=2772ms
[sonar:sonar] 0/0 source files have been analyzed
[sonar:sonar] Sensor SCM Sensor
[sonar:sonar] Sensor SCM Sensor (done) | time=2ms
[sonar:sonar] Sensor Coverage Report Import
[sonar:sonar] Sensor Coverage Report Import (done) | time=0ms
[sonar:sonar] Sensor Coverage Report Import
[sonar:sonar] Sensor Coverage Report Import (done) | time=0ms
[sonar:sonar] Sensor Unit Test Results Import
[sonar:sonar] Sensor Unit Test Results Import (done) | time=0ms
[sonar:sonar] Sensor SurefireSensor
[sonar:sonar] parsing <https://builds.apache.org/job/JMeter%20trunk/ws/trunk/reports>
[sonar:sonar] Reports path contains no files matching TEST-.*.xml : <https://builds.apache.org/job/JMeter%20trunk/ws/trunk/reports>
[sonar:sonar] Sensor SurefireSensor (done) | time=0ms
[sonar:sonar] Sensor JaCoCoSensor
[sonar:sonar] Analysing <https://builds.apache.org/job/JMeter%20trunk/ws/trunk/reports/jacoco.exec>
[sonar:sonar] No information about coverage per test.
[sonar:sonar] Sensor JaCoCoSensor (done) | time=190ms
[sonar:sonar] Sensor JaCoCoItSensor
[sonar:sonar] JaCoCoItSensor: JaCoCo IT report not found: <https://builds.apache.org/job/JMeter%20trunk/ws/trunk/target/jacoco-it.exec>
[sonar:sonar] Sensor JaCoCoItSensor (done) | time=0ms
[sonar:sonar] Sensor JaCoCoOverallSensor
[sonar:sonar] Analysing <https://builds.apache.org/job/JMeter%20trunk/ws/trunk/reports/jacoco.exec>
[sonar:sonar] Analysing <https://builds.apache.org/job/JMeter%20trunk/ws/trunk/.sonar/org.apache.jmeter_JMeter_functions/jacoco-overall.exec>
[sonar:sonar] No information about coverage per test.
[sonar:sonar] Sensor JaCoCoOverallSensor (done) | time=191ms
[sonar:sonar] Sensor XmlFileSensor
[sonar:sonar] Sensor XmlFileSensor (done) | time=1ms
[sonar:sonar] Sensor Zero Coverage Sensor
[sonar:sonar] Sensor Zero Coverage Sensor (done) | time=5ms
[sonar:sonar] Sensor Code Colorizer Sensor
[sonar:sonar] Sensor Code Colorizer Sensor (done) | time=0ms
[sonar:sonar] Sensor CPD Block Indexer
[sonar:sonar] JavaCpdBlockIndexer is used for java
[sonar:sonar] Sensor CPD Block Indexer (done) | time=30ms
[sonar:sonar] -------------  Scan jorphan
[sonar:sonar] Language is forced to java
[sonar:sonar] Excluded sources for coverage: 
[sonar:sonar]   **/BSF*.java
[sonar:sonar]   **/org/apache/log/**.java
[sonar:sonar]   **/org/apache/jorphan/logging/LoggingManager.java
[sonar:sonar] Base dir: <https://builds.apache.org/job/JMeter%20trunk/ws/trunk>
[sonar:sonar] Working dir: <https://builds.apache.org/job/JMeter%20trunk/ws/trunk/.sonar/org.apache.jmeter_JMeter_jorphan>
[sonar:sonar] Source paths: src/jorphan
[sonar:sonar] Source encoding: ISO-8859-1, default locale: en_US
[sonar:sonar] Index files
[sonar:sonar] 60 files indexed
[sonar:sonar] Quality profile for java: Sonar way
[sonar:sonar] Sensor Lines Sensor
[sonar:sonar] Sensor Lines Sensor (done) | time=0ms
[sonar:sonar] Sensor JavaSquidSensor
[sonar:sonar] Configured Java source version (sonar.java.source): none
[sonar:sonar] JavaClasspath initialization
[sonar:sonar] JavaClasspath initialization (done) | time=2ms
[sonar:sonar] JavaTestClasspath initialization
[sonar:sonar] JavaTestClasspath initialization (done) | time=2ms
[sonar:sonar] Java Main Files AST scan
[sonar:sonar] 60 source files to be analyzed
[sonar:sonar] Java Main Files AST scan (done) | time=6131ms
[sonar:sonar] Java Test Files AST scan
[sonar:sonar] 0 source files to be analyzed
[sonar:sonar] Java Test Files AST scan (done) | time=1ms
[sonar:sonar] 60/60 source files have been analyzed
[sonar:sonar] Sensor JavaSquidSensor (done) | time=6143ms
[sonar:sonar] 0/0 source files have been analyzed
[sonar:sonar] Sensor SCM Sensor
[sonar:sonar] SCM provider for this project is: svn
[sonar:sonar] 4 files to be analyzed
[sonar:sonar] 0/4 files analyzed

BUILD FAILED
<https://builds.apache.org/job/JMeter%20trunk/ws/trunk/build.xml>:3502: java.lang.IllegalStateException:
Error when executing blame for file src/jorphan/org/apache/jorphan/logging/Slf4jLogkitLogger.java
	at org.sonar.plugins.scm.svn.SvnBlameCommand.blame(SvnBlameCommand.java:86)
	at org.sonar.plugins.scm.svn.SvnBlameCommand.blame(SvnBlameCommand.java:59)
	at org.sonar.batch.scm.ScmSensor.execute(ScmSensor.java:86)
	at org.sonar.batch.sensor.SensorWrapper.analyse(SensorWrapper.java:57)
	at org.sonar.batch.phases.SensorsExecutor.executeSensor(SensorsExecutor.java:58)
	at org.sonar.batch.phases.SensorsExecutor.execute(SensorsExecutor.java:50)
	at org.sonar.batch.phases.AbstractPhaseExecutor.execute(AbstractPhaseExecutor.java:83)
	at org.sonar.batch.scan.ModuleScanContainer.doAfterStart(ModuleScanContainer.java:192)
	at org.sonar.core.platform.ComponentContainer.startComponents(ComponentContainer.java:142)
	at org.sonar.core.platform.ComponentContainer.execute(ComponentContainer.java:127)
	at org.sonar.batch.scan.ProjectScanContainer.scan(ProjectScanContainer.java:241)
	at org.sonar.batch.scan.ProjectScanContainer.scanRecursively(ProjectScanContainer.java:236)
	at org.sonar.batch.scan.ProjectScanContainer.scanRecursively(ProjectScanContainer.java:234)
	at org.sonar.batch.scan.ProjectScanContainer.doAfterStart(ProjectScanContainer.java:226)
	at org.sonar.core.platform.ComponentContainer.startComponents(ComponentContainer.java:142)
	at org.sonar.core.platform.ComponentContainer.execute(ComponentContainer.java:127)
	at org.sonar.batch.task.ScanTask.execute(ScanTask.java:47)
	at org.sonar.batch.task.TaskContainer.doAfterStart(TaskContainer.java:86)
	at org.sonar.core.platform.ComponentContainer.startComponents(ComponentContainer.java:142)
	at org.sonar.core.platform.ComponentContainer.execute(ComponentContainer.java:127)
	at org.sonar.batch.bootstrap.GlobalContainer.executeTask(GlobalContainer.java:106)
	at org.sonar.batch.bootstrapper.Batch.executeTask(Batch.java:119)
	at org.sonarsource.scanner.api.internal.batch.BatchIsolatedLauncher.execute(BatchIsolatedLauncher.java:62)
	at sun.reflect.NativeMethodAccessorImpl.invoke0(Native Method)
	at sun.reflect.NativeMethodAccessorImpl.invoke(NativeMethodAccessorImpl.java:62)
	at sun.reflect.DelegatingMethodAccessorImpl.invoke(DelegatingMethodAccessorImpl.java:43)
	at java.lang.reflect.Method.invoke(Method.java:498)
	at org.sonarsource.scanner.api.internal.IsolatedLauncherProxy.invoke(IsolatedLauncherProxy.java:60)
	at com.sun.proxy.$Proxy7.execute(Unknown Source)
	at org.sonarsource.scanner.api.EmbeddedScanner.doExecute(EmbeddedScanner.java:233)
	at org.sonarsource.scanner.api.EmbeddedScanner.runAnalysis(EmbeddedScanner.java:151)
	at org.sonarsource.scanner.ant.SonarQubeTask.launchAnalysis(SonarQubeTask.java:99)
	at org.sonarsource.scanner.ant.SonarQubeTask.execute(SonarQubeTask.java:81)
	at org.apache.tools.ant.UnknownElement.execute(UnknownElement.java:293)
	at sun.reflect.GeneratedMethodAccessor5.invoke(Unknown Source)
	at sun.reflect.DelegatingMethodAccessorImpl.invoke(DelegatingMethodAccessorImpl.java:43)
	at java.lang.reflect.Method.invoke(Method.java:498)
	at org.apache.tools.ant.dispatch.DispatchUtils.execute(DispatchUtils.java:106)
	at org.apache.tools.ant.Task.perform(Task.java:348)
	at org.apache.tools.ant.Target.execute(Target.java:435)
	at org.apache.tools.ant.Target.performTasks(Target.java:456)
	at org.apache.tools.ant.Project.executeSortedTargets(Project.java:1405)
	at org.apache.tools.ant.Project.executeTarget(Project.java:1376)
	at org.apache.tools.ant.helper.DefaultExecutor.executeTargets(DefaultExecutor.java:41)
	at org.apache.tools.ant.Project.executeTargets(Project.java:1260)
	at org.apache.tools.ant.Main.runBuild(Main.java:857)
	at org.apache.tools.ant.Main.startAnt(Main.java:236)
	at org.apache.tools.ant.launch.Launcher.run(Launcher.java:287)
	at org.apache.tools.ant.launch.Launcher.main(Launcher.java:113)
Caused by: org.tmatesoft.svn.core.SVNException: svn: E175002: unknown host
svn: E175002: OPTIONS request failed on '/repos/asf/jmeter/trunk/src/jorphan/org/apache/jorphan/logging/Slf4jLogkitLogger.java'
	at org.tmatesoft.svn.core.internal.wc.SVNErrorManager.error(SVNErrorManager.java:106)
	at org.tmatesoft.svn.core.internal.wc.SVNErrorManager.error(SVNErrorManager.java:90)
	at org.tmatesoft.svn.core.internal.io.dav.http.HTTPConnection.request(HTTPConnection.java:798)
	at org.tmatesoft.svn.core.internal.io.dav.http.HTTPConnection.request(HTTPConnection.java:398)
	at org.tmatesoft.svn.core.internal.io.dav.http.HTTPConnection.request(HTTPConnection.java:386)
	at org.tmatesoft.svn.core.internal.io.dav.DAVConnection.performHttpRequest(DAVConnection.java:863)
	at org.tmatesoft.svn.core.internal.io.dav.DAVConnection.exchangeCapabilities(DAVConnection.java:699)
	at org.tmatesoft.svn.core.internal.io.dav.DAVConnection.open(DAVConnection.java:118)
	at org.tmatesoft.svn.core.internal.io.dav.DAVRepository.openConnection(DAVRepository.java:1049)
	at org.tmatesoft.svn.core.internal.io.dav.DAVRepository.hasCapability(DAVRepository.java:877)
	at org.tmatesoft.svn.core.io.SVNRepository.assertServerIsMergeInfoCapable(SVNRepository.java:787)
	at org.tmatesoft.svn.core.io.SVNRepository.getFileRevisions(SVNRepository.java:756)
	at org.tmatesoft.svn.core.internal.wc2.remote.SvnRemoteAnnotate.run(SvnRemoteAnnotate.java:111)
	at org.tmatesoft.svn.core.internal.wc2.remote.SvnRemoteAnnotate.run(SvnRemoteAnnotate.java:35)
	at org.tmatesoft.svn.core.internal.wc2.SvnOperationRunner.run(SvnOperationRunner.java:21)
	at org.tmatesoft.svn.core.wc2.SvnOperationFactory.run(SvnOperationFactory.java:1235)
	at org.tmatesoft.svn.core.wc2.SvnOperation.run(SvnOperation.java:294)
	at org.tmatesoft.svn.core.wc.SVNLogClient.doAnnotate(SVNLogClient.java:295)
	at org.sonar.plugins.scm.svn.SvnBlameCommand.blame(SvnBlameCommand.java:84)
	... 48 more
Caused by: java.net.UnknownHostException: svn.apache.org: No address associated with hostname
	at java.net.Inet6AddressImpl.lookupAllHostAddr(Native Method)
	at java.net.InetAddress$2.lookupAllHostAddr(InetAddress.java:928)
	at java.net.InetAddress.getAddressesFromNameService(InetAddress.java:1323)
	at java.net.InetAddress.getAllByName0(InetAddress.java:1276)
	at java.net.InetAddress.getAllByName(InetAddress.java:1192)
	at java.net.InetAddress.getAllByName(InetAddress.java:1126)
	at java.net.InetAddress.getByName(InetAddress.java:1076)
	at org.tmatesoft.svn.core.internal.util.SVNSocketFactory.createAddres(SVNSocketFactory.java:189)
	at org.tmatesoft.svn.core.internal.util.SVNSocketFactory.createPlainSocket(SVNSocketFactory.java:66)
	at org.tmatesoft.svn.core.internal.io.dav.http.HTTPConnection.connect(HTTPConnection.java:282)
	at org.tmatesoft.svn.core.internal.io.dav.http.HTTPConnection.request(HTTPConnection.java:461)
	... 64 more

Total time: 10 minutes 6 seconds
Build step 'Invoke Ant' marked build as failure
[locks-and-latches] Releasing all the locks
[locks-and-latches] All the locks released
Archiving artifacts
Compressed 128.12 MB of artifacts by 28.3% relative to #5920

Mime
View raw message