jmeter-dev mailing list archives

Site index · List index
Message view « Date » · « Thread »
Top « Date » · « Thread »
From Apache Jenkins Server <jenk...@builds.apache.org>
Subject Build failed in Jenkins: JMeter-trunk #5888
Date Sun, 19 Feb 2017 15:21:03 GMT
See <https://builds.apache.org/job/JMeter-trunk/5888/display/redirect?page=changes>

Changes:

[pmouawad] Update jmx and tests after adding assertion

[pmouawad] Fix javadocs

------------------------------------------
[...truncated 120.75 KB...]
   [jmeter] Tidying up ...    @ Sun Feb 19 15:18:28 UTC 2017 (1487517508013)
   [jmeter] ... end of run
     [echo] Bug54685 output files compared OK

batchtest:
     [echo] Starting Bug55375 using -X
   [jmeter] Creating summariser <summary>
   [jmeter] Created the tree successfully using testfiles/Bug55375.jmx
   [jmeter] Starting the test @ Sun Feb 19 15:18:30 UTC 2017 (1487517510042)
   [jmeter] Waiting for possible Shutdown/StopTestNow/Heapdump message on port 4445
   [jmeter] summary +      1 in 00:00:00 =    2.6/s Avg:   258 Min:   258 Max:   258 Err:
    0 (0.00%) Active: 1 Started: 1 Finished: 0
   [jmeter] summary =      1 in 00:00:00 =    2.6/s Avg:   258 Min:   258 Max:   258 Err:
    0 (0.00%)
   [jmeter] Tidying up ...    @ Sun Feb 19 15:18:30 UTC 2017 (1487517510942)
   [jmeter] ... end of run
     [echo] Bug55375 output files compared OK

batchtestserver:

batchtest:
     [echo] Starting Bug54685 using -Rlocalhost:2045
   [server] Created remote object: UnicastServerRef [liveRef: [endpoint:[67.195.81.186:34597](local),objID:[-708c5e2d:15a56f3f39b:-7fff,
-404210738555009157]]]
   [client] Creating summariser <summary>
   [client] Created the tree successfully using testfiles/Bug54685.jmx
   [client] Configuring remote engine: localhost:2045
   [client] Starting remote engines
   [client] Starting the test @ Sun Feb 19 15:18:34 UTC 2017 (1487517514133)
   [server] Starting the test on host localhost:2045 @ Sun Feb 19 15:18:35 UTC 2017 (1487517515528)
   [client] Remote engines have been started
   [client] Waiting for possible Shutdown/StopTestNow/Heapdump message on port 4445
   [server] Finished the test on host localhost:2045 @ Sun Feb 19 15:18:36 UTC 2017 (1487517516307)
- exit requested.
   [client] summary =      1 in 00:00:00 =    3.8/s Avg:   122 Min:   122 Max:   122 Err:
    0 (0.00%)
   [client] Tidying up remote @ Sun Feb 19 15:18:36 UTC 2017 (1487517516307)
   [client] ... end of run
     [echo] Bug54685 output files compared OK

batchtest:
     [echo] Starting Bug56811 using -X
   [jmeter] Creating summariser <summary>
   [jmeter] Created the tree successfully using testfiles/Bug56811.jmx
   [jmeter] Starting the test @ Sun Feb 19 15:18:43 UTC 2017 (1487517523472)
   [jmeter] Waiting for possible Shutdown/StopTestNow/Heapdump message on port 4445
   [jmeter] summary =      9 in 00:00:09 =    1.0/s Avg:   124 Min:     1 Max:   240 Err:
    3 (33.33%)
   [jmeter] Tidying up ...    @ Sun Feb 19 15:18:53 UTC 2017 (1487517533144)
   [jmeter] ... end of run
     [echo] Bug56811 output files compared OK

batchtest:

batchtest:
     [echo] Starting Bug60607 using -X
   [jmeter] Creating summariser <summary>
   [jmeter] Created the tree successfully using testfiles/Bug60607.jmx
   [jmeter] Starting the test @ Sun Feb 19 15:18:55 UTC 2017 (1487517535239)
   [jmeter] Waiting for possible Shutdown/StopTestNow/Heapdump message on port 4445
   [jmeter] summary =      2 in 00:00:31 =    0.1/s Avg: 15244 Min:   408 Max: 30080 Err:
    0 (0.00%)
   [jmeter] Tidying up ...    @ Sun Feb 19 15:19:26 UTC 2017 (1487517566467)
   [jmeter] ... end of run
     [echo] Bug60607 output files compared OK

batchtest:
     [echo] Starting SlowCharsFeature using -X
   [jmeter] Creating summariser <summary>
   [jmeter] Created the tree successfully using testfiles/SlowCharsFeature.jmx
   [jmeter] Starting the test @ Sun Feb 19 15:19:28 UTC 2017 (1487517568476)
   [jmeter] Waiting for possible Shutdown/StopTestNow/Heapdump message on port 4445
   [jmeter] summary +      2 in 00:00:07 =    0.3/s Avg:  3088 Min:   365 Max:  5811 Err:
    0 (0.00%) Active: 1 Started: 1 Finished: 0
   [jmeter] summary +      1 in 00:00:11 =    0.1/s Avg: 11200 Min: 11200 Max: 11200 Err:
    0 (0.00%) Active: 0 Started: 1 Finished: 1
   [jmeter] summary =      3 in 00:00:18 =    0.2/s Avg:  5792 Min:   365 Max: 11200 Err:
    0 (0.00%)
   [jmeter] Tidying up ...    @ Sun Feb 19 15:19:47 UTC 2017 (1487517587024)
   [jmeter] ... end of run
     [echo] SlowCharsFeature output files compared OK

batchtest:
     [echo] Starting Http4ImplPreemptiveBasicAuth using -X
   [jmeter] Creating summariser <summary>
   [jmeter] Created the tree successfully using testfiles/Http4ImplPreemptiveBasicAuth.jmx
   [jmeter] Starting the test @ Sun Feb 19 15:19:49 UTC 2017 (1487517589132)
   [jmeter] Waiting for possible Shutdown/StopTestNow/Heapdump message on port 4445
   [jmeter] summary =     12 in 00:00:08 =    1.5/s Avg:   395 Min:   153 Max:  1114 Err:
    0 (0.00%)
   [jmeter] Tidying up ...    @ Sun Feb 19 15:19:57 UTC 2017 (1487517597865)
   [jmeter] ... end of run
     [echo] Http4ImplPreemptiveBasicAuth output files compared OK

batchtest:
     [echo] Starting TestKeepAlive using -X
   [jmeter] Creating summariser <summary>
   [jmeter] Created the tree successfully using testfiles/TestKeepAlive.jmx
   [jmeter] Starting the test @ Sun Feb 19 15:19:59 UTC 2017 (1487517599954)
   [jmeter] Waiting for possible Shutdown/StopTestNow/Heapdump message on port 4445
   [jmeter] summary +      1 in 00:00:00 =    2.4/s Avg:   383 Min:   383 Max:   383 Err:
    0 (0.00%) Active: 1 Started: 1 Finished: 0
   [jmeter] summary +      5 in 00:00:32 =    0.2/s Avg:   236 Min:   153 Max:   401 Err:
    0 (0.00%) Active: 1 Started: 1 Finished: 0
   [jmeter] summary =      6 in 00:00:32 =    0.2/s Avg:   261 Min:   153 Max:   401 Err:
    0 (0.00%)
   [jmeter] summary +      1 in 00:00:30 =    0.0/s Avg:   320 Min:   320 Max:   320 Err:
    0 (0.00%) Active: 1 Started: 1 Finished: 0
   [jmeter] summary =      7 in 00:01:02 =    0.1/s Avg:   269 Min:   153 Max:   401 Err:
    0 (0.00%)
   [jmeter] summary =      7 in 00:01:02 =    0.1/s Avg:   269 Min:   153 Max:   401 Err:
    0 (0.00%)
   [jmeter] Tidying up ...    @ Sun Feb 19 15:21:03 UTC 2017 (1487517663075)
   [jmeter] ... end of run

BUILD FAILED
<https://builds.apache.org/job/JMeter-trunk/ws/trunk/build.xml>:2707: The following
error occurred while executing this line:
<https://builds.apache.org/job/JMeter-trunk/ws/trunk/build.xml>:2609: XML Files are
not identical.
        <https://builds.apache.org/job/JMeter-trunk/ws/trunk/bin/testfiles/TestKeepAlive.xml>
        <?xml version="1.0" encoding="UTF-8"?>
<testResults version="1.2">
<sample s="true" lb="JSPP_SetProperties" rc="200" rm="OK" dt="text"/>
<httpSample s="true" lb="HTTP-Warmup" rc="200" rm="OK" dt="text">
  <assertionResult>
    <name>RA_Max100</name>
    <failure>false</failure>
    <error>false</error>
  </assertionResult>
  <assertionResult>
    <name>RA_keepAlive</name>
    <failure>false</failure>
    <error>false</error>
  </assertionResult>
</httpSample>
<httpSample s="true" lb="HTTP_Request_REUSE" rc="200" rm="OK" dt="text">
  <assertionResult>
    <name>RA_Max99</name>
    <failure>false</failure>
    <error>false</error>
  </assertionResult>
  <assertionResult>
    <name>RA_keepAlive</name>
    <failure>false</failure>
    <error>false</error>
  </assertionResult>
</httpSample>
<httpSample s="true" lb="HTTP_Request_REUSE_2" rc="200" rm="OK" dt="text">
  <assertionResult>
    <name>RA_Max99</name>
    <failure>false</failure>
    <error>false</error>
  </assertionResult>
  <assertionResult>
    <name>RA_keepAlive</name>
    <failure>false</failure>
    <error>false</error>
  </assertionResult>
</httpSample>
<httpSample s="true" lb="HTTP_Request_REUSE_AFTER_VALIDATE" rc="200" rm="OK" dt="text">
  <assertionResult>
    <name>RA_Max99</name>
    <failure>false</failure>
    <error>false</error>
  </assertionResult>
  <assertionResult>
    <name>RA_keepAlive</name>
    <failure>false</failure>
    <error>false</error>
  </assertionResult>
</httpSample>
<httpSample s="true" lb="HTTP_Request_NO_REUSE" rc="200" rm="OK" dt="text">
  <assertionResult>
    <name>RA_Max100</name>
    <failure>false</failure>
    <error>false</error>
  </assertionResult>
  <assertionResult>
    <name>RA_keepAlive</name>
    <failure>false</failure>
    <error>false</error>
  </assertionResult>
</httpSample>
        <https://builds.apache.org/job/JMeter-trunk/ws/trunk/bin/TestKeepAlive.xml>
        <?xml version="1.0" encoding="UTF-8"?>
<testResults version="1.2">
<sample s="true" lb="JSPP_SetProperties" rc="200" rm="OK" dt="text"/>
<httpSample s="true" lb="HTTP-Warmup" rc="200" rm="OK" dt="text">
  <assertionResult>
    <name>RA_Max100</name>
    <failure>false</failure>
    <error>false</error>
  </assertionResult>
  <assertionResult>
    <name>RA_keepAlive</name>
    <failure>false</failure>
    <error>false</error>
  </assertionResult>
</httpSample>
<httpSample s="true" lb="HTTP_Request_REUSE" rc="200" rm="OK" dt="text">
  <assertionResult>
    <name>RA_Max99</name>
    <failure>false</failure>
    <error>false</error>
  </assertionResult>
  <assertionResult>
    <name>RA_keepAlive</name>
    <failure>false</failure>
    <error>false</error>
  </assertionResult>
</httpSample>
<httpSample s="true" lb="HTTP_Request_REUSE_2" rc="200" rm="OK" dt="text">
  <assertionResult>
    <name>RA_Max99</name>
    <failure>false</failure>
    <error>false</error>
  </assertionResult>
  <assertionResult>
    <name>RA_keepAlive</name>
    <failure>false</failure>
    <error>false</error>
  </assertionResult>
</httpSample>
<httpSample s="true" lb="HTTP_Request_REUSE_AFTER_VALIDATE" rc="200" rm="OK" dt="text">
  <assertionResult>
    <name>RA_Max99</name>
    <failure>false</failure>
    <error>false</error>
  </assertionResult>
  <assertionResult>
    <name>RA_keepAlive</name>
    <failure>false</failure>
    <error>false</error>
  </assertionResult>
</httpSample>
<httpSample s="true" lb="HTTP_Request_NO_REUSE" rc="200" rm="OK" dt="text">
  <assertionResult>
    <name>RA_Max100</name>
    <failure>false</failure>
    <error>false</error>
  </assertionResult>
  <assertionResult>
    <name>RA_keepAlive</name>
    <failure>false</failure>
    <error>false</error>
  </assertionResult>
</httpSample>
<httpSample s="true" lb="HTTP_Request_NO_REUSE" rc="200" rm="OK" dt="text">
  <assertionResult>
    <name>RA_Max100</name>
    <failure>false</failure>
    <error>false</error>
  </assertionResult>
  <assertionResult>
    <name>RA_keepAlive</name>
    <failure>false</failure>
    <error>false</error>
  </assertionResult>
</httpSample>

</testResults>

Total time: 6 minutes 28 seconds
Build step 'Invoke Ant' marked build as failure
[locks-and-latches] Releasing all the locks
[locks-and-latches] All the locks released
Archiving artifacts

Mime
View raw message