jmeter-dev mailing list archives

Site index · List index
Message view « Date » · « Thread »
Top « Date » · « Thread »
From Apache Jenkins Server <jenk...@builds.apache.org>
Subject Build failed in Jenkins: JMeter Ubuntu #100
Date Tue, 25 Jul 2017 20:47:44 GMT
See <https://builds.apache.org/job/JMeter%20Ubuntu/100/display/redirect?page=changes>

Changes:

[pmouawad] Bug 61336 - BeanShell Assertion : mistake in Chinese translation
Bugzilla Id: 61336

[pmouawad] Don't mention improvements on an introduced function (at least I think  so :-)
).

[pmouawad] Bug 61341 Add locale parameter to timeShift function
Clarify and simplify code
Bugzilla Id: 61341

[pmouawad] Bug 61339 - [Backend Listener] In TIMED mode, metric are not reset
Nightly build bugs are not mentionned in release notes.
Bugzilla Id: 61339

[fschumacher] Render the displayed sampler result less often

Bugzilla Id: 60961

[mchassagneux] Update changelog

[mchassagneux] Add locale parameter to timeShift function
Bugzilla Id: 61341

[mchassagneux] Fix reset metric on timed mode and split JUnit test ( for timed et fixed mode
) to handle correctly the real behavior of JMeter
Bugzilla Id: 61339

[mchassagneux] Add JUnit test
Bugzilla Id: 61335

[mchassagneux] make date & period variable on each execution
Bugzilla Id: 61335

[pmouawad] Bug 61332 - NIGHTLY BUILD : HTTP sampler with Cache manager doesn't work with JAVA
implementation
Bugzilla Id: 61332

[fschumacher] Remove wrong css-tag

[fschumacher] Add missing semicolon

------------------------------------------
[...truncated 111.22 KB...]
      [jar] Building jar: <https://builds.apache.org/job/JMeter%20Ubuntu/ws/trunk/lib/ext/ApacheJMeter_java.jar>
      [jar] Building jar: <https://builds.apache.org/job/JMeter%20Ubuntu/ws/trunk/lib/bshclient.jar>
      [jar] Building jar: <https://builds.apache.org/job/JMeter%20Ubuntu/ws/trunk/lib/ext/ApacheJMeter_junit.jar>
      [jar] Building jar: <https://builds.apache.org/job/JMeter%20Ubuntu/ws/trunk/lib/junit/test.jar>
      [jar] Building jar: <https://builds.apache.org/job/JMeter%20Ubuntu/ws/trunk/lib/ext/ApacheJMeter_ldap.jar>
      [jar] Building jar: <https://builds.apache.org/job/JMeter%20Ubuntu/ws/trunk/lib/ext/ApacheJMeter_mail.jar>
      [jar] Building jar: <https://builds.apache.org/job/JMeter%20Ubuntu/ws/trunk/lib/ext/ApacheJMeter_tcp.jar>
      [jar] Building jar: <https://builds.apache.org/job/JMeter%20Ubuntu/ws/trunk/lib/ext/ApacheJMeter_jms.jar>
      [jar] Building jar: <https://builds.apache.org/job/JMeter%20Ubuntu/ws/trunk/lib/ext/ApacheJMeter_native.jar>
      [jar] Building jar: <https://builds.apache.org/job/JMeter%20Ubuntu/ws/trunk/lib/ext/ApacheJMeter_mongodb.jar>
      [jar] Building jar: <https://builds.apache.org/job/JMeter%20Ubuntu/ws/trunk/lib/jorphan.jar>

package:

_check_3rdparty:

_message_3rdParty:

init-version:
     [echo] jmeter.version = 3.3-SNAPSHOT
     [echo] display.version = 3.3-SNAPSHOT r1802998
     [echo] implementation.version = 3.3-SNAPSHOT r1802998

compile-jorphan:

compile-core:

compile-components:

compile-functions:

compile-http:

compile-ftp:

compile-jdbc:

compile-java:

compile-ldap:

create-mail-dir:

compile-mail:

compile-tcp:

compile-protocols:

compile-junit:

compile-jms:

compile-native:

compile-mongodb:

compile:

compile-tests:
    [javac] Compiling 184 source files to <https://builds.apache.org/job/JMeter%20Ubuntu/ws/trunk/build/test>
    [javac] Note: <https://builds.apache.org/job/JMeter%20Ubuntu/ws/trunk/test/src/org/apache/jmeter/protocol/http/control/TestCacheManagerBase.java>
uses or overrides a deprecated API.
    [javac] Note: Recompile with -Xlint:deprecation for details.

prepare-resources:
     [copy] Copying 3 files to <https://builds.apache.org/job/JMeter%20Ubuntu/ws/trunk/build/res/META-INF>

package-only:
      [jar] Building jar: <https://builds.apache.org/job/JMeter%20Ubuntu/ws/trunk/bin/ApacheJMeter.jar>
      [jar] Building jar: <https://builds.apache.org/job/JMeter%20Ubuntu/ws/trunk/lib/ext/ApacheJMeter_core.jar>
      [jar] Building jar: <https://builds.apache.org/job/JMeter%20Ubuntu/ws/trunk/lib/ext/ApacheJMeter_components.jar>
      [jar] Building jar: <https://builds.apache.org/job/JMeter%20Ubuntu/ws/trunk/lib/ext/ApacheJMeter_functions.jar>
      [jar] Building jar: <https://builds.apache.org/job/JMeter%20Ubuntu/ws/trunk/lib/ext/ApacheJMeter_http.jar>
      [jar] Building jar: <https://builds.apache.org/job/JMeter%20Ubuntu/ws/trunk/lib/ext/ApacheJMeter_ftp.jar>
      [jar] Building jar: <https://builds.apache.org/job/JMeter%20Ubuntu/ws/trunk/lib/ext/ApacheJMeter_jdbc.jar>
      [jar] Building jar: <https://builds.apache.org/job/JMeter%20Ubuntu/ws/trunk/lib/ext/ApacheJMeter_java.jar>
      [jar] Building jar: <https://builds.apache.org/job/JMeter%20Ubuntu/ws/trunk/lib/bshclient.jar>
      [jar] Building jar: <https://builds.apache.org/job/JMeter%20Ubuntu/ws/trunk/lib/ext/ApacheJMeter_junit.jar>
      [jar] Building jar: <https://builds.apache.org/job/JMeter%20Ubuntu/ws/trunk/lib/junit/test.jar>
      [jar] Building jar: <https://builds.apache.org/job/JMeter%20Ubuntu/ws/trunk/lib/ext/ApacheJMeter_ldap.jar>
      [jar] Building jar: <https://builds.apache.org/job/JMeter%20Ubuntu/ws/trunk/lib/ext/ApacheJMeter_mail.jar>
      [jar] Building jar: <https://builds.apache.org/job/JMeter%20Ubuntu/ws/trunk/lib/ext/ApacheJMeter_tcp.jar>
      [jar] Building jar: <https://builds.apache.org/job/JMeter%20Ubuntu/ws/trunk/lib/ext/ApacheJMeter_jms.jar>
      [jar] Building jar: <https://builds.apache.org/job/JMeter%20Ubuntu/ws/trunk/lib/ext/ApacheJMeter_native.jar>
      [jar] Building jar: <https://builds.apache.org/job/JMeter%20Ubuntu/ws/trunk/lib/ext/ApacheJMeter_mongodb.jar>
      [jar] Building jar: <https://builds.apache.org/job/JMeter%20Ubuntu/ws/trunk/lib/jorphan.jar>

package:

_test:
     [echo] 
     [echo]    gump.run = false
     [echo]    java.awt.headless = true
     [echo]    test.headless = true
     [echo]    user.dir = <https://builds.apache.org/job/JMeter%20Ubuntu/ws/trunk>
     [echo]    basedir = <https://builds.apache.org/job/JMeter%20Ubuntu/ws/trunk>
     [echo]    test dir = build/test
     [echo]    test dir gump = build/test
     [echo]    testsaveservice.saveout = ${testsaveservice.saveout}
     [echo]    test.encoding = UTF-8
     [echo]     
     [java] Setting JMeterHome: <https://builds.apache.org/job/JMeter%20Ubuntu/ws/trunk>
     [java] Using initializeProperties() from org.apache.jmeter.util.JMeterUtils
     [java] Setting up initial properties using: <https://builds.apache.org/job/JMeter%20Ubuntu/ws/trunk/bin/jmeter.properties>
     [java] Initializing Properties: <https://builds.apache.org/job/JMeter%20Ubuntu/ws/trunk/bin/jmeter.properties>
     [java] JMeterVersion=3.3-SNAPSHOT r1802998
     [java] java.version=1.8.0_131
     [java] java.home=/usr/local/asfpackages/java/jdk1.8.0_131/jre
     [java] file.encoding=UTF-8
     [java] default encoding=UTF-8
     [java] user.dir=<https://builds.apache.org/job/JMeter%20Ubuntu/ws/trunk/bin>
     [java] Locale=en_US
     [java] os.name=Linux
     [java] os.version=4.8.3-std-1
     [java] JCE max key length = 128
     [java] +++++++++++
     [java] java.awt.headless=true
     [java] java.awt.graphicsenv=sun.awt.X11GraphicsEnvironment
     [java] ------------
     [java] Searching junit tests in : build/test
     [java] o.a.j.junit.JMeterTest INFO: JMeterGUIComponent: skipping some tests org.apache.jmeter.testbeans.gui.TestBeanGUI
     [java] o.a.j.junit.JMeterTest Error creating org.apache.jmeter.SplashScreen java.awt.HeadlessException
     [java] o.a.j.junit.JMeterTest Error creating org.apache.jmeter.config.gui.RowDetailDialog
java.awt.HeadlessException
     [java] o.a.j.junit.JMeterTest Error creating org.apache.jmeter.functions.gui.FunctionHelper
java.awt.HeadlessException
     [java] o.a.j.junit.JMeterTest Error creating org.apache.jmeter.gui.MainFrame java.awt.HeadlessException
     [java] o.a.j.junit.JMeterTest Error creating org.apache.jmeter.gui.SavePropertyDialog
java.awt.HeadlessException
     [java] o.a.j.junit.JMeterTest Error creating org.apache.jmeter.gui.action.SearchTreeDialog
java.awt.HeadlessException
     [java] o.a.j.junit.JMeterTest Error creating org.apache.jmeter.gui.action.SelectTemplatesDialog
java.awt.HeadlessException
     [java] o.a.j.junit.JMeterTest Error creating org.apache.jmeter.gui.util.EscapeDialog
java.awt.HeadlessException
     [java] o.a.j.junit.JMeterTest Error creating org.apache.jmeter.gui.util.JSyntaxTextArea
java.awt.HeadlessException
     [java] java.rmi.server.hostname=null
     [java] qnode1/127.0.1.1
     [java] isSiteLocalAddress:false
     [java] isAnyLocalAddress:false
     [java] isLinkLocalAddress:false
     [java] isLoopbackAddress:true
     [java] isMulticastAddress:false
     [java] localhost/127.0.0.1
     [java] isSiteLocalAddress:false
     [java] isAnyLocalAddress:false
     [java] isLinkLocalAddress:false
     [java] isLoopbackAddress:true
     [java] isMulticastAddress:false
     [java] ====================
     [java] qnode1/127.0.1.1
     [java] isSiteLocalAddress:false
     [java] isAnyLocalAddress:false
     [java] isLinkLocalAddress:false
     [java] isLoopbackAddress:true
     [java] isMulticastAddress:false
     [java] Security framework of XStream not initialized, XStream is probably vulnerable.
     [java] Security framework of XStream not initialized, XStream is probably vulnerable.
     [java] Security framework of XStream not initialized, XStream is probably vulnerable.
     [java] Security framework of XStream not initialized, XStream is probably vulnerable.
     [java] ....................................................................................................................I............................................................................................................................................................................................................................................................................................................................................................................................................................................................................................................................................................................................................................................................................................................................................................................................................................................................................................................................................................................................................................................................................................................................................................................................................................................................................................................................................................................................................................................................................................................................................................................................................................................................................................................................................................................................................................................................................................................................................................................................................................................................................................................................................................................................................................................................................................................................................................................................................................................................................................................................................................................................................................................................................................................................................................................................................................II.........................................................................
     [java] Time: 83.256
     [java] 
     [java] OK (2905 tests)
     [java] 

batchtest:
     [echo] Starting BatchTestLocal with file BatchTestLocal.jmx using -X -Jdummy=dummy
   [jmeter] Creating summariser <summary>
   [jmeter] Created the tree successfully using testfiles/BatchTestLocal.jmx
   [jmeter] Starting the test @ Tue Jul 25 20:46:47 UTC 2017 (1501015607600)
   [jmeter] Waiting for possible Shutdown/StopTestNow/Heapdump message on port 4445
   [jmeter] summary +     63 in 00:00:42 =    1.5/s Avg:   129 Min:     7 Max:   251 Err:
    8 (12.70%) Active: 1 Started: 2 Finished: 1
   [jmeter] summary +     70 in 00:00:08 =    9.2/s Avg:   105 Min:     1 Max:   255 Err:
    8 (11.43%) Active: 0 Started: 1 Finished: 1
   [jmeter] summary =    133 in 00:00:49 =    2.7/s Avg:   116 Min:     1 Max:   255 Err:
   16 (12.03%)
   [jmeter] Tidying up ...    @ Tue Jul 25 20:47:37 UTC 2017 (1501015657648)
   [jmeter] ... end of run
     [echo] BatchTestLocal output files compared OK

batchtestserver:

batchtest:
     [echo] Starting BatchTestLocal with file BatchTestLocal.jmx using -Rlocalhost:2034 -Jdummy=dummy
   [server] Server failed to start: java.rmi.RemoteException: Cannot start. qnode1 is a loopback
address.
   [server] Created remote object: UnicastServerRef [liveRef: [endpoint:[127.0.1.1:39601](local),objID:[3847dc42:15d7b8156ab:-7fff,
5229385853914338407]]]
   [server] An error occurred: Cannot start. qnode1 is a loopback address.
   [server] Java Result: 1
   [client] Creating summariser <summary>
   [client] Created the tree successfully using testfiles/BatchTestLocal.jmx
   [client] Configuring remote engine: localhost:2034
   [client] Connection refused to host: localhost; nested exception is: 
   [client] 	java.net.ConnectException: Connection refused (Connection refused)
   [client] Failed to configure localhost:2034
   [client] Stopping remote engines
   [client] Remote engines have been stopped
   [client] Error in NonGUIDriver java.lang.RuntimeException: Following remote engines could
not be configured:[localhost:2034]
   [concat] 2017-07-25 20:47:43,977 ERROR o.a.j.e.DistributedRunner: Failed to create engine
at localhost:2034
   [concat] java.rmi.ConnectException: Connection refused to host: localhost; nested exception
is: 
   [concat] 	java.net.ConnectException: Connection refused (Connection refused)
   [concat] 	at sun.rmi.transport.tcp.TCPEndpoint.newSocket(TCPEndpoint.java:619) ~[?:1.8.0_131]
   [concat] 	at sun.rmi.transport.tcp.TCPChannel.createConnection(TCPChannel.java:216) ~[?:1.8.0_131]
   [concat] 	at sun.rmi.transport.tcp.TCPChannel.newConnection(TCPChannel.java:202) ~[?:1.8.0_131]
   [concat] 	at sun.rmi.server.UnicastRef.newCall(UnicastRef.java:342) ~[?:1.8.0_131]
   [concat] 	at sun.rmi.registry.RegistryImpl_Stub.lookup(Unknown Source) ~[?:1.8.0_131]
   [concat] 	at java.rmi.Naming.lookup(Naming.java:101) ~[?:1.8.0_131]
   [concat] 	at org.apache.jmeter.engine.ClientJMeterEngine.getEngine(ClientJMeterEngine.java:54)
~[ApacheJMeter_core.jar:3.3-SNAPSHOT r1802998]
   [concat] 	at org.apache.jmeter.engine.ClientJMeterEngine.<init>(ClientJMeterEngine.java:67)
~[ApacheJMeter_core.jar:3.3-SNAPSHOT r1802998]
   [concat] 	at org.apache.jmeter.engine.DistributedRunner.createEngine(DistributedRunner.java:237)
~[ApacheJMeter_core.jar:3.3-SNAPSHOT r1802998]
   [concat] 	at org.apache.jmeter.engine.DistributedRunner.getClientEngine(DistributedRunner.java:213)
[ApacheJMeter_core.jar:3.3-SNAPSHOT r1802998]
   [concat] 	at org.apache.jmeter.engine.DistributedRunner.init(DistributedRunner.java:93)
[ApacheJMeter_core.jar:3.3-SNAPSHOT r1802998]
   [concat] 	at org.apache.jmeter.JMeter.runNonGui(JMeter.java:1003) [ApacheJMeter_core.jar:3.3-SNAPSHOT
r1802998]
   [concat] 	at org.apache.jmeter.JMeter.startNonGui(JMeter.java:910) [ApacheJMeter_core.jar:3.3-SNAPSHOT
r1802998]
   [concat] 	at org.apache.jmeter.JMeter.start(JMeter.java:538) [ApacheJMeter_core.jar:3.3-SNAPSHOT
r1802998]
   [concat] 	at sun.reflect.NativeMethodAccessorImpl.invoke0(Native Method) ~[?:1.8.0_131]
   [concat] 	at sun.reflect.NativeMethodAccessorImpl.invoke(NativeMethodAccessorImpl.java:62)
~[?:1.8.0_131]
   [concat] 	at sun.reflect.DelegatingMethodAccessorImpl.invoke(DelegatingMethodAccessorImpl.java:43)
~[?:1.8.0_131]
   [concat] 	at java.lang.reflect.Method.invoke(Method.java:498) ~[?:1.8.0_131]
   [concat] 	at org.apache.jmeter.NewDriver.main(NewDriver.java:248) [ApacheJMeter.jar:3.3-SNAPSHOT
r1802998]
   [concat] Caused by: java.net.ConnectException: Connection refused (Connection refused)
   [concat] 	at java.net.PlainSocketImpl.socketConnect(Native Method) ~[?:1.8.0_131]
   [concat] 	at java.net.AbstractPlainSocketImpl.doConnect(AbstractPlainSocketImpl.java:350)
~[?:1.8.0_131]
   [concat] 	at java.net.AbstractPlainSocketImpl.connectToAddress(AbstractPlainSocketImpl.java:206)
~[?:1.8.0_131]
   [concat] 	at java.net.AbstractPlainSocketImpl.connect(AbstractPlainSocketImpl.java:188)
~[?:1.8.0_131]
   [concat] 	at java.net.SocksSocketImpl.connect(SocksSocketImpl.java:392) ~[?:1.8.0_131]
   [concat] 	at java.net.Socket.connect(Socket.java:589) ~[?:1.8.0_131]
   [concat] 	at java.net.Socket.connect(Socket.java:538) ~[?:1.8.0_131]
   [concat] 	at java.net.Socket.<init>(Socket.java:434) ~[?:1.8.0_131]
   [concat] 	at java.net.Socket.<init>(Socket.java:211) ~[?:1.8.0_131]
   [concat] 	at sun.rmi.transport.proxy.RMIDirectSocketFactory.createSocket(RMIDirectSocketFactory.java:40)
~[?:1.8.0_131]
   [concat] 	at sun.rmi.transport.proxy.RMIMasterSocketFactory.createSocket(RMIMasterSocketFactory.java:148)
~[?:1.8.0_131]
   [concat] 	at sun.rmi.transport.tcp.TCPEndpoint.newSocket(TCPEndpoint.java:613) ~[?:1.8.0_131]
   [concat] 	... 18 more
   [concat] 2017-07-25 20:47:43,990 ERROR o.a.j.u.JMeterUtils: Connection refused to host:
localhost; nested exception is: 
   [concat] 	java.net.ConnectException: Connection refused (Connection refused)
   [concat] 2017-07-25 20:47:43,991 ERROR o.a.j.JMeter: Error in NonGUIDriver
   [concat] java.lang.RuntimeException: Following remote engines could not be configured:[localhost:2034]
   [concat] 	at org.apache.jmeter.engine.DistributedRunner.init(DistributedRunner.java:112)
~[ApacheJMeter_core.jar:3.3-SNAPSHOT r1802998]
   [concat] 	at org.apache.jmeter.JMeter.runNonGui(JMeter.java:1003) [ApacheJMeter_core.jar:3.3-SNAPSHOT
r1802998]
   [concat] 	at org.apache.jmeter.JMeter.startNonGui(JMeter.java:910) [ApacheJMeter_core.jar:3.3-SNAPSHOT
r1802998]
   [concat] 	at org.apache.jmeter.JMeter.start(JMeter.java:538) [ApacheJMeter_core.jar:3.3-SNAPSHOT
r1802998]
   [concat] 	at sun.reflect.NativeMethodAccessorImpl.invoke0(Native Method) ~[?:1.8.0_131]
   [concat] 	at sun.reflect.NativeMethodAccessorImpl.invoke(NativeMethodAccessorImpl.java:62)
~[?:1.8.0_131]
   [concat] 	at sun.reflect.DelegatingMethodAccessorImpl.invoke(DelegatingMethodAccessorImpl.java:43)
~[?:1.8.0_131]
   [concat] 	at java.lang.reflect.Method.invoke(Method.java:498) ~[?:1.8.0_131]
   [concat] 	at org.apache.jmeter.NewDriver.main(NewDriver.java:248) [ApacheJMeter.jar:3.3-SNAPSHOT
r1802998]

BUILD FAILED
<https://builds.apache.org/job/JMeter%20Ubuntu/ws/trunk/build.xml>:2472: The following
error occurred while executing this line:
<https://builds.apache.org/job/JMeter%20Ubuntu/ws/trunk/build.xml>:2595: The following
error occurred while executing this line:
<https://builds.apache.org/job/JMeter%20Ubuntu/ws/trunk/build.xml>:2543: Cannot find
output file <https://builds.apache.org/job/JMeter%20Ubuntu/ws/trunk/bin/BatchTestLocal.csv>

Total time: 3 minutes 30 seconds
Build step 'Invoke Ant' marked build as failure
[locks-and-latches] Releasing all the locks
[locks-and-latches] All the locks released

Mime
View raw message