jmeter-dev mailing list archives

Site index · List index
Message view « Date » · « Thread »
Top « Date » · « Thread »
From Apache Jenkins Server <jenk...@builds.apache.org>
Subject Build failed in Jenkins: JMeter-trunk #6189
Date Mon, 03 Jul 2017 19:04:42 GMT
See <https://builds.apache.org/job/JMeter-trunk/6189/display/redirect?page=changes>

Changes:

[fschumacher] Don't use 'here' as a link text.

[fschumacher] Explain the prerequistes to compile JMeter a bit more in detail.

[fschumacher] Try to make it clear, that 'install' is optional.

------------------------------------------
[...truncated 147.24 KB...]
   [jmeter] summary =      1 in 00:00:00 =    3.2/s Avg:   160 Min:   160 Max:   160 Err:
    0 (0.00%)
   [jmeter] Tidying up ...    @ Mon Jul 03 19:02:50 UTC 2017 (1499108570089)
   [jmeter] ... end of run
     [echo] HTMLParserTestFile_2 output files compared OK

batchtest:
     [echo] Starting Bug52310 with file Bug52310.jmx using -X -Jdummy=dummy
   [jmeter] Security framework of XStream not initialized, XStream is probably vulnerable.
   [jmeter] Creating summariser <summary>
   [jmeter] Created the tree successfully using testfiles/Bug52310.jmx
   [jmeter] Starting the test @ Mon Jul 03 19:02:52 UTC 2017 (1499108572473)
   [jmeter] Waiting for possible Shutdown/StopTestNow/Heapdump message on port 4445
   [jmeter] summary =      3 in 00:00:02 =    1.5/s Avg:   461 Min:     9 Max:   943 Err:
    0 (0.00%)
   [jmeter] Tidying up ...    @ Mon Jul 03 19:02:55 UTC 2017 (1499108575134)
   [jmeter] ... end of run
     [echo] Bug52310 output files compared OK

batchtest:
     [echo] Starting Bug52968 with file Bug52968.jmx using -X -Jdummy=dummy
   [jmeter] Security framework of XStream not initialized, XStream is probably vulnerable.
   [jmeter] Creating summariser <summary>
   [jmeter] Created the tree successfully using testfiles/Bug52968.jmx
   [jmeter] Starting the test @ Mon Jul 03 19:02:57 UTC 2017 (1499108577473)
   [jmeter] Waiting for possible Shutdown/StopTestNow/Heapdump message on port 4445
   [jmeter] summary +      9 in 00:00:02 =    4.3/s Avg:   214 Min:   105 Max:   307 Err:
    3 (33.33%) Active: 1 Started: 2 Finished: 1
   [jmeter] summary +     21 in 00:00:10 =    2.1/s Avg:   217 Min:   100 Max:   348 Err:
    6 (28.57%) Active: 0 Started: 10 Finished: 10
   [jmeter] summary =     30 in 00:00:12 =    2.5/s Avg:   216 Min:   100 Max:   348 Err:
    9 (30.00%)
   [jmeter] Tidying up ...    @ Mon Jul 03 19:03:10 UTC 2017 (1499108590227)
   [jmeter] ... end of run
     [echo] Bug52968 output files compared OK

batchtest:
     [echo] Starting Bug50898 with file Bug50898.jmx using -X -Jdummy=dummy
   [jmeter] Security framework of XStream not initialized, XStream is probably vulnerable.
   [jmeter] Creating summariser <summary>
   [jmeter] Created the tree successfully using testfiles/Bug50898.jmx
   [jmeter] Starting the test @ Mon Jul 03 19:03:12 UTC 2017 (1499108592458)
   [jmeter] Waiting for possible Shutdown/StopTestNow/Heapdump message on port 4445
   [jmeter] summary =      2 in 00:00:01 =    2.7/s Avg:   285 Min:   271 Max:   299 Err:
    0 (0.00%)
   [jmeter] Tidying up ...    @ Mon Jul 03 19:03:13 UTC 2017 (1499108593896)
   [jmeter] ... end of run
     [echo] Bug50898 output files compared OK

batchtest:
     [echo] Starting Bug56243 with file Bug56243.jmx using -X -Jdummy=dummy
   [jmeter] Security framework of XStream not initialized, XStream is probably vulnerable.
   [jmeter] Creating summariser <summary>
   [jmeter] Created the tree successfully using testfiles/Bug56243.jmx
   [jmeter] Starting the test @ Mon Jul 03 19:03:16 UTC 2017 (1499108596147)
   [jmeter] Waiting for possible Shutdown/StopTestNow/Heapdump message on port 4445
   [jmeter] summary =      9 in 00:00:00 =   45.9/s Avg:     0 Min:     0 Max:     5 Err:
    0 (0.00%)
   [jmeter] Tidying up ...    @ Mon Jul 03 19:03:16 UTC 2017 (1499108596913)
   [jmeter] ... end of run
     [echo] Bug56243 output files compared OK

batchtest:
     [echo] Starting Bug54685 with file Bug54685.jmx using -X -Jsample_variables=REFERENCE,JSESSIONID
   [jmeter] Security framework of XStream not initialized, XStream is probably vulnerable.
   [jmeter] Creating summariser <summary>
   [jmeter] Created the tree successfully using testfiles/Bug54685.jmx
   [jmeter] Starting the test @ Mon Jul 03 19:03:19 UTC 2017 (1499108599126)
   [jmeter] Waiting for possible Shutdown/StopTestNow/Heapdump message on port 4445
   [jmeter] summary =      1 in 00:00:00 =    3.4/s Avg:   168 Min:   168 Max:   168 Err:
    0 (0.00%)
   [jmeter] Tidying up ...    @ Mon Jul 03 19:03:20 UTC 2017 (1499108600275)
   [jmeter] ... end of run
     [echo] Bug54685 output files compared OK

batchtest:
     [echo] Starting Bug55375 with file Bug55375.jmx using -X -Jdummy=dummy
   [jmeter] Security framework of XStream not initialized, XStream is probably vulnerable.
   [jmeter] Creating summariser <summary>
   [jmeter] Created the tree successfully using testfiles/Bug55375.jmx
   [jmeter] Starting the test @ Mon Jul 03 19:03:22 UTC 2017 (1499108602465)
   [jmeter] Waiting for possible Shutdown/StopTestNow/Heapdump message on port 4445
   [jmeter] summary =      1 in 00:00:00 =    3.5/s Avg:   129 Min:   129 Max:   129 Err:
    0 (0.00%)
   [jmeter] Tidying up ...    @ Mon Jul 03 19:03:23 UTC 2017 (1499108603514)
   [jmeter] ... end of run
     [echo] Bug55375 output files compared OK

batchtestserver:
   [server] Created remote object: UnicastServerRef [liveRef: [endpoint:[67.195.81.186:59547](local),objID:[-48514b90:15d09d5fd56:-7fff,
-6329530543031994831]]]

batchtest:
     [echo] Starting Bug54685 with file Bug54685.jmx using -Rlocalhost:2606 -Jsample_variables=REFERENCE,JSESSIONID
   [client] Security framework of XStream not initialized, XStream is probably vulnerable.
   [client] Creating summariser <summary>
   [client] Created the tree successfully using testfiles/Bug54685.jmx
   [client] Configuring remote engine: localhost:2606
   [client] Starting remote engines
   [client] Starting the test @ Mon Jul 03 19:03:28 UTC 2017 (1499108608098)
   [server] Starting the test on host localhost:2606 @ Mon Jul 03 19:03:30 UTC 2017 (1499108610006)
   [client] Remote engines have been started
   [client] Waiting for possible Shutdown/StopTestNow/Heapdump message on port 4445
   [client] summary +      1 in 00:00:00 =    2.3/s Avg:   281 Min:   281 Max:   281 Err:
    0 (0.00%) Active: 1 Started: 1 Finished: 0
   [client] summary =      1 in 00:00:00 =    2.3/s Avg:   281 Min:   281 Max:   281 Err:
    0 (0.00%)
   [client] Tidying up remote @ Mon Jul 03 19:03:30 UTC 2017 (1499108610987)
   [server] Finished the test on host localhost:2606 @ Mon Jul 03 19:03:30 UTC 2017 (1499108610987)
- exit requested.
   [client] ... end of run
     [echo] Bug54685 output files compared OK

batchtest:
     [echo] Starting Bug56811 with file Bug56811.jmx using -X -Jdummy=dummy
   [jmeter] Security framework of XStream not initialized, XStream is probably vulnerable.
   [jmeter] Creating summariser <summary>
   [jmeter] Created the tree successfully using testfiles/Bug56811.jmx
   [jmeter] Starting the test @ Mon Jul 03 19:03:38 UTC 2017 (1499108618320)
   [jmeter] Waiting for possible Shutdown/StopTestNow/Heapdump message on port 4445
   [jmeter] summary =      9 in 00:00:08 =    1.1/s Avg:   117 Min:     1 Max:   231 Err:
    3 (33.33%)
   [jmeter] Tidying up ...    @ Mon Jul 03 19:03:47 UTC 2017 (1499108627376)
   [jmeter] ... end of run
     [echo] Bug56811 output files compared OK

batchtest:

batchtest:
     [echo] Starting Bug60607 with file Bug60607.jmx using -X -Jdummy=dummy
   [jmeter] Security framework of XStream not initialized, XStream is probably vulnerable.
   [jmeter] Creating summariser <summary>
   [jmeter] Created the tree successfully using testfiles/Bug60607.jmx
   [jmeter] Starting the test @ Mon Jul 03 19:03:49 UTC 2017 (1499108629644)
   [jmeter] Waiting for possible Shutdown/StopTestNow/Heapdump message on port 4445
   [jmeter] summary =      2 in 00:00:31 =    0.1/s Avg: 15244 Min:   409 Max: 30080 Err:
    0 (0.00%)
   [jmeter] Tidying up ...    @ Mon Jul 03 19:04:21 UTC 2017 (1499108661056)
   [jmeter] ... end of run
     [echo] Bug60607 output files compared OK

batchtest:
     [echo] Starting SlowCharsFeature_HttpClient4 with file SlowCharsFeature.jmx using -X
-Jdummy=dummy
   [jmeter] Security framework of XStream not initialized, XStream is probably vulnerable.
   [jmeter] Creating summariser <summary>
   [jmeter] Created the tree successfully using testfiles/SlowCharsFeature.jmx
   [jmeter] Starting the test @ Mon Jul 03 19:04:23 UTC 2017 (1499108663934)
   [jmeter] Waiting for possible Shutdown/StopTestNow/Heapdump message on port 4445
   [jmeter] summary +      2 in 00:00:07 =    0.3/s Avg:  3098 Min:   391 Max:  5806 Err:
    0 (0.00%) Active: 1 Started: 1 Finished: 0
   [jmeter] summary +      1 in 00:00:11 =    0.1/s Avg: 11141 Min: 11141 Max: 11141 Err:
    0 (0.00%) Active: 0 Started: 1 Finished: 1
   [jmeter] summary =      3 in 00:00:18 =    0.2/s Avg:  5779 Min:   391 Max: 11141 Err:
    0 (0.00%)
   [jmeter] Tidying up ...    @ Mon Jul 03 19:04:42 UTC 2017 (1499108682205)
   [jmeter] ... end of run

BUILD FAILED
<https://builds.apache.org/job/JMeter-trunk/ws/trunk/build.xml>:2734: The following
error occurred while executing this line:
<https://builds.apache.org/job/JMeter-trunk/ws/trunk/build.xml>:2624: XML Files are
not identical.
        <https://builds.apache.org/job/JMeter-trunk/ws/trunk/bin/testfiles/SlowCharsFeature_HttpClient4.xml>
        <?xml version="1.0" encoding="UTF-8"?>
<testResults version="1.2">
<sample s="true" lb="JSR223 Sampler" rc="200" rm="OK" tn="setUp Thread Group 1-1" dt="text"
by="0"/>
<httpSample s="true" lb="ApacheJMeter-HP-NonSecure" rc="206" rm="Partial Content" tn="Thread
Group 1-1" dt="text" by="7359">
  <assertionResult>
    <name>RA_206</name>
    <failure>false</failure>
    <error>false</error>
  </assertionResult>
  <assertionResult>
    <name>RA</name>
    <failure>false</failure>
    <error>false</error>
  </assertionResult>
  <assertionResult>
    <name>RA_PartialContent</name>
    <failure>false</failure>
    <error>false</error>
  </assertionResult>
  <assertionResult>
    <name>JSA-CheckResponseTimeHigherThan5s</name>
    <failure>false</failure>
    <error>false</error>
  </assertionResult>
</httpSample>
<httpSample s="true" lb="ApacheJMeter-HP-Secure" rc="206" rm="Partial Content" tn="Thread
Group 1-1" dt="text" by="7359">
  <assertionResult>
    <name>RA_206</name>
    <failure>false</failure>
    <error>false</error>
  </assertionResult>
  <assertionResult>
    <name>RA</name>
    <failure>false</failure>
    <error>false</error>
  </assertionResult>
  <assertionResult>
    <name>RA_PartialContent</name>
    <failure>false</failure>
    <error>false</error>
  </assertionResult>
  <assertionResult>
    <name>JSA-CheckResponseTimeHigherThan5s</name>
    <failure>false</failure>
    <error>false</error>
  </assertionResult>
</httpSample>

</testResults>

        <https://builds.apache.org/job/JMeter-trunk/ws/trunk/bin/SlowCharsFeature_HttpClient4.xml>
        <?xml version="1.0" encoding="UTF-8"?>
<testResults version="1.2">
<sample s="true" lb="JSR223 Sampler" rc="200" rm="OK" tn="setUp Thread Group 1-1" dt="text"
by="0"/>
<httpSample s="true" lb="ApacheJMeter-HP-NonSecure" rc="206" rm="Partial Content" tn="Thread
Group 1-1" dt="text" by="7360">
  <assertionResult>
    <name>RA_206</name>
    <failure>false</failure>
    <error>false</error>
  </assertionResult>
  <assertionResult>
    <name>RA</name>
    <failure>false</failure>
    <error>false</error>
  </assertionResult>
  <assertionResult>
    <name>RA_PartialContent</name>
    <failure>false</failure>
    <error>false</error>
  </assertionResult>
  <assertionResult>
    <name>JSA-CheckResponseTimeHigherThan5s</name>
    <failure>false</failure>
    <error>false</error>
  </assertionResult>
</httpSample>
<httpSample s="true" lb="ApacheJMeter-HP-Secure" rc="206" rm="Partial Content" tn="Thread
Group 1-1" dt="text" by="7360">
  <assertionResult>
    <name>RA_206</name>
    <failure>false</failure>
    <error>false</error>
  </assertionResult>
  <assertionResult>
    <name>RA</name>
    <failure>false</failure>
    <error>false</error>
  </assertionResult>
  <assertionResult>
    <name>RA_PartialContent</name>
    <failure>false</failure>
    <error>false</error>
  </assertionResult>
  <assertionResult>
    <name>JSA-CheckResponseTimeHigherThan5s</name>
    <failure>false</failure>
    <error>false</error>
  </assertionResult>
</httpSample>

</testResults>

Total time: 7 minutes 10 seconds
Build step 'Invoke Ant' marked build as failure
[locks-and-latches] Releasing all the locks
[locks-and-latches] All the locks released
Archiving artifacts

Mime
View raw message