jmeter-dev mailing list archives

Site index · List index
Message view « Date » · « Thread »
Top « Date » · « Thread »
From Apache Jenkins Server <jenk...@builds.apache.org>
Subject Build failed in Jenkins: JMeter-trunk #6190
Date Mon, 03 Jul 2017 20:04:13 GMT
See <https://builds.apache.org/job/JMeter-trunk/6190/display/redirect?page=changes>

Changes:

[fschumacher] Be consistent in writing Ant (and try to trigger a build)

------------------------------------------
[...truncated 147.21 KB...]
   [jmeter] summary =      1 in 00:00:00 =    3.6/s Avg:   118 Min:   118 Max:   118 Err:
    0 (0.00%)
   [jmeter] Tidying up ...    @ Mon Jul 03 20:02:21 UTC 2017 (1499112141155)
   [jmeter] ... end of run
     [echo] HTMLParserTestFile_2 output files compared OK

batchtest:
     [echo] Starting Bug52310 with file Bug52310.jmx using -X -Jdummy=dummy
   [jmeter] Security framework of XStream not initialized, XStream is probably vulnerable.
   [jmeter] Creating summariser <summary>
   [jmeter] Created the tree successfully using testfiles/Bug52310.jmx
   [jmeter] Starting the test @ Mon Jul 03 20:02:23 UTC 2017 (1499112143417)
   [jmeter] Waiting for possible Shutdown/StopTestNow/Heapdump message on port 4445
   [jmeter] summary =      3 in 00:00:02 =    1.5/s Avg:   458 Min:    10 Max:   936 Err:
    0 (0.00%)
   [jmeter] Tidying up ...    @ Mon Jul 03 20:02:25 UTC 2017 (1499112145930)
   [jmeter] ... end of run
     [echo] Bug52310 output files compared OK

batchtest:
     [echo] Starting Bug52968 with file Bug52968.jmx using -X -Jdummy=dummy
   [jmeter] Security framework of XStream not initialized, XStream is probably vulnerable.
   [jmeter] Creating summariser <summary>
   [jmeter] Created the tree successfully using testfiles/Bug52968.jmx
   [jmeter] Starting the test @ Mon Jul 03 20:02:28 UTC 2017 (1499112148197)
   [jmeter] Waiting for possible Shutdown/StopTestNow/Heapdump message on port 4445
   [jmeter] summary +      6 in 00:00:01 =    4.5/s Avg:   193 Min:   105 Max:   339 Err:
    0 (0.00%) Active: 1 Started: 1 Finished: 0
   [jmeter] summary +     24 in 00:00:11 =    2.3/s Avg:   226 Min:   106 Max:   349 Err:
    9 (37.50%) Active: 0 Started: 10 Finished: 10
   [jmeter] summary =     30 in 00:00:12 =    2.5/s Avg:   219 Min:   105 Max:   349 Err:
    9 (30.00%)
   [jmeter] Tidying up ...    @ Mon Jul 03 20:02:40 UTC 2017 (1499112160723)
   [jmeter] ... end of run
     [echo] Bug52968 output files compared OK

batchtest:
     [echo] Starting Bug50898 with file Bug50898.jmx using -X -Jdummy=dummy
   [jmeter] Security framework of XStream not initialized, XStream is probably vulnerable.
   [jmeter] Creating summariser <summary>
   [jmeter] Created the tree successfully using testfiles/Bug50898.jmx
   [jmeter] Starting the test @ Mon Jul 03 20:02:42 UTC 2017 (1499112162907)
   [jmeter] Waiting for possible Shutdown/StopTestNow/Heapdump message on port 4445
   [jmeter] summary =      2 in 00:00:01 =    3.1/s Avg:   248 Min:   160 Max:   336 Err:
    0 (0.00%)
   [jmeter] Tidying up ...    @ Mon Jul 03 20:02:44 UTC 2017 (1499112164225)
   [jmeter] ... end of run
     [echo] Bug50898 output files compared OK

batchtest:
     [echo] Starting Bug56243 with file Bug56243.jmx using -X -Jdummy=dummy
   [jmeter] Security framework of XStream not initialized, XStream is probably vulnerable.
   [jmeter] Creating summariser <summary>
   [jmeter] Created the tree successfully using testfiles/Bug56243.jmx
   [jmeter] Starting the test @ Mon Jul 03 20:02:46 UTC 2017 (1499112166404)
   [jmeter] Waiting for possible Shutdown/StopTestNow/Heapdump message on port 4445
   [jmeter] summary =      9 in 00:00:00 =   30.3/s Avg:     0 Min:     0 Max:     5 Err:
    0 (0.00%)
   [jmeter] Tidying up ...    @ Mon Jul 03 20:02:47 UTC 2017 (1499112167254)
   [jmeter] ... end of run
     [echo] Bug56243 output files compared OK

batchtest:
     [echo] Starting Bug54685 with file Bug54685.jmx using -X -Jsample_variables=REFERENCE,JSESSIONID
   [jmeter] Security framework of XStream not initialized, XStream is probably vulnerable.
   [jmeter] Creating summariser <summary>
   [jmeter] Created the tree successfully using testfiles/Bug54685.jmx
   [jmeter] Starting the test @ Mon Jul 03 20:02:49 UTC 2017 (1499112169402)
   [jmeter] Waiting for possible Shutdown/StopTestNow/Heapdump message on port 4445
   [jmeter] summary =      1 in 00:00:00 =    2.6/s Avg:   237 Min:   237 Max:   237 Err:
    0 (0.00%)
   [jmeter] Tidying up ...    @ Mon Jul 03 20:02:50 UTC 2017 (1499112170412)
   [jmeter] ... end of run
     [echo] Bug54685 output files compared OK

batchtest:
     [echo] Starting Bug55375 with file Bug55375.jmx using -X -Jdummy=dummy
   [jmeter] Security framework of XStream not initialized, XStream is probably vulnerable.
   [jmeter] Creating summariser <summary>
   [jmeter] Created the tree successfully using testfiles/Bug55375.jmx
   [jmeter] Starting the test @ Mon Jul 03 20:02:52 UTC 2017 (1499112172610)
   [jmeter] Waiting for possible Shutdown/StopTestNow/Heapdump message on port 4445
   [jmeter] summary =      1 in 00:00:00 =    2.4/s Avg:   197 Min:   197 Max:   197 Err:
    0 (0.00%)
   [jmeter] Tidying up ...    @ Mon Jul 03 20:02:53 UTC 2017 (1499112173648)
   [jmeter] ... end of run
     [echo] Bug55375 output files compared OK

batchtestserver:
   [server] Created remote object: UnicastServerRef [liveRef: [endpoint:[67.195.81.186:55042](local),objID:[-32486feb:15d0a0c770a:-7fff,
4199562724001785729]]]

batchtest:
     [echo] Starting Bug54685 with file Bug54685.jmx using -Rlocalhost:2611 -Jsample_variables=REFERENCE,JSESSIONID
   [client] Security framework of XStream not initialized, XStream is probably vulnerable.
   [client] Creating summariser <summary>
   [client] Created the tree successfully using testfiles/Bug54685.jmx
   [client] Configuring remote engine: localhost:2611
   [client] Starting remote engines
   [client] Starting the test @ Mon Jul 03 20:02:58 UTC 2017 (1499112178071)
   [server] Starting the test on host localhost:2611 @ Mon Jul 03 20:02:59 UTC 2017 (1499112179633)
   [client] Remote engines have been started
   [client] Waiting for possible Shutdown/StopTestNow/Heapdump message on port 4445
   [server] Finished the test on host localhost:2611 @ Mon Jul 03 20:03:00 UTC 2017 (1499112180491)
- exit requested.
   [client] summary +      1 in 00:00:00 =    2.8/s Avg:   152 Min:   152 Max:   152 Err:
    0 (0.00%) Active: 1 Started: 1 Finished: 0
   [client] summary =      1 in 00:00:00 =    2.8/s Avg:   152 Min:   152 Max:   152 Err:
    0 (0.00%)
   [client] Tidying up remote @ Mon Jul 03 20:03:00 UTC 2017 (1499112180491)
   [client] ... end of run
     [echo] Bug54685 output files compared OK

batchtest:
     [echo] Starting Bug56811 with file Bug56811.jmx using -X -Jdummy=dummy
   [jmeter] Security framework of XStream not initialized, XStream is probably vulnerable.
   [jmeter] Creating summariser <summary>
   [jmeter] Created the tree successfully using testfiles/Bug56811.jmx
   [jmeter] Starting the test @ Mon Jul 03 20:03:07 UTC 2017 (1499112187799)
   [jmeter] Waiting for possible Shutdown/StopTestNow/Heapdump message on port 4445
   [jmeter] summary =      9 in 00:00:10 =    0.9/s Avg:   136 Min:     0 Max:   311 Err:
    3 (33.33%)
   [jmeter] Tidying up ...    @ Mon Jul 03 20:03:18 UTC 2017 (1499112198101)
   [jmeter] ... end of run
     [echo] Bug56811 output files compared OK

batchtest:

batchtest:
     [echo] Starting Bug60607 with file Bug60607.jmx using -X -Jdummy=dummy
   [jmeter] Security framework of XStream not initialized, XStream is probably vulnerable.
   [jmeter] Creating summariser <summary>
   [jmeter] Created the tree successfully using testfiles/Bug60607.jmx
   [jmeter] Starting the test @ Mon Jul 03 20:03:20 UTC 2017 (1499112200349)
   [jmeter] Waiting for possible Shutdown/StopTestNow/Heapdump message on port 4445
   [jmeter] summary =      2 in 00:00:31 =    0.1/s Avg: 15232 Min:   386 Max: 30079 Err:
    0 (0.00%)
   [jmeter] Tidying up ...    @ Mon Jul 03 20:03:51 UTC 2017 (1499112231664)
   [jmeter] ... end of run
     [echo] Bug60607 output files compared OK

batchtest:
     [echo] Starting SlowCharsFeature_HttpClient4 with file SlowCharsFeature.jmx using -X
-Jdummy=dummy
   [jmeter] Security framework of XStream not initialized, XStream is probably vulnerable.
   [jmeter] Creating summariser <summary>
   [jmeter] Created the tree successfully using testfiles/SlowCharsFeature.jmx
   [jmeter] Starting the test @ Mon Jul 03 20:03:54 UTC 2017 (1499112234135)
   [jmeter] Waiting for possible Shutdown/StopTestNow/Heapdump message on port 4445
   [jmeter] summary +      2 in 00:00:07 =    0.3/s Avg:  3094 Min:   382 Max:  5807 Err:
    0 (0.00%) Active: 1 Started: 1 Finished: 0
   [jmeter] summary +      1 in 00:00:11 =    0.1/s Avg: 11140 Min: 11140 Max: 11140 Err:
    0 (0.00%) Active: 0 Started: 1 Finished: 1
   [jmeter] summary =      3 in 00:00:18 =    0.2/s Avg:  5776 Min:   382 Max: 11140 Err:
    0 (0.00%)
   [jmeter] Tidying up ...    @ Mon Jul 03 20:04:12 UTC 2017 (1499112252387)
   [jmeter] ... end of run

BUILD FAILED
<https://builds.apache.org/job/JMeter-trunk/ws/trunk/build.xml>:2734: The following
error occurred while executing this line:
<https://builds.apache.org/job/JMeter-trunk/ws/trunk/build.xml>:2624: XML Files are
not identical.
        <https://builds.apache.org/job/JMeter-trunk/ws/trunk/bin/testfiles/SlowCharsFeature_HttpClient4.xml>
        <?xml version="1.0" encoding="UTF-8"?>
<testResults version="1.2">
<sample s="true" lb="JSR223 Sampler" rc="200" rm="OK" tn="setUp Thread Group 1-1" dt="text"
by="0"/>
<httpSample s="true" lb="ApacheJMeter-HP-NonSecure" rc="206" rm="Partial Content" tn="Thread
Group 1-1" dt="text" by="7359">
  <assertionResult>
    <name>RA_206</name>
    <failure>false</failure>
    <error>false</error>
  </assertionResult>
  <assertionResult>
    <name>RA</name>
    <failure>false</failure>
    <error>false</error>
  </assertionResult>
  <assertionResult>
    <name>RA_PartialContent</name>
    <failure>false</failure>
    <error>false</error>
  </assertionResult>
  <assertionResult>
    <name>JSA-CheckResponseTimeHigherThan5s</name>
    <failure>false</failure>
    <error>false</error>
  </assertionResult>
</httpSample>
<httpSample s="true" lb="ApacheJMeter-HP-Secure" rc="206" rm="Partial Content" tn="Thread
Group 1-1" dt="text" by="7359">
  <assertionResult>
    <name>RA_206</name>
    <failure>false</failure>
    <error>false</error>
  </assertionResult>
  <assertionResult>
    <name>RA</name>
    <failure>false</failure>
    <error>false</error>
  </assertionResult>
  <assertionResult>
    <name>RA_PartialContent</name>
    <failure>false</failure>
    <error>false</error>
  </assertionResult>
  <assertionResult>
    <name>JSA-CheckResponseTimeHigherThan5s</name>
    <failure>false</failure>
    <error>false</error>
  </assertionResult>
</httpSample>

</testResults>

        <https://builds.apache.org/job/JMeter-trunk/ws/trunk/bin/SlowCharsFeature_HttpClient4.xml>
        <?xml version="1.0" encoding="UTF-8"?>
<testResults version="1.2">
<sample s="true" lb="JSR223 Sampler" rc="200" rm="OK" tn="setUp Thread Group 1-1" dt="text"
by="0"/>
<httpSample s="true" lb="ApacheJMeter-HP-NonSecure" rc="206" rm="Partial Content" tn="Thread
Group 1-1" dt="text" by="7360">
  <assertionResult>
    <name>RA_206</name>
    <failure>false</failure>
    <error>false</error>
  </assertionResult>
  <assertionResult>
    <name>RA</name>
    <failure>false</failure>
    <error>false</error>
  </assertionResult>
  <assertionResult>
    <name>RA_PartialContent</name>
    <failure>false</failure>
    <error>false</error>
  </assertionResult>
  <assertionResult>
    <name>JSA-CheckResponseTimeHigherThan5s</name>
    <failure>false</failure>
    <error>false</error>
  </assertionResult>
</httpSample>
<httpSample s="true" lb="ApacheJMeter-HP-Secure" rc="206" rm="Partial Content" tn="Thread
Group 1-1" dt="text" by="7360">
  <assertionResult>
    <name>RA_206</name>
    <failure>false</failure>
    <error>false</error>
  </assertionResult>
  <assertionResult>
    <name>RA</name>
    <failure>false</failure>
    <error>false</error>
  </assertionResult>
  <assertionResult>
    <name>RA_PartialContent</name>
    <failure>false</failure>
    <error>false</error>
  </assertionResult>
  <assertionResult>
    <name>JSA-CheckResponseTimeHigherThan5s</name>
    <failure>false</failure>
    <error>false</error>
  </assertionResult>
</httpSample>

</testResults>

Total time: 6 minutes 48 seconds
Build step 'Invoke Ant' marked build as failure
[locks-and-latches] Releasing all the locks
[locks-and-latches] All the locks released
Archiving artifacts

Mime
View raw message