jmeter-dev mailing list archives

Site index · List index
Message view « Date » · « Thread »
Top « Date » · « Thread »
From Apache Jenkins Server <jenk...@builds.apache.org>
Subject Build failed in Jenkins: JMeter-trunk #6270
Date Fri, 01 Sep 2017 13:17:50 GMT
See <https://builds.apache.org/job/JMeter-trunk/6270/display/redirect>

------------------------------------------
[...truncated 483.19 KB...]
  [javadoc] Loading source files for package org.apache.jmeter.extractor.json.jsonpath.gui...
  [javadoc] Loading source files for package org.apache.jmeter.extractor.json.render...
  [javadoc] Loading source files for package org.apache.jmeter.modifiers...
  [javadoc] Loading source files for package org.apache.jmeter.modifiers.gui...
  [javadoc] Loading source files for package org.apache.jmeter.sampler...
  [javadoc] Loading source files for package org.apache.jmeter.sampler.gui...
  [javadoc] Loading source files for package org.apache.jmeter.thinktime...
  [javadoc] Loading source files for package org.apache.jmeter.validation...
  [javadoc] Loading source files for package org.apache.jmeter.visualizers.backend.graphite...
  [javadoc] Loading source files for package org.apache.jmeter.visualizers.backend.influxdb...
  [javadoc] Loading source files for package org.apache.jmeter.visualizers.utils...
  [javadoc] Loading source files for package org.apache.jmeter.protocol.http.config...
  [javadoc] Loading source files for package org.apache.jmeter.protocol.http.config.gui...
  [javadoc] Loading source files for package org.apache.jmeter.protocol.http.control...
  [javadoc] Loading source files for package org.apache.jmeter.protocol.http.control.gui...
  [javadoc] Loading source files for package org.apache.jmeter.protocol.http.gui...
  [javadoc] Loading source files for package org.apache.jmeter.protocol.http.modifier...
  [javadoc] Loading source files for package org.apache.jmeter.protocol.http.modifier.gui...
  [javadoc] Loading source files for package org.apache.jmeter.protocol.http.parser...
  [javadoc] Loading source files for package org.apache.jmeter.protocol.http.proxy...
  [javadoc] Loading source files for package org.apache.jmeter.protocol.http.proxy.gui...
  [javadoc] Loading source files for package org.apache.jmeter.protocol.http.sampler...
  [javadoc] Loading source files for package org.apache.jmeter.protocol.http.sampler.hc...
  [javadoc] Loading source files for package org.apache.jmeter.protocol.http.util...
  [javadoc] Loading source files for package org.apache.jmeter.protocol.http.util.accesslog...
  [javadoc] Loading source files for package org.apache.jmeter.protocol.http.visualizers...
  [javadoc] Loading source files for package org.apache.jmeter.protocol.ftp.config.gui...
  [javadoc] Loading source files for package org.apache.jmeter.protocol.ftp.control.gui...
  [javadoc] Loading source files for package org.apache.jmeter.protocol.ftp.sampler...
  [javadoc] Loading source files for package org.apache.jmeter.protocol.jdbc...
  [javadoc] Loading source files for package org.apache.jmeter.protocol.jdbc.config...
  [javadoc] Loading source files for package org.apache.jmeter.protocol.jdbc.processor...
  [javadoc] Loading source files for package org.apache.jmeter.protocol.jdbc.sampler...
  [javadoc] Loading source files for package org.apache.jmeter.protocol.java.config...
  [javadoc] Loading source files for package org.apache.jmeter.protocol.java.config.gui...
  [javadoc] Loading source files for package org.apache.jmeter.protocol.java.control.gui...
  [javadoc] Loading source files for package org.apache.jmeter.protocol.java.sampler...
  [javadoc] Loading source files for package org.apache.jmeter.protocol.java.test...
  [javadoc] Loading source files for package org.apache.jorphan.collections...
  [javadoc] Loading source files for package org.apache.jorphan.exec...
  [javadoc] Loading source files for package org.apache.jorphan.gui...
  [javadoc] Loading source files for package org.apache.jorphan.gui.layout...
  [javadoc] Loading source files for package org.apache.jorphan.io...
  [javadoc] Loading source files for package org.apache.jorphan.logging...
  [javadoc] Loading source files for package org.apache.jorphan.math...
  [javadoc] Loading source files for package org.apache.jorphan.reflect...
  [javadoc] Loading source files for package org.apache.jorphan.test...
  [javadoc] Loading source files for package org.apache.jorphan.util...
  [javadoc] Loading source files for package org.apache.jmeter.protocol.ldap.config.gui...
  [javadoc] Loading source files for package org.apache.jmeter.protocol.ldap.control.gui...
  [javadoc] Loading source files for package org.apache.jmeter.protocol.ldap.sampler...
  [javadoc] Loading source files for package org.apache.jmeter.protocol.tcp.config.gui...
  [javadoc] Loading source files for package org.apache.jmeter.protocol.tcp.control.gui...
  [javadoc] Loading source files for package org.apache.jmeter.protocol.tcp.sampler...
  [javadoc] Loading source files for package org.apache.jmeter.examples.sampler...
  [javadoc] Loading source files for package org.apache.jmeter.examples.sampler.gui...
  [javadoc] Loading source files for package org.apache.jmeter.examples.testbeans.example1...
  [javadoc] Loading source files for package org.apache.jmeter.examples.testbeans.example2...
  [javadoc] Loading source files for package org.apache.jmeter.examples.testbeans.example3...
  [javadoc] Loading source files for package org.apache.jmeter.protocol.mail.sampler...
  [javadoc] Loading source files for package org.apache.jmeter.protocol.mail.sampler.gui...
  [javadoc] Loading source files for package org.apache.jmeter.protocol.smtp.sampler...
  [javadoc] Loading source files for package org.apache.jmeter.protocol.smtp.sampler.gui...
  [javadoc] Loading source files for package org.apache.jmeter.protocol.smtp.sampler.protocol...
  [javadoc] Loading source files for package org.apache.jmeter.protocol.jms...
  [javadoc] Loading source files for package org.apache.jmeter.protocol.jms.client...
  [javadoc] Loading source files for package org.apache.jmeter.protocol.jms.control.gui...
  [javadoc] Loading source files for package org.apache.jmeter.protocol.jms.sampler...
  [javadoc] Loading source files for package org.apache.jmeter.protocol.jms.sampler.render...
  [javadoc] Loading source files for package org.apache.jmeter.protocol.system...
  [javadoc] Loading source files for package org.apache.jmeter.protocol.system.gui...
  [javadoc] Loading source files for package org.apache.jmeter.protocol.mongodb.config...
  [javadoc] Loading source files for package org.apache.jmeter.protocol.mongodb.mongo...
  [javadoc] Loading source files for package org.apache.jmeter.protocol.mongodb.sampler...
  [javadoc] Constructing Javadoc information...
  [javadoc] Standard Doclet version 1.8.0_144
  [javadoc] Building tree for all the packages and classes...
  [javadoc] Building index for all the packages and classes...
  [javadoc] Building index for all classes...

compile-tests:
    [mkdir] Created dir: <https://builds.apache.org/job/JMeter-trunk/ws/trunk/build/test>
    [javac] Compiling 185 source files to <https://builds.apache.org/job/JMeter-trunk/ws/trunk/build/test>
    [javac] Note: Some input files use or override a deprecated API.
    [javac] Note: Recompile with -Xlint:deprecation for details.

_test:
     [echo] 
     [echo]    gump.run = false
     [echo]    java.awt.headless = true
     [echo]    test.headless = true
     [echo]    user.dir = <https://builds.apache.org/job/JMeter-trunk/ws/trunk>
     [echo]    basedir = <https://builds.apache.org/job/JMeter-trunk/ws/trunk>
     [echo]    test dir = build/test
     [echo]    test dir gump = build/test
     [echo]    testsaveservice.saveout = ${testsaveservice.saveout}
     [echo]    test.encoding = UTF-8
     [echo]     
     [java] Setting JMeterHome: <https://builds.apache.org/job/JMeter-trunk/ws/trunk>
     [java] Using initializeProperties() from org.apache.jmeter.util.JMeterUtils
     [java] Setting up initial properties using: <https://builds.apache.org/job/JMeter-trunk/ws/trunk/bin/jmeter.properties>
     [java] Initializing Properties: <https://builds.apache.org/job/JMeter-trunk/ws/trunk/bin/jmeter.properties>
     [java] JMeterVersion=r1806927
     [java] java.version=1.8.0_144
     [java] java.home=/usr/local/asfpackages/java/jdk1.8.0_144/jre
     [java] file.encoding=UTF-8
     [java] default encoding=UTF-8
     [java] user.dir=<https://builds.apache.org/job/JMeter-trunk/ws/trunk/bin>
     [java] Locale=en_US
     [java] os.name=Linux
     [java] os.version=4.8.3-std-1
     [java] JCE max key length = 128
     [java] +++++++++++
     [java] java.awt.headless=true
     [java] java.awt.graphicsenv=sun.awt.X11GraphicsEnvironment
     [java] ------------
     [java] Searching junit tests in : build/test
     [java] o.a.j.junit.JMeterTest INFO: JMeterGUIComponent: skipping some tests org.apache.jmeter.testbeans.gui.TestBeanGUI
     [java] o.a.j.junit.JMeterTest Error creating org.apache.jmeter.SplashScreen java.awt.HeadlessException
     [java] o.a.j.junit.JMeterTest Error creating org.apache.jmeter.config.gui.RowDetailDialog
java.awt.HeadlessException
     [java] o.a.j.junit.JMeterTest Error creating org.apache.jmeter.functions.gui.FunctionHelper
java.awt.HeadlessException
     [java] o.a.j.junit.JMeterTest Error creating org.apache.jmeter.gui.MainFrame java.awt.HeadlessException
     [java] o.a.j.junit.JMeterTest Error creating org.apache.jmeter.gui.SavePropertyDialog
java.awt.HeadlessException
     [java] o.a.j.junit.JMeterTest Error creating org.apache.jmeter.gui.action.SearchTreeDialog
java.awt.HeadlessException
     [java] o.a.j.junit.JMeterTest Error creating org.apache.jmeter.gui.action.SelectTemplatesDialog
java.awt.HeadlessException
     [java] o.a.j.junit.JMeterTest Error creating org.apache.jmeter.gui.util.EscapeDialog
java.awt.HeadlessException
     [java] o.a.j.junit.JMeterTest Error creating org.apache.jmeter.gui.util.JSyntaxTextArea
java.awt.HeadlessException
     [java] java.rmi.server.hostname=null
     [java] qnode1/127.0.1.1
     [java] isSiteLocalAddress:false
     [java] isAnyLocalAddress:false
     [java] isLinkLocalAddress:false
     [java] isLoopbackAddress:true
     [java] isMulticastAddress:false
     [java] localhost/127.0.0.1
     [java] isSiteLocalAddress:false
     [java] isAnyLocalAddress:false
     [java] isLinkLocalAddress:false
     [java] isLoopbackAddress:true
     [java] isMulticastAddress:false
     [java] ====================
     [java] qnode1/127.0.1.1
     [java] isSiteLocalAddress:false
     [java] isAnyLocalAddress:false
     [java] isLinkLocalAddress:false
     [java] isLoopbackAddress:true
     [java] isMulticastAddress:false
     [java] Security framework of XStream not initialized, XStream is probably vulnerable.
     [java] Security framework of XStream not initialized, XStream is probably vulnerable.
     [java] Security framework of XStream not initialized, XStream is probably vulnerable.
     [java] Security framework of XStream not initialized, XStream is probably vulnerable.
     [java] ....................................................................................................................I......................................................................................................................................................................................................................................................................................................................................................................................................................................................................................................................................................................................................................................................................................................................................................................................................................................................................................................................................................................................................................................................................................................................................................................................................................................................................................................................................................................................................................................................................................................................................................................................................................................................................................................................................................................................................................................................................................................................................................................................................................................................................................................................................................................................................................................................................................................................................................................................................................................................................................................................................................................................................................................................................................................................................................................................................................................II.........................................................................
     [java] Time: 86.117
     [java] 
     [java] OK (2915 tests)
     [java] 

batchtest:
     [echo] Starting BatchTestLocal with file BatchTestLocal.jmx using -X -Jdummy=dummy
   [jmeter] Creating summariser <summary>
   [jmeter] Created the tree successfully using testfiles/BatchTestLocal.jmx
   [jmeter] Starting the test @ Fri Sep 01 13:16:52 UTC 2017 (1504271812970)
   [jmeter] Waiting for possible Shutdown/StopTestNow/Heapdump message on port 4445
   [jmeter] summary +     42 in 00:00:06 =    6.8/s Avg:   130 Min:     8 Max:   234 Err:
    4 (9.52%) Active: 1 Started: 1 Finished: 0
   [jmeter] summary +     13 in 00:00:34 =    0.4/s Avg:   146 Min:    40 Max:   240 Err:
    4 (30.77%) Active: 1 Started: 2 Finished: 1
   [jmeter] summary =     55 in 00:00:41 =    1.4/s Avg:   134 Min:     8 Max:   240 Err:
    8 (14.55%)
   [jmeter] summary +     78 in 00:00:08 =    9.8/s Avg:    97 Min:     1 Max:   255 Err:
    8 (10.26%) Active: 0 Started: 1 Finished: 1
   [jmeter] summary =    133 in 00:00:49 =    2.7/s Avg:   112 Min:     1 Max:   255 Err:
   16 (12.03%)
   [jmeter] Tidying up ...    @ Fri Sep 01 13:17:42 UTC 2017 (1504271862343)
   [jmeter] ... end of run
     [echo] BatchTestLocal output files compared OK

batchtestserver:

batchtest:
     [echo] Starting BatchTestLocal with file BatchTestLocal.jmx using -Rlocalhost:2752 -Jdummy=dummy
   [server] Created remote object: UnicastServerRef [liveRef: [endpoint:[127.0.1.1:33863](local),objID:[7422a449:15e3d971660:-7fff,
2759544307146756166]]]
   [server] An error occurred: Cannot start. qnode1 is a loopback address.
   [server] Server failed to start: java.rmi.RemoteException: Cannot start. qnode1 is a loopback
address.
   [server] Java Result: 1
   [client] Creating summariser <summary>
   [client] Created the tree successfully using testfiles/BatchTestLocal.jmx
   [client] Configuring remote engine: localhost:2752
   [client] Connection refused to host: localhost; nested exception is: 
   [client] 	java.net.ConnectException: Connection refused (Connection refused)
   [client] Failed to configure localhost:2752
   [client] Stopping remote engines
   [client] Remote engines have been stopped
   [client] Error in NonGUIDriver java.lang.RuntimeException: Following remote engines could
not be configured:[localhost:2752]
   [concat] 2017-09-01 13:17:49,946 ERROR o.a.j.e.DistributedRunner: Failed to create engine
at localhost:2752
   [concat] java.rmi.ConnectException: Connection refused to host: localhost; nested exception
is: 
   [concat] 	java.net.ConnectException: Connection refused (Connection refused)
   [concat] 	at sun.rmi.transport.tcp.TCPEndpoint.newSocket(TCPEndpoint.java:619) ~[?:1.8.0_144]
   [concat] 	at sun.rmi.transport.tcp.TCPChannel.createConnection(TCPChannel.java:216) ~[?:1.8.0_144]
   [concat] 	at sun.rmi.transport.tcp.TCPChannel.newConnection(TCPChannel.java:202) ~[?:1.8.0_144]
   [concat] 	at sun.rmi.server.UnicastRef.newCall(UnicastRef.java:338) ~[?:1.8.0_144]
   [concat] 	at sun.rmi.registry.RegistryImpl_Stub.lookup(RegistryImpl_Stub.java:112) ~[?:1.8.0_144]
   [concat] 	at java.rmi.Naming.lookup(Naming.java:101) ~[?:1.8.0_144]
   [concat] 	at org.apache.jmeter.engine.ClientJMeterEngine.getEngine(ClientJMeterEngine.java:54)
~[ApacheJMeter_core.jar:r1806927]
   [concat] 	at org.apache.jmeter.engine.ClientJMeterEngine.<init>(ClientJMeterEngine.java:67)
~[ApacheJMeter_core.jar:r1806927]
   [concat] 	at org.apache.jmeter.engine.DistributedRunner.createEngine(DistributedRunner.java:237)
~[ApacheJMeter_core.jar:r1806927]
   [concat] 	at org.apache.jmeter.engine.DistributedRunner.getClientEngine(DistributedRunner.java:213)
[ApacheJMeter_core.jar:r1806927]
   [concat] 	at org.apache.jmeter.engine.DistributedRunner.init(DistributedRunner.java:93)
[ApacheJMeter_core.jar:r1806927]
   [concat] 	at org.apache.jmeter.JMeter.runNonGui(JMeter.java:1003) [ApacheJMeter_core.jar:r1806927]
   [concat] 	at org.apache.jmeter.JMeter.startNonGui(JMeter.java:910) [ApacheJMeter_core.jar:r1806927]
   [concat] 	at org.apache.jmeter.JMeter.start(JMeter.java:538) [ApacheJMeter_core.jar:r1806927]
   [concat] 	at sun.reflect.NativeMethodAccessorImpl.invoke0(Native Method) ~[?:1.8.0_144]
   [concat] 	at sun.reflect.NativeMethodAccessorImpl.invoke(NativeMethodAccessorImpl.java:62)
~[?:1.8.0_144]
   [concat] 	at sun.reflect.DelegatingMethodAccessorImpl.invoke(DelegatingMethodAccessorImpl.java:43)
~[?:1.8.0_144]
   [concat] 	at java.lang.reflect.Method.invoke(Method.java:498) ~[?:1.8.0_144]
   [concat] 	at org.apache.jmeter.NewDriver.main(NewDriver.java:248) [ApacheJMeter.jar:r1806927]
   [concat] Caused by: java.net.ConnectException: Connection refused (Connection refused)
   [concat] 	at java.net.PlainSocketImpl.socketConnect(Native Method) ~[?:1.8.0_144]
   [concat] 	at java.net.AbstractPlainSocketImpl.doConnect(AbstractPlainSocketImpl.java:350)
~[?:1.8.0_144]
   [concat] 	at java.net.AbstractPlainSocketImpl.connectToAddress(AbstractPlainSocketImpl.java:206)
~[?:1.8.0_144]
   [concat] 	at java.net.AbstractPlainSocketImpl.connect(AbstractPlainSocketImpl.java:188)
~[?:1.8.0_144]
   [concat] 	at java.net.SocksSocketImpl.connect(SocksSocketImpl.java:392) ~[?:1.8.0_144]
   [concat] 	at java.net.Socket.connect(Socket.java:589) ~[?:1.8.0_144]
   [concat] 	at java.net.Socket.connect(Socket.java:538) ~[?:1.8.0_144]
   [concat] 	at java.net.Socket.<init>(Socket.java:434) ~[?:1.8.0_144]
   [concat] 	at java.net.Socket.<init>(Socket.java:211) ~[?:1.8.0_144]
   [concat] 	at sun.rmi.transport.proxy.RMIDirectSocketFactory.createSocket(RMIDirectSocketFactory.java:40)
~[?:1.8.0_144]
   [concat] 	at sun.rmi.transport.proxy.RMIMasterSocketFactory.createSocket(RMIMasterSocketFactory.java:148)
~[?:1.8.0_144]
   [concat] 	at sun.rmi.transport.tcp.TCPEndpoint.newSocket(TCPEndpoint.java:613) ~[?:1.8.0_144]
   [concat] 	... 18 more
   [concat] 2017-09-01 13:17:49,961 ERROR o.a.j.u.JMeterUtils: Connection refused to host:
localhost; nested exception is: 
   [concat] 	java.net.ConnectException: Connection refused (Connection refused)
   [concat] 2017-09-01 13:17:49,962 ERROR o.a.j.JMeter: Error in NonGUIDriver
   [concat] java.lang.RuntimeException: Following remote engines could not be configured:[localhost:2752]
   [concat] 	at org.apache.jmeter.engine.DistributedRunner.init(DistributedRunner.java:112)
~[ApacheJMeter_core.jar:r1806927]
   [concat] 	at org.apache.jmeter.JMeter.runNonGui(JMeter.java:1003) [ApacheJMeter_core.jar:r1806927]
   [concat] 	at org.apache.jmeter.JMeter.startNonGui(JMeter.java:910) [ApacheJMeter_core.jar:r1806927]
   [concat] 	at org.apache.jmeter.JMeter.start(JMeter.java:538) [ApacheJMeter_core.jar:r1806927]
   [concat] 	at sun.reflect.NativeMethodAccessorImpl.invoke0(Native Method) ~[?:1.8.0_144]
   [concat] 	at sun.reflect.NativeMethodAccessorImpl.invoke(NativeMethodAccessorImpl.java:62)
~[?:1.8.0_144]
   [concat] 	at sun.reflect.DelegatingMethodAccessorImpl.invoke(DelegatingMethodAccessorImpl.java:43)
~[?:1.8.0_144]
   [concat] 	at java.lang.reflect.Method.invoke(Method.java:498) ~[?:1.8.0_144]
   [concat] 	at org.apache.jmeter.NewDriver.main(NewDriver.java:248) [ApacheJMeter.jar:r1806927]

BUILD FAILED
<https://builds.apache.org/job/JMeter-trunk/ws/trunk/build.xml>:2472: The following
error occurred while executing this line:
<https://builds.apache.org/job/JMeter-trunk/ws/trunk/build.xml>:2595: The following
error occurred while executing this line:
<https://builds.apache.org/job/JMeter-trunk/ws/trunk/build.xml>:2543: Cannot find output
file <https://builds.apache.org/job/JMeter-trunk/ws/trunk/bin/BatchTestLocal.csv>

Total time: 5 minutes 51 seconds
Build step 'Invoke Ant' marked build as failure
[locks-and-latches] Releasing all the locks
[locks-and-latches] All the locks released
Archiving artifacts

Mime
View raw message