jmeter-dev mailing list archives

Site index · List index
Message view « Date » · « Thread »
Top « Date » · « Thread »
From Apache Jenkins Server <jenk...@builds.apache.org>
Subject Build failed in Jenkins: JMeter Windows #788
Date Mon, 23 Oct 2017 11:22:13 GMT
See <https://builds.apache.org/job/JMeter%20Windows/788/display/redirect>

------------------------------------------
[...truncated 142.49 KB...]
   [jmeter] SLF4J: See http://www.slf4j.org/codes.html#multiple_bindings for an explanation.
   [jmeter] SLF4J: Actual binding is of type [org.apache.logging.slf4j.Log4jLoggerFactory]
   [jmeter] Creating summariser <summary>
   [jmeter] Created the tree successfully using testfiles/Bug54685.jmx
   [jmeter] Starting the test @ Mon Oct 23 11:20:56 UTC 2017 (1508757656770)
   [jmeter] Waiting for possible Shutdown/StopTestNow/Heapdump message on port 4445
   [jmeter] summary =      1 in 00:00:00 =    2.2/s Avg:   287 Min:   287 Max:   287 Err:
    0 (0.00%)
   [jmeter] Tidying up ...    @ Mon Oct 23 11:20:58 UTC 2017 (1508757658239)
   [jmeter] ... end of run
     [echo] Bug54685 output files compared OK

batchtest:
     [echo] Starting Bug55375 with file Bug55375.jmx using -X -Jdummy=dummy
   [jmeter] SLF4J: Class path contains multiple SLF4J bindings.
   [jmeter] SLF4J: Found binding in [jar:file:/F:/jenkins/jenkins-slave/workspace/JMeter%20Windows/trunk/lib/log4j-slf4j-impl-2.8.2.jar!/org/slf4j/impl/StaticLoggerBinder.class]
   [jmeter] SLF4J: Found binding in [jar:file:/F:/jenkins/jenkins-slave/workspace/JMeter%20Windows/trunk/lib/opt/activemq-all-5.15.2.jar!/org/slf4j/impl/StaticLoggerBinder.class]
   [jmeter] SLF4J: See http://www.slf4j.org/codes.html#multiple_bindings for an explanation.
   [jmeter] SLF4J: Actual binding is of type [org.apache.logging.slf4j.Log4jLoggerFactory]
   [jmeter] Creating summariser <summary>
   [jmeter] Created the tree successfully using testfiles/Bug55375.jmx
   [jmeter] Starting the test @ Mon Oct 23 11:21:01 UTC 2017 (1508757661713)
   [jmeter] Waiting for possible Shutdown/StopTestNow/Heapdump message on port 4445
   [jmeter] summary +      1 in 00:00:00 =    2.7/s Avg:   216 Min:   216 Max:   216 Err:
    0 (0.00%) Active: 1 Started: 1 Finished: 0
   [jmeter] summary =      1 in 00:00:00 =    2.7/s Avg:   216 Min:   216 Max:   216 Err:
    0 (0.00%)
   [jmeter] Tidying up ...    @ Mon Oct 23 11:21:03 UTC 2017 (1508757663193)
   [jmeter] ... end of run
     [echo] Bug55375 output files compared OK

batchtestserver:
   [server] SLF4J: Class path contains multiple SLF4J bindings.
   [server] SLF4J: Found binding in [jar:file:/F:/jenkins/jenkins-slave/workspace/JMeter%20Windows/trunk/lib/log4j-slf4j-impl-2.8.2.jar!/org/slf4j/impl/StaticLoggerBinder.class]
   [server] SLF4J: Found binding in [jar:file:/F:/jenkins/jenkins-slave/workspace/JMeter%20Windows/trunk/lib/opt/activemq-all-5.15.2.jar!/org/slf4j/impl/StaticLoggerBinder.class]
   [server] SLF4J: See http://www.slf4j.org/codes.html#multiple_bindings for an explanation.
   [server] SLF4J: Actual binding is of type [org.apache.logging.slf4j.Log4jLoggerFactory]

batchtest:
     [echo] Starting Bug54685 with file Bug54685.jmx using -Rlocalhost:2139 -Jsample_variables=REFERENCE,JSESSIONID
   [server] Created remote object: UnicastServerRef [liveRef: [endpoint:[10.20.2.147:65361](local),objID:[-72da1d7a:15f48f6f8bf:-7fff,
1167476203158892857]]]
   [client] SLF4J: Class path contains multiple SLF4J bindings.
   [client] SLF4J: Found binding in [jar:file:/F:/jenkins/jenkins-slave/workspace/JMeter%20Windows/trunk/lib/log4j-slf4j-impl-2.8.2.jar!/org/slf4j/impl/StaticLoggerBinder.class]
   [client] SLF4J: Found binding in [jar:file:/F:/jenkins/jenkins-slave/workspace/JMeter%20Windows/trunk/lib/opt/activemq-all-5.15.2.jar!/org/slf4j/impl/StaticLoggerBinder.class]
   [client] SLF4J: See http://www.slf4j.org/codes.html#multiple_bindings for an explanation.
   [client] SLF4J: Actual binding is of type [org.apache.logging.slf4j.Log4jLoggerFactory]
   [client] Creating summariser <summary>
   [client] Created the tree successfully using testfiles/Bug54685.jmx
   [client] Configuring remote engine: localhost:2139
   [client] Starting remote engines
   [client] Starting the test @ Mon Oct 23 11:21:09 UTC 2017 (1508757669119)
   [client] Remote engines have been started
   [client] Waiting for possible Shutdown/StopTestNow/Heapdump message on port 4445
   [server] Starting the test on host localhost:2139 @ Mon Oct 23 11:21:10 UTC 2017 (1508757670914)
   [client] summary =      1 in 00:00:00 =    2.2/s Avg:   282 Min:   282 Max:   282 Err:
    0 (0.00%)
   [client] Tidying up remote @ Mon Oct 23 11:21:12 UTC 2017 (1508757672277)
   [server] Finished the test on host localhost:2139 @ Mon Oct 23 11:21:12 UTC 2017 (1508757672277)
- exit requested.
   [client] ... end of run
     [echo] Bug54685 output files compared OK

batchtest:
     [echo] Starting Bug56811 with file Bug56811.jmx using -X -Jdummy=dummy
   [jmeter] SLF4J: Class path contains multiple SLF4J bindings.
   [jmeter] SLF4J: Found binding in [jar:file:/F:/jenkins/jenkins-slave/workspace/JMeter%20Windows/trunk/lib/log4j-slf4j-impl-2.8.2.jar!/org/slf4j/impl/StaticLoggerBinder.class]
   [jmeter] SLF4J: Found binding in [jar:file:/F:/jenkins/jenkins-slave/workspace/JMeter%20Windows/trunk/lib/opt/activemq-all-5.15.2.jar!/org/slf4j/impl/StaticLoggerBinder.class]
   [jmeter] SLF4J: See http://www.slf4j.org/codes.html#multiple_bindings for an explanation.
   [jmeter] SLF4J: Actual binding is of type [org.apache.logging.slf4j.Log4jLoggerFactory]
   [jmeter] Creating summariser <summary>
   [jmeter] Created the tree successfully using testfiles/Bug56811.jmx
   [jmeter] Starting the test @ Mon Oct 23 11:21:21 UTC 2017 (1508757681056)
   [jmeter] Waiting for possible Shutdown/StopTestNow/Heapdump message on port 4445
   [jmeter] summary +      1 in 00:00:08 =    0.1/s Avg:   243 Min:   243 Max:   243 Err:
    0 (0.00%) Active: 1 Started: 4 Finished: 3
   [jmeter] summary +      8 in 00:00:01 =    7.4/s Avg:   133 Min:     0 Max:   273 Err:
    3 (37.50%) Active: 0 Started: 4 Finished: 4
   [jmeter] summary =      9 in 00:00:09 =    1.0/s Avg:   145 Min:     0 Max:   273 Err:
    3 (33.33%)
   [jmeter] Tidying up ...    @ Mon Oct 23 11:21:31 UTC 2017 (1508757691591)
   [jmeter] ... end of run
     [echo] Bug56811 output files compared OK

batchtest:
     [echo] Starting TEST_HTTPS with file TEST_HTTPS.jmx using -X -Jdummy=dummy
   [jmeter] SLF4J: Class path contains multiple SLF4J bindings.
   [jmeter] SLF4J: Found binding in [jar:file:/F:/jenkins/jenkins-slave/workspace/JMeter%20Windows/trunk/lib/log4j-slf4j-impl-2.8.2.jar!/org/slf4j/impl/StaticLoggerBinder.class]
   [jmeter] SLF4J: Found binding in [jar:file:/F:/jenkins/jenkins-slave/workspace/JMeter%20Windows/trunk/lib/opt/activemq-all-5.15.2.jar!/org/slf4j/impl/StaticLoggerBinder.class]
   [jmeter] SLF4J: See http://www.slf4j.org/codes.html#multiple_bindings for an explanation.
   [jmeter] SLF4J: Actual binding is of type [org.apache.logging.slf4j.Log4jLoggerFactory]
   [jmeter] Creating summariser <summary>
   [jmeter] Created the tree successfully using testfiles/TEST_HTTPS.jmx
   [jmeter] Starting the test @ Mon Oct 23 11:21:35 UTC 2017 (1508757695144)
   [jmeter] Waiting for possible Shutdown/StopTestNow/Heapdump message on port 4445
   [jmeter] summary =      2 in 00:00:02 =    0.8/s Avg:  1073 Min:  1031 Max:  1116 Err:
    0 (0.00%)
   [jmeter] Tidying up ...    @ Mon Oct 23 11:21:38 UTC 2017 (1508757698590)
   [jmeter] ... end of run
     [echo] TEST_HTTPS output files compared OK

batchtest:
     [echo] Starting JDBC_TESTS with file JDBC_TESTS.jmx using -X -Jdummy=dummy
   [jmeter] SLF4J: Class path contains multiple SLF4J bindings.
   [jmeter] SLF4J: Found binding in [jar:file:/F:/jenkins/jenkins-slave/workspace/JMeter%20Windows/trunk/lib/log4j-slf4j-impl-2.8.2.jar!/org/slf4j/impl/StaticLoggerBinder.class]
   [jmeter] SLF4J: Found binding in [jar:file:/F:/jenkins/jenkins-slave/workspace/JMeter%20Windows/trunk/lib/opt/activemq-all-5.15.2.jar!/org/slf4j/impl/StaticLoggerBinder.class]
   [jmeter] SLF4J: See http://www.slf4j.org/codes.html#multiple_bindings for an explanation.
   [jmeter] SLF4J: Actual binding is of type [org.apache.logging.slf4j.Log4jLoggerFactory]
   [jmeter] Creating summariser <summary>
   [jmeter] Created the tree successfully using testfiles/JDBC_TESTS.jmx
   [jmeter] Starting the test @ Mon Oct 23 11:21:42 UTC 2017 (1508757702075)
   [jmeter] Waiting for possible Shutdown/StopTestNow/Heapdump message on port 4445
   [jmeter] summary =     10 in 00:00:02 =    5.7/s Avg:    71 Min:     0 Max:   663 Err:
    0 (0.00%)
   [jmeter] Tidying up ...    @ Mon Oct 23 11:21:45 UTC 2017 (1508757705464)
   [jmeter] ... end of run
     [echo] JDBC_TESTS output files compared OK

batchtest:
     [echo] Starting JMS_TESTS with file JMS_TESTS.jmx using -X -Jdummy=dummy
   [jmeter] SLF4J: Class path contains multiple SLF4J bindings.
   [jmeter] SLF4J: Found binding in [jar:file:/F:/jenkins/jenkins-slave/workspace/JMeter%20Windows/trunk/lib/log4j-slf4j-impl-2.8.2.jar!/org/slf4j/impl/StaticLoggerBinder.class]
   [jmeter] SLF4J: Found binding in [jar:file:/F:/jenkins/jenkins-slave/workspace/JMeter%20Windows/trunk/lib/opt/activemq-all-5.15.2.jar!/org/slf4j/impl/StaticLoggerBinder.class]
   [jmeter] SLF4J: See http://www.slf4j.org/codes.html#multiple_bindings for an explanation.
   [jmeter] SLF4J: Actual binding is of type [org.apache.logging.slf4j.Log4jLoggerFactory]
   [jmeter] Creating summariser <summary>
   [jmeter] Created the tree successfully using testfiles/JMS_TESTS.jmx
   [jmeter] Starting the test @ Mon Oct 23 11:21:49 UTC 2017 (1508757709138)
   [jmeter] Waiting for possible Shutdown/StopTestNow/Heapdump message on port 4445
   [jmeter] summary =      1 in 00:00:01 =    1.6/s Avg:   484 Min:   484 Max:   484 Err:
    1 (100.00%)
   [jmeter] Tidying up ...    @ Mon Oct 23 11:21:51 UTC 2017 (1508757711328)
   [jmeter] ... end of run
   [concat] 2017-10-23 11:21:51,200 ERROR o.a.j.u.BeanShellInterpreter: Error invoking bsh
method: eval	Sourced file: inline evaluation of: ``import org.apache.activemq.broker.BrokerService;
import org.apache.activemq.brok . . . '' : Typed variable declaration : Method Invocation
BrokerFactory.createBroker
   [concat] 2017-10-23 11:21:51,207 WARN o.a.j.p.j.s.BeanShellSampler: Exception executing
script. org.apache.jorphan.util.JMeterException: Error invoking bsh method: eval	Sourced file:
inline evaluation of: ``import org.apache.activemq.broker.BrokerService; import org.apache.activemq.brok
. . . '' : Typed variable declaration : Method Invocation BrokerFactory.createBroker
Target 'batchtest' failed with message 'CSV Files are not identical.
        <https://builds.apache.org/job/JMeter%20Windows/ws/trunk\bin\testfiles\JMS_TESTS.csv>
        label,responseCode,responseMessage,threadName,dataType,success,grpThreads,allThreads,SampleCount,ErrorCount
BSS_startActiveMQ,200,OK,setUp Thread Group 1-1,text,true,1,1,1,0
JMS-P2P-DefaultCorrelationId,200,OK,TG-JMS-P2P 1-1,text,true,1,1,1,0
JSS-ConsumeUpcomingMessage,200,OK,TG-JMS-P2P 1-1,text,true,1,1,1,0
JMS-P2P-DefaultCorrelationId-TempQueue,200,OK,TG-JMS-P2P 1-1,text,true,1,1,1,0
JMS-P2P-CustomCorrelationId,200,OK,TG-JMS-P2P 1-1,text,true,1,1,1,0
JMS-P2P-DifferentSelector,,No reply message received,TG-JMS-P2P 1-1,text,true,1,1,1,0
JMS-P2P-SameSelector,200,OK,TG-JMS-P2P 1-1,text,true,1,1,1,0
JMS-P2P-RequestOnly,200,OK,TG-JMS-P2P 1-1,text,true,1,1,1,0
JSS-ConsumePreviousMessage,200,OK,TG-JMS-P2P 1-1,text,true,1,1,1,0
JMS Publisher-NonDurable,200,1 messages published,TG-JMS-PS 2-1,,true,1,1,1,0
JMS Subscriber-NonDurable,200,1 message(s) received successfully of 1 expected,TG-JMS-PS 2-1,text,true,1,1,1,0
JMS Publisher-Persistent,200,1 messages published,TG-JMS-PS-Selector-receive 3-1,,true,1,1,1,0
JMS Subscriber-NonMatchingSelector,404,0 message(s) received successfully of 1 expected,TG-JMS-PS-Selector-receive
3-1,text,true,1,1,0,0
JMS Subscriber-at-startup-onMessage,200,1 message(s) received successfully of 1 expected,TG-JMS-PS-Selector-receive
3-1,text,true,1,1,1,0
JMS Publisher-Persistent,200,1 messages published,TG-JMS-PS-Selector-onMessage 4-1,,true,1,1,1,0
JMS Subscriber-NonMatchingSelector-receive,404,0 message(s) received successfully of 1 expected,TG-JMS-PS-Selector-onMessage
4-1,text,true,1,1,0,0
JMS Subscriber-MatchingSelector-receive,200,1 message(s) received successfully of 1 expected,TG-JMS-PS-Selector-onMessage
4-1,text,true,1,1,1,0
JMS Publisher-Persistent,200,1 messages published,TG-JMS-PS-Durable 5-1,,true,1,1,1,0
JMS Subscriber-Durable,200,1 message(s) received successfully of 1 expected,TG-JMS-PS-Durable
5-1,text,true,1,1,1,0
JMS Publisher-NonPersistent,200,1 messages published,TG-JMS-PS-Selector-Non-Persistent 6-1,,true,1,1,1,0
JMS Subscriber-NP-EachSample,404,0 message(s) received successfully of 1 expected,TG-JMS-PS-Selector-Non-Persistent
6-1,text,true,1,1,0,0
JMS Subscriber-NP-OnStartup,200,1 message(s) received successfully of 1 expected,TG-JMS-PS-Selector-Non-Persistent
6-1,text,true,1,1,1,0
BSS_stopActiveMQ,200,OK,tearDown Thread Group 1-1,text,true,1,1,1,0

        <https://builds.apache.org/job/JMeter%20Windows/ws/trunk\bin\JMS_TESTS.csv>
        label,responseCode,responseMessage,threadName,dataType,success,grpThreads,allThreads,SampleCount,ErrorCount
BSS_startActiveMQ,500,org.apache.jorphan.util.JMeterException: Error invoking bsh method:
eval	Sourced file: inline evaluation of: ``import org.apache.activemq.broker.BrokerService;
import org.apache.activemq.brok . . . '' : Typed variable declaration : Method Invocation
BrokerFactory.createBroker,setUp Thread Group 1-1,text,false,1,1,1,1'.
Target 'batch_scripts' failed with message 'The following error occurred while executing this
line:
<https://builds.apache.org/job/JMeter%20Windows/ws/trunk\build.xml>:2616: CSV Files
are not identical.
        <https://builds.apache.org/job/JMeter%20Windows/ws/trunk\bin\testfiles\JMS_TESTS.csv>
        label,responseCode,responseMessage,threadName,dataType,success,grpThreads,allThreads,SampleCount,ErrorCount
BSS_startActiveMQ,200,OK,setUp Thread Group 1-1,text,true,1,1,1,0
JMS-P2P-DefaultCorrelationId,200,OK,TG-JMS-P2P 1-1,text,true,1,1,1,0
JSS-ConsumeUpcomingMessage,200,OK,TG-JMS-P2P 1-1,text,true,1,1,1,0
JMS-P2P-DefaultCorrelationId-TempQueue,200,OK,TG-JMS-P2P 1-1,text,true,1,1,1,0
JMS-P2P-CustomCorrelationId,200,OK,TG-JMS-P2P 1-1,text,true,1,1,1,0
JMS-P2P-DifferentSelector,,No reply message received,TG-JMS-P2P 1-1,text,true,1,1,1,0
JMS-P2P-SameSelector,200,OK,TG-JMS-P2P 1-1,text,true,1,1,1,0
JMS-P2P-RequestOnly,200,OK,TG-JMS-P2P 1-1,text,true,1,1,1,0
JSS-ConsumePreviousMessage,200,OK,TG-JMS-P2P 1-1,text,true,1,1,1,0
JMS Publisher-NonDurable,200,1 messages published,TG-JMS-PS 2-1,,true,1,1,1,0
JMS Subscriber-NonDurable,200,1 message(s) received successfully of 1 expected,TG-JMS-PS 2-1,text,true,1,1,1,0
JMS Publisher-Persistent,200,1 messages published,TG-JMS-PS-Selector-receive 3-1,,true,1,1,1,0
JMS Subscriber-NonMatchingSelector,404,0 message(s) received successfully of 1 expected,TG-JMS-PS-Selector-receive
3-1,text,true,1,1,0,0
JMS Subscriber-at-startup-onMessage,200,1 message(s) received successfully of 1 expected,TG-JMS-PS-Selector-receive
3-1,text,true,1,1,1,0
JMS Publisher-Persistent,200,1 messages published,TG-JMS-PS-Selector-onMessage 4-1,,true,1,1,1,0
JMS Subscriber-NonMatchingSelector-receive,404,0 message(s) received successfully of 1 expected,TG-JMS-PS-Selector-onMessage
4-1,text,true,1,1,0,0
JMS Subscriber-MatchingSelector-receive,200,1 message(s) received successfully of 1 expected,TG-JMS-PS-Selector-onMessage
4-1,text,true,1,1,1,0
JMS Publisher-Persistent,200,1 messages published,TG-JMS-PS-Durable 5-1,,true,1,1,1,0
JMS Subscriber-Durable,200,1 message(s) received successfully of 1 expected,TG-JMS-PS-Durable
5-1,text,true,1,1,1,0
JMS Publisher-NonPersistent,200,1 messages published,TG-JMS-PS-Selector-Non-Persistent 6-1,,true,1,1,1,0
JMS Subscriber-NP-EachSample,404,0 message(s) received successfully of 1 expected,TG-JMS-PS-Selector-Non-Persistent
6-1,text,true,1,1,0,0
JMS Subscriber-NP-OnStartup,200,1 message(s) received successfully of 1 expected,TG-JMS-PS-Selector-Non-Persistent
6-1,text,true,1,1,1,0
BSS_stopActiveMQ,200,OK,tearDown Thread Group 1-1,text,true,1,1,1,0

        <https://builds.apache.org/job/JMeter%20Windows/ws/trunk\bin\JMS_TESTS.csv>
        label,responseCode,responseMessage,threadName,dataType,success,grpThreads,allThreads,SampleCount,ErrorCount
BSS_startActiveMQ,500,org.apache.jorphan.util.JMeterException: Error invoking bsh method:
eval	Sourced file: inline evaluation of: ``import org.apache.activemq.broker.BrokerService;
import org.apache.activemq.brok . . . '' : Typed variable declaration : Method Invocation
BrokerFactory.createBroker,setUp Thread Group 1-1,text,false,1,1,1,1'.
Cannot execute '_allbatchtests' - 'batch_scripts' failed or was not executed.
Cannot execute 'test' - '_allbatchtests' failed or was not executed.

download_checkstyle:

_process_checkstyle_jars:

_check_exists:

_check_jarfile:
     [echo] Checking checkstyle-6.13-all.jar
     [echo] Deleting checkstyle-6.13-all.jar (excluding checkstyle-6.13-all.jar)

setproxy:

_get_jarfile:

setproxy:

_get_zipfile:

checkstyle:

_process_checkstyle_jars:

_check_exists:

_check_jarfile:
[checkstyle] Running Checkstyle 6.13 on 1056 files

BUILD FAILED
<https://builds.apache.org/job/JMeter%20Windows/ws/trunk\build.xml>:2741: The following
error occurred while executing this line:
<https://builds.apache.org/job/JMeter%20Windows/ws/trunk\build.xml>:2616: CSV Files
are not identical.
        <https://builds.apache.org/job/JMeter%20Windows/ws/trunk\bin\testfiles\JMS_TESTS.csv>
        label,responseCode,responseMessage,threadName,dataType,success,grpThreads,allThreads,SampleCount,ErrorCount
BSS_startActiveMQ,200,OK,setUp Thread Group 1-1,text,true,1,1,1,0
JMS-P2P-DefaultCorrelationId,200,OK,TG-JMS-P2P 1-1,text,true,1,1,1,0
JSS-ConsumeUpcomingMessage,200,OK,TG-JMS-P2P 1-1,text,true,1,1,1,0
JMS-P2P-DefaultCorrelationId-TempQueue,200,OK,TG-JMS-P2P 1-1,text,true,1,1,1,0
JMS-P2P-CustomCorrelationId,200,OK,TG-JMS-P2P 1-1,text,true,1,1,1,0
JMS-P2P-DifferentSelector,,No reply message received,TG-JMS-P2P 1-1,text,true,1,1,1,0
JMS-P2P-SameSelector,200,OK,TG-JMS-P2P 1-1,text,true,1,1,1,0
JMS-P2P-RequestOnly,200,OK,TG-JMS-P2P 1-1,text,true,1,1,1,0
JSS-ConsumePreviousMessage,200,OK,TG-JMS-P2P 1-1,text,true,1,1,1,0
JMS Publisher-NonDurable,200,1 messages published,TG-JMS-PS 2-1,,true,1,1,1,0
JMS Subscriber-NonDurable,200,1 message(s) received successfully of 1 expected,TG-JMS-PS 2-1,text,true,1,1,1,0
JMS Publisher-Persistent,200,1 messages published,TG-JMS-PS-Selector-receive 3-1,,true,1,1,1,0
JMS Subscriber-NonMatchingSelector,404,0 message(s) received successfully of 1 expected,TG-JMS-PS-Selector-receive
3-1,text,true,1,1,0,0
JMS Subscriber-at-startup-onMessage,200,1 message(s) received successfully of 1 expected,TG-JMS-PS-Selector-receive
3-1,text,true,1,1,1,0
JMS Publisher-Persistent,200,1 messages published,TG-JMS-PS-Selector-onMessage 4-1,,true,1,1,1,0
JMS Subscriber-NonMatchingSelector-receive,404,0 message(s) received successfully of 1 expected,TG-JMS-PS-Selector-onMessage
4-1,text,true,1,1,0,0
JMS Subscriber-MatchingSelector-receive,200,1 message(s) received successfully of 1 expected,TG-JMS-PS-Selector-onMessage
4-1,text,true,1,1,1,0
JMS Publisher-Persistent,200,1 messages published,TG-JMS-PS-Durable 5-1,,true,1,1,1,0
JMS Subscriber-Durable,200,1 message(s) received successfully of 1 expected,TG-JMS-PS-Durable
5-1,text,true,1,1,1,0
JMS Publisher-NonPersistent,200,1 messages published,TG-JMS-PS-Selector-Non-Persistent 6-1,,true,1,1,1,0
JMS Subscriber-NP-EachSample,404,0 message(s) received successfully of 1 expected,TG-JMS-PS-Selector-Non-Persistent
6-1,text,true,1,1,0,0
JMS Subscriber-NP-OnStartup,200,1 message(s) received successfully of 1 expected,TG-JMS-PS-Selector-Non-Persistent
6-1,text,true,1,1,1,0
BSS_stopActiveMQ,200,OK,tearDown Thread Group 1-1,text,true,1,1,1,0

        <https://builds.apache.org/job/JMeter%20Windows/ws/trunk\bin\JMS_TESTS.csv>
        label,responseCode,responseMessage,threadName,dataType,success,grpThreads,allThreads,SampleCount,ErrorCount
BSS_startActiveMQ,500,org.apache.jorphan.util.JMeterException: Error invoking bsh method:
eval	Sourced file: inline evaluation of: ``import org.apache.activemq.broker.BrokerService;
import org.apache.activemq.brok . . . '' : Typed variable declaration : Method Invocation
BrokerFactory.createBroker,setUp Thread Group 1-1,text,false,1,1,1,1

Total time: 6 minutes 15 seconds
Build step 'Invoke Ant' marked build as failure

Mime
View raw message