jmeter-dev mailing list archives

Site index · List index
Message view « Date » · « Thread »
Top « Date » · « Thread »
From Apache Jenkins Server <jenk...@builds.apache.org>
Subject Build failed in Jenkins: JMeter Windows #811
Date Thu, 26 Oct 2017 21:17:55 GMT
See <https://builds.apache.org/job/JMeter%20Windows/811/display/redirect?page=changes>

Changes:

[pmouawad] Comment OS_TESTS.jmx as it's  not ready for windows yet

[pmouawad] Improve exclusions in recording templates

[pmouawad] Improve logging
Drop commented code

[pmouawad] Fix javadoc

------------------------------------------
[...truncated 167.85 KB...]
batchtest:
     [echo] Starting JMS_TESTS with file JMS_TESTS.jmx using -X -Jdummy=dummy
   [jmeter] SLF4J: Class path contains multiple SLF4J bindings.
   [jmeter] SLF4J: Found binding in [jar:file:/F:/jenkins/jenkins-slave/workspace/JMeter%20Windows/trunk/lib/log4j-slf4j-impl-2.8.2.jar!/org/slf4j/impl/StaticLoggerBinder.class]
   [jmeter] SLF4J: Found binding in [jar:file:/F:/jenkins/jenkins-slave/workspace/JMeter%20Windows/trunk/lib/opt/activemq-all-5.15.2.jar!/org/slf4j/impl/StaticLoggerBinder.class]
   [jmeter] SLF4J: See http://www.slf4j.org/codes.html#multiple_bindings for an explanation.
   [jmeter] SLF4J: Actual binding is of type [org.apache.logging.slf4j.Log4jLoggerFactory]
   [jmeter] Creating summariser <summary>
   [jmeter] Created the tree successfully using testfiles/JMS_TESTS.jmx
   [jmeter] Starting the test @ Thu Oct 26 21:16:57 UTC 2017 (1509052617183)
   [jmeter] Waiting for possible Shutdown/StopTestNow/Heapdump message on port 4445
   [jmeter] summary +      1 in 00:00:03 =    0.3/s Avg:  2915 Min:  2915 Max:  2915 Err:
    0 (0.00%) Active: 1 Started: 1 Finished: 0
   [jmeter] summary +     19 in 00:00:31 =    0.6/s Avg:   655 Min:     1 Max:  3001 Err:
    0 (0.00%) Active: 1 Started: 1 Finished: 0
   [jmeter] summary =     20 in 00:00:34 =    0.6/s Avg:   768 Min:     1 Max:  3001 Err:
    0 (0.00%)
   [jmeter] summary =     20 in 00:00:34 =    0.6/s Avg:   768 Min:     1 Max:  3001 Err:
    0 (0.00%)
   [jmeter] Tidying up ...    @ Thu Oct 26 21:17:32 UTC 2017 (1509052652396)
   [jmeter] ... end of run
     [echo] JMS_TESTS output files compared OK

batchtest:
     [echo] Starting FTP_TESTS with file FTP_TESTS.jmx using -X -Jdummy=dummy
   [jmeter] SLF4J: Class path contains multiple SLF4J bindings.
   [jmeter] SLF4J: Found binding in [jar:file:/F:/jenkins/jenkins-slave/workspace/JMeter%20Windows/trunk/lib/log4j-slf4j-impl-2.8.2.jar!/org/slf4j/impl/StaticLoggerBinder.class]
   [jmeter] SLF4J: Found binding in [jar:file:/F:/jenkins/jenkins-slave/workspace/JMeter%20Windows/trunk/lib/opt/activemq-all-5.15.2.jar!/org/slf4j/impl/StaticLoggerBinder.class]
   [jmeter] SLF4J: See http://www.slf4j.org/codes.html#multiple_bindings for an explanation.
   [jmeter] SLF4J: Actual binding is of type [org.apache.logging.slf4j.Log4jLoggerFactory]
   [jmeter] Creating summariser <summary>
   [jmeter] Created the tree successfully using testfiles/FTP_TESTS.jmx
   [jmeter] Starting the test @ Thu Oct 26 21:17:36 UTC 2017 (1509052656670)
   [jmeter] Waiting for possible Shutdown/StopTestNow/Heapdump message on port 4445
   [jmeter] summary =      6 in 00:00:02 =    2.7/s Avg:   148 Min:    20 Max:   602 Err:
    0 (0.00%)
   [jmeter] Tidying up ...    @ Thu Oct 26 21:17:40 UTC 2017 (1509052660041)
   [jmeter] ... end of run
Target 'batchtest' failed with message 'XML Files are not identical.
        <https://builds.apache.org/job/JMeter%20Windows/ws/trunk\bin\testfiles\FTP_TESTS.xml>
        <?xml version="1.0" encoding="UTF-8"?>
<testResults version="1.2">
<sample s="true" lb="BSS_startFtpServer" rc="200" rm="OK" tn="setUp Thread Group 1-1" dt="text"
sc="1" ec="0" ng="1" na="1"/>
<sample s="true" lb="FTP Request-get-binary" rc="200" rm="OK" tn="TG-FTP 1-1" dt="" sc="1"
ec="0" ng="1" na="1">
  <assertionResult>
    <name>Response Assertion</name>
    <failure>false</failure>
    <error>false</error>
  </assertionResult>
</sample>
<sample s="true" lb="FTP Request-get-text" rc="200" rm="OK" tn="TG-FTP 1-1" dt="text" sc="1"
ec="0" ng="1" na="1">
  <assertionResult>
    <name>Response Assertion</name>
    <failure>false</failure>
    <error>false</error>
  </assertionResult>
</sample>
<sample s="true" lb="FTP Request-put-text" rc="200" rm="OK" tn="TG-FTP 1-1" dt="" sc="1"
ec="0" ng="1" na="1"/>
<sample s="true" lb="FTP Request-check-upload" rc="200" rm="OK" tn="TG-FTP 1-1" dt="text"
sc="1" ec="0" ng="1" na="1">
  <assertionResult>
    <name>Response Assertion</name>
    <failure>false</failure>
    <error>false</error>
  </assertionResult>
</sample>
<sample s="true" lb="BSS_stopFtpServer" rc="200" rm="OK" tn="tearDown Thread Group 1-1"
dt="text" sc="1" ec="0" ng="1" na="1"/>

</testResults>

        <https://builds.apache.org/job/JMeter%20Windows/ws/trunk\bin\FTP_TESTS.xml>
        <?xml version="1.0" encoding="UTF-8"?>
<testResults version="1.2">
<sample s="true" lb="BSS_startFtpServer" rc="200" rm="OK" tn="setUp Thread Group 1-1" dt="text"
sc="1" ec="0" ng="1" na="1"/>
<sample s="true" lb="FTP Request-get-binary" rc="200" rm="OK" tn="TG-FTP 1-1" dt="" sc="1"
ec="0" ng="1" na="1">
  <assertionResult>
    <name>Response Assertion</name>
    <failure>false</failure>
    <error>false</error>
  </assertionResult>
</sample>
<sample s="true" lb="FTP Request-get-text" rc="200" rm="OK" tn="TG-FTP 1-1" dt="text" sc="1"
ec="0" ng="1" na="1">
  <assertionResult>
    <name>Response Assertion</name>
    <failure>false</failure>
    <error>false</error>
  </assertionResult>
</sample>
<sample s="true" lb="FTP Request-put-text" rc="200" rm="OK" tn="TG-FTP 1-1" dt="" sc="1"
ec="0" ng="1" na="1"/>
<sample s="true" lb="FTP Request-check-upload" rc="200" rm="OK" tn="TG-FTP 1-1" dt="text"
sc="1" ec="0" ng="1" na="1">
  <assertionResult>
    <name>Response Assertion</name>
    <failure>false</failure>
    <error>false</error>
  </assertionResult>
</sample>
<sample s="true" lb="BSS_stopFtpServer" rc="200" rm="OK" tn="tearDown Thread Group 1-1"
dt="text" sc="1" ec="0" ng="1" na="1"/>

</testResults>'.
Target 'batch_scripts' failed with message 'The following error occurred while executing this
line:
<https://builds.apache.org/job/JMeter%20Windows/ws/trunk\build.xml>:2635: XML Files
are not identical.
        <https://builds.apache.org/job/JMeter%20Windows/ws/trunk\bin\testfiles\FTP_TESTS.xml>
        <?xml version="1.0" encoding="UTF-8"?>
<testResults version="1.2">
<sample s="true" lb="BSS_startFtpServer" rc="200" rm="OK" tn="setUp Thread Group 1-1" dt="text"
sc="1" ec="0" ng="1" na="1"/>
<sample s="true" lb="FTP Request-get-binary" rc="200" rm="OK" tn="TG-FTP 1-1" dt="" sc="1"
ec="0" ng="1" na="1">
  <assertionResult>
    <name>Response Assertion</name>
    <failure>false</failure>
    <error>false</error>
  </assertionResult>
</sample>
<sample s="true" lb="FTP Request-get-text" rc="200" rm="OK" tn="TG-FTP 1-1" dt="text" sc="1"
ec="0" ng="1" na="1">
  <assertionResult>
    <name>Response Assertion</name>
    <failure>false</failure>
    <error>false</error>
  </assertionResult>
</sample>
<sample s="true" lb="FTP Request-put-text" rc="200" rm="OK" tn="TG-FTP 1-1" dt="" sc="1"
ec="0" ng="1" na="1"/>
<sample s="true" lb="FTP Request-check-upload" rc="200" rm="OK" tn="TG-FTP 1-1" dt="text"
sc="1" ec="0" ng="1" na="1">
  <assertionResult>
    <name>Response Assertion</name>
    <failure>false</failure>
    <error>false</error>
  </assertionResult>
</sample>
<sample s="true" lb="BSS_stopFtpServer" rc="200" rm="OK" tn="tearDown Thread Group 1-1"
dt="text" sc="1" ec="0" ng="1" na="1"/>

</testResults>

        <https://builds.apache.org/job/JMeter%20Windows/ws/trunk\bin\FTP_TESTS.xml>
        <?xml version="1.0" encoding="UTF-8"?>
<testResults version="1.2">
<sample s="true" lb="BSS_startFtpServer" rc="200" rm="OK" tn="setUp Thread Group 1-1" dt="text"
sc="1" ec="0" ng="1" na="1"/>
<sample s="true" lb="FTP Request-get-binary" rc="200" rm="OK" tn="TG-FTP 1-1" dt="" sc="1"
ec="0" ng="1" na="1">
  <assertionResult>
    <name>Response Assertion</name>
    <failure>false</failure>
    <error>false</error>
  </assertionResult>
</sample>
<sample s="true" lb="FTP Request-get-text" rc="200" rm="OK" tn="TG-FTP 1-1" dt="text" sc="1"
ec="0" ng="1" na="1">
  <assertionResult>
    <name>Response Assertion</name>
    <failure>false</failure>
    <error>false</error>
  </assertionResult>
</sample>
<sample s="true" lb="FTP Request-put-text" rc="200" rm="OK" tn="TG-FTP 1-1" dt="" sc="1"
ec="0" ng="1" na="1"/>
<sample s="true" lb="FTP Request-check-upload" rc="200" rm="OK" tn="TG-FTP 1-1" dt="text"
sc="1" ec="0" ng="1" na="1">
  <assertionResult>
    <name>Response Assertion</name>
    <failure>false</failure>
    <error>false</error>
  </assertionResult>
</sample>
<sample s="true" lb="BSS_stopFtpServer" rc="200" rm="OK" tn="tearDown Thread Group 1-1"
dt="text" sc="1" ec="0" ng="1" na="1"/>

</testResults>'.
Cannot execute '_allbatchtests' - 'batch_scripts' failed or was not executed.
Cannot execute 'test' - '_allbatchtests' failed or was not executed.

download_checkstyle:

_process_checkstyle_jars:

_check_exists:

_check_jarfile:
     [echo] Checking checkstyle-6.13-all.jar
     [echo] Deleting checkstyle-6.13-all.jar (excluding checkstyle-6.13-all.jar)

setproxy:

_get_jarfile:

setproxy:

_get_zipfile:

checkstyle:

_process_checkstyle_jars:

_check_exists:

_check_jarfile:
[checkstyle] Running Checkstyle 6.13 on 1056 files

BUILD FAILED
<https://builds.apache.org/job/JMeter%20Windows/ws/trunk\build.xml>:2763: The following
error occurred while executing this line:
<https://builds.apache.org/job/JMeter%20Windows/ws/trunk\build.xml>:2635: XML Files
are not identical.
        <https://builds.apache.org/job/JMeter%20Windows/ws/trunk\bin\testfiles\FTP_TESTS.xml>
        <?xml version="1.0" encoding="UTF-8"?>
<testResults version="1.2">
<sample s="true" lb="BSS_startFtpServer" rc="200" rm="OK" tn="setUp Thread Group 1-1" dt="text"
sc="1" ec="0" ng="1" na="1"/>
<sample s="true" lb="FTP Request-get-binary" rc="200" rm="OK" tn="TG-FTP 1-1" dt="" sc="1"
ec="0" ng="1" na="1">
  <assertionResult>
    <name>Response Assertion</name>
    <failure>false</failure>
    <error>false</error>
  </assertionResult>
</sample>
<sample s="true" lb="FTP Request-get-text" rc="200" rm="OK" tn="TG-FTP 1-1" dt="text" sc="1"
ec="0" ng="1" na="1">
  <assertionResult>
    <name>Response Assertion</name>
    <failure>false</failure>
    <error>false</error>
  </assertionResult>
</sample>
<sample s="true" lb="FTP Request-put-text" rc="200" rm="OK" tn="TG-FTP 1-1" dt="" sc="1"
ec="0" ng="1" na="1"/>
<sample s="true" lb="FTP Request-check-upload" rc="200" rm="OK" tn="TG-FTP 1-1" dt="text"
sc="1" ec="0" ng="1" na="1">
  <assertionResult>
    <name>Response Assertion</name>
    <failure>false</failure>
    <error>false</error>
  </assertionResult>
</sample>
<sample s="true" lb="BSS_stopFtpServer" rc="200" rm="OK" tn="tearDown Thread Group 1-1"
dt="text" sc="1" ec="0" ng="1" na="1"/>

</testResults>

        <https://builds.apache.org/job/JMeter%20Windows/ws/trunk\bin\FTP_TESTS.xml>
        <?xml version="1.0" encoding="UTF-8"?>
<testResults version="1.2">
<sample s="true" lb="BSS_startFtpServer" rc="200" rm="OK" tn="setUp Thread Group 1-1" dt="text"
sc="1" ec="0" ng="1" na="1"/>
<sample s="true" lb="FTP Request-get-binary" rc="200" rm="OK" tn="TG-FTP 1-1" dt="" sc="1"
ec="0" ng="1" na="1">
  <assertionResult>
    <name>Response Assertion</name>
    <failure>false</failure>
    <error>false</error>
  </assertionResult>
</sample>
<sample s="true" lb="FTP Request-get-text" rc="200" rm="OK" tn="TG-FTP 1-1" dt="text" sc="1"
ec="0" ng="1" na="1">
  <assertionResult>
    <name>Response Assertion</name>
    <failure>false</failure>
    <error>false</error>
  </assertionResult>
</sample>
<sample s="true" lb="FTP Request-put-text" rc="200" rm="OK" tn="TG-FTP 1-1" dt="" sc="1"
ec="0" ng="1" na="1"/>
<sample s="true" lb="FTP Request-check-upload" rc="200" rm="OK" tn="TG-FTP 1-1" dt="text"
sc="1" ec="0" ng="1" na="1">
  <assertionResult>
    <name>Response Assertion</name>
    <failure>false</failure>
    <error>false</error>
  </assertionResult>
</sample>
<sample s="true" lb="BSS_stopFtpServer" rc="200" rm="OK" tn="tearDown Thread Group 1-1"
dt="text" sc="1" ec="0" ng="1" na="1"/>

</testResults>

Total time: 7 minutes 11 seconds
Build step 'Invoke Ant' marked build as failure

Mime
View raw message