jmeter-dev mailing list archives

Site index · List index
Message view « Date » · « Thread »
Top « Date » · « Thread »
From Philippe Mouawad <philippe.moua...@gmail.com>
Subject Re: Build failed in Jenkins: JMeter Windows #809
Date Thu, 02 Nov 2017 14:26:04 GMT
Fixed after your hint.
Thanks

On Thu, Oct 26, 2017 at 8:21 PM, sebb <sebbaz@gmail.com> wrote:

> The files are not the same size, but they compare equal (in at least some
> apps).
>
> One has CRLF and the other has LF line ends.
>
> The SVN properties must be wrong, which means the checkout has the wrong
> EOL.
>
> On 26 October 2017 at 19:05, Philippe Mouawad
> <philippe.mouawad@gmail.com> wrote:
> > Anybody has a hint on problem ?
> > Files are the same for me.
> >
> > On Thursday, October 26, 2017, Apache Jenkins Server <
> > jenkins@builds.apache.org> wrote:
> >
> >> See <https://builds.apache.org/job/JMeter%20Windows/809/
> >> display/redirect?page=changes>
> >>
> >> Changes:
> >>
> >> [pmouawad] Switch links to jmeter to https and mention Building and
> >> contributing doc
> >>
> >> [pmouawad] Improve description
> >>
> >> [pmouawad] Move init-svnVersion out of _coverage.report
> >>
> >> ------------------------------------------
> >> [...truncated 185.31 KB...]
> >>     <failure>false</failure>
> >>     <error>false</error>
> >>   </assertionResult>
> >> </sample>
> >> <sample s="true" lb="TCP Sampler-Binary-Quit" rc="200" rm="OK"
> >> tn="TG-BinaryTCPClientImpl 2-1" dt="text" sc="1" ec="0" ng="1" na="1"/>
> >> <sample s="true" lb="TCP Sampler-ConnectError" rc="500"
> >> rm="java.net.ConnectException: Connection refused"
> >> tn="TG-TCPClientImpl-Errors 3-1" dt="" sc="1" ec="0" ng="1" na="1">
> >>   <assertionResult>
> >>     <name>RC_500</name>
> >>     <failure>false</failure>
> >>     <error>false</error>
> >>   </assertionResult>
> >>   <assertionResult>
> >>     <name>RA_ConnectException</name>
> >>     <failure>false</failure>
> >>     <error>false</error>
> >>   </assertionResult>
> >> </sample>
> >> <sample s="true" lb="TCP Sampler-HostUnknown" rc="500" rm="java.net.
> UnknownHostException:
> >> localhostXXXX" tn="TG-TCPClientImpl-Errors 3-1" dt="" sc="1" ec="0"
> ng="1"
> >> na="1">
> >>   <assertionResult>
> >>     <name>RC_500</name>
> >>     <failure>false</failure>
> >>     <error>false</error>
> >>   </assertionResult>
> >>   <assertionResult>
> >>     <name>RA_UnknownHostException</name>
> >>     <failure>false</failure>
> >>     <error>false</error>
> >>   </assertionResult>
> >> </sample>
> >> <sample s="true" lb="TCP Sampler-ClassNotFoundException" rc="500"
> >> rm="Protocol handler not found" tn="TG-TCPClientImpl-Errors 3-1" dt=""
> >> sc="1" ec="0" ng="1" na="1">
> >>   <assertionResult>
> >>     <name>RC_500</name>
> >>     <failure>false</failure>
> >>     <error>false</error>
> >>   </assertionResult>
> >>   <assertionResult>
> >>     <name>RA_no_protocol_handler</name>
> >>     <failure>false</failure>
> >>     <error>false</error>
> >>   </assertionResult>
> >> </sample>
> >> <sample s="true" lb="BSS_stopTcpServer" rc="200" rm="OK" tn="tearDown
> >> Thread Group 1-1" dt="text" sc="1" ec="0" ng="1" na="1"/>
> >>
> >> </testResults>'.
> >> Cannot execute '_allbatchtests' - 'batch_scripts' failed or was not
> >> executed.
> >> Cannot execute 'test' - '_allbatchtests' failed or was not executed.
> >>
> >> download_checkstyle:
> >>
> >> _process_checkstyle_jars:
> >>
> >> _check_exists:
> >>
> >> _check_jarfile:
> >>      [echo] Checking checkstyle-6.13-all.jar
> >>      [echo] Deleting checkstyle-6.13-all.jar (excluding
> >> checkstyle-6.13-all.jar)
> >>
> >> setproxy:
> >>
> >> _get_jarfile:
> >>
> >> setproxy:
> >>
> >> _get_zipfile:
> >>
> >> checkstyle:
> >>
> >> _process_checkstyle_jars:
> >>
> >> _check_exists:
> >>
> >> _check_jarfile:
> >> [checkstyle] Running Checkstyle 6.13 on 1056 files
> >>
> >> BUILD FAILED
> >> <https://builds.apache.org/job/JMeter%20Windows/ws/trunk\build.xml
> >:2739:
> >> The following error occurred while executing this line:
> >> <https://builds.apache.org/job/JMeter%20Windows/ws/trunk\build.xml
> >:2635:
> >> XML Files are not identical.
> >>         <https://builds.apache.org/job/JMeter%20Windows/ws/trunk\
> >> bin\testfiles\TCP_TESTS.xml>
> >>         <?xml version="1.0" encoding="UTF-8"?>
> >> <testResults version="1.2">
> >> <sample s="true" lb="MinaTcpServerInitializer" rc="200" rm="OK"
> tn="setUp
> >> Thread Group 1-1" dt="text" sc="1" ec="0" ng="1" na="1"/>
> >> <sample s="true" lb="BSS_startTcpServer" rc="200" rm="OK" tn="setUp
> Thread
> >> Group 1-1" dt="text" sc="1" ec="0" ng="1" na="1"/>
> >> <sample s="true" lb="TCP Sampler-Hello" rc="200" rm="OK"
> >> tn="TG-TCPClientImpl 1-1" dt="text" sc="1" ec="0" ng="1" na="1">
> >>   <assertionResult>
> >>     <name>RA_time</name>
> >>     <failure>false</failure>
> >>     <error>false</error>
> >>   </assertionResult>
> >> </sample>
> >> <sample s="true" lb="TCP Sampler-Timeout" rc="500"
> rm="org.apache.jmeter.
> >> protocol.tcp.sampler.ReadException: Error reading from server, bytes
> >> read: 0" tn="TG-TCPClientImpl 1-1" dt="text" sc="1" ec="0" ng="1"
> na="1">
> >>   <assertionResult>
> >>     <name>RC_500</name>
> >>     <failure>false</failure>
> >>     <error>false</error>
> >>   </assertionResult>
> >>   <assertionResult>
> >>     <name>RA_ReadException</name>
> >>     <failure>false</failure>
> >>     <error>false</error>
> >>   </assertionResult>
> >> </sample>
> >> <sample s="true" lb="TCP Sampler-Quit" rc="200" rm="OK"
> >> tn="TG-TCPClientImpl 1-1" dt="text" sc="1" ec="0" ng="1" na="1"/>
> >> <sample s="true" lb="TCP Sampler-Binary-Hello" rc="200" rm="OK"
> >> tn="TG-BinaryTCPClientImpl 2-1" dt="text" sc="1" ec="0" ng="1" na="1">
> >>   <assertionResult>
> >>     <name>RA_time</name>
> >>     <failure>false</failure>
> >>     <error>false</error>
> >>   </assertionResult>
> >> </sample>
> >> <sample s="true" lb="TCP Sampler-Binary-Timeout" rc="500"
> >> rm="org.apache.jmeter.protocol.tcp.sampler.ReadException: "
> >> tn="TG-BinaryTCPClientImpl 2-1" dt="text" sc="1" ec="0" ng="1" na="1">
> >>   <assertionResult>
> >>     <name>RC_500</name>
> >>     <failure>false</failure>
> >>     <error>false</error>
> >>   </assertionResult>
> >>   <assertionResult>
> >>     <name>RA_ReadException</name>
> >>     <failure>false</failure>
> >>     <error>false</error>
> >>   </assertionResult>
> >> </sample>
> >> <sample s="true" lb="TCP Sampler-Binary-Quit" rc="200" rm="OK"
> >> tn="TG-BinaryTCPClientImpl 2-1" dt="text" sc="1" ec="0" ng="1" na="1"/>
> >> <sample s="true" lb="TCP Sampler-ConnectError" rc="500"
> >> rm="java.net.ConnectException: Connection refused"
> >> tn="TG-TCPClientImpl-Errors 3-1" dt="" sc="1" ec="0" ng="1" na="1">
> >>   <assertionResult>
> >>     <name>RC_500</name>
> >>     <failure>false</failure>
> >>     <error>false</error>
> >>   </assertionResult>
> >>   <assertionResult>
> >>     <name>RA_ConnectException</name>
> >>     <failure>false</failure>
> >>     <error>false</error>
> >>   </assertionResult>
> >> </sample>
> >> <sample s="true" lb="TCP Sampler-HostUnknown" rc="500" rm="java.net.
> UnknownHostException:
> >> localhostXXXX" tn="TG-TCPClientImpl-Errors 3-1" dt="" sc="1" ec="0"
> ng="1"
> >> na="1">
> >>   <assertionResult>
> >>     <name>RC_500</name>
> >>     <failure>false</failure>
> >>     <error>false</error>
> >>   </assertionResult>
> >>   <assertionResult>
> >>     <name>RA_UnknownHostException</name>
> >>     <failure>false</failure>
> >>     <error>false</error>
> >>   </assertionResult>
> >> </sample>
> >> <sample s="true" lb="TCP Sampler-ClassNotFoundException" rc="500"
> >> rm="Protocol handler not found" tn="TG-TCPClientImpl-Errors 3-1" dt=""
> >> sc="1" ec="0" ng="1" na="1">
> >>   <assertionResult>
> >>     <name>RC_500</name>
> >>     <failure>false</failure>
> >>     <error>false</error>
> >>   </assertionResult>
> >>   <assertionResult>
> >>     <name>RA_no_protocol_handler</name>
> >>     <failure>false</failure>
> >>     <error>false</error>
> >>   </assertionResult>
> >> </sample>
> >> <sample s="true" lb="BSS_stopTcpServer" rc="200" rm="OK" tn="tearDown
> >> Thread Group 1-1" dt="text" sc="1" ec="0" ng="1" na="1"/>
> >>
> >> </testResults>
> >>
> >>         <https://builds.apache.org/job/JMeter%20Windows/ws/trunk\
> >> bin\TCP_TESTS.xml>
> >>         <?xml version="1.0" encoding="UTF-8"?>
> >> <testResults version="1.2">
> >> <sample s="true" lb="MinaTcpServerInitializer" rc="200" rm="OK"
> tn="setUp
> >> Thread Group 1-1" dt="text" sc="1" ec="0" ng="1" na="1"/>
> >> <sample s="true" lb="BSS_startTcpServer" rc="200" rm="OK" tn="setUp
> Thread
> >> Group 1-1" dt="text" sc="1" ec="0" ng="1" na="1"/>
> >> <sample s="true" lb="TCP Sampler-Hello" rc="200" rm="OK"
> >> tn="TG-TCPClientImpl 1-1" dt="text" sc="1" ec="0" ng="1" na="1">
> >>   <assertionResult>
> >>     <name>RA_time</name>
> >>     <failure>false</failure>
> >>     <error>false</error>
> >>   </assertionResult>
> >> </sample>
> >> <sample s="true" lb="TCP Sampler-Timeout" rc="500"
> rm="org.apache.jmeter.
> >> protocol.tcp.sampler.ReadException: Error reading from server, bytes
> >> read: 0" tn="TG-TCPClientImpl 1-1" dt="text" sc="1" ec="0" ng="1"
> na="1">
> >>   <assertionResult>
> >>     <name>RC_500</name>
> >>     <failure>false</failure>
> >>     <error>false</error>
> >>   </assertionResult>
> >>   <assertionResult>
> >>     <name>RA_ReadException</name>
> >>     <failure>false</failure>
> >>     <error>false</error>
> >>   </assertionResult>
> >> </sample>
> >> <sample s="true" lb="TCP Sampler-Quit" rc="200" rm="OK"
> >> tn="TG-TCPClientImpl 1-1" dt="text" sc="1" ec="0" ng="1" na="1"/>
> >> <sample s="true" lb="TCP Sampler-Binary-Hello" rc="200" rm="OK"
> >> tn="TG-BinaryTCPClientImpl 2-1" dt="text" sc="1" ec="0" ng="1" na="1">
> >>   <assertionResult>
> >>     <name>RA_time</name>
> >>     <failure>false</failure>
> >>     <error>false</error>
> >>   </assertionResult>
> >> </sample>
> >> <sample s="true" lb="TCP Sampler-Binary-Timeout" rc="500"
> >> rm="org.apache.jmeter.protocol.tcp.sampler.ReadException: "
> >> tn="TG-BinaryTCPClientImpl 2-1" dt="text" sc="1" ec="0" ng="1" na="1">
> >>   <assertionResult>
> >>     <name>RC_500</name>
> >>     <failure>false</failure>
> >>     <error>false</error>
> >>   </assertionResult>
> >>   <assertionResult>
> >>     <name>RA_ReadException</name>
> >>     <failure>false</failure>
> >>     <error>false</error>
> >>   </assertionResult>
> >> </sample>
> >> <sample s="true" lb="TCP Sampler-Binary-Quit" rc="200" rm="OK"
> >> tn="TG-BinaryTCPClientImpl 2-1" dt="text" sc="1" ec="0" ng="1" na="1"/>
> >> <sample s="true" lb="TCP Sampler-ConnectError" rc="500"
> >> rm="java.net.ConnectException: Connection refused"
> >> tn="TG-TCPClientImpl-Errors 3-1" dt="" sc="1" ec="0" ng="1" na="1">
> >>   <assertionResult>
> >>     <name>RC_500</name>
> >>     <failure>false</failure>
> >>     <error>false</error>
> >>   </assertionResult>
> >>   <assertionResult>
> >>     <name>RA_ConnectException</name>
> >>     <failure>false</failure>
> >>     <error>false</error>
> >>   </assertionResult>
> >> </sample>
> >> <sample s="true" lb="TCP Sampler-HostUnknown" rc="500" rm="java.net.
> UnknownHostException:
> >> localhostXXXX" tn="TG-TCPClientImpl-Errors 3-1" dt="" sc="1" ec="0"
> ng="1"
> >> na="1">
> >>   <assertionResult>
> >>     <name>RC_500</name>
> >>     <failure>false</failure>
> >>     <error>false</error>
> >>   </assertionResult>
> >>   <assertionResult>
> >>     <name>RA_UnknownHostException</name>
> >>     <failure>false</failure>
> >>     <error>false</error>
> >>   </assertionResult>
> >> </sample>
> >> <sample s="true" lb="TCP Sampler-ClassNotFoundException" rc="500"
> >> rm="Protocol handler not found" tn="TG-TCPClientImpl-Errors 3-1" dt=""
> >> sc="1" ec="0" ng="1" na="1">
> >>   <assertionResult>
> >>     <name>RC_500</name>
> >>     <failure>false</failure>
> >>     <error>false</error>
> >>   </assertionResult>
> >>   <assertionResult>
> >>     <name>RA_no_protocol_handler</name>
> >>     <failure>false</failure>
> >>     <error>false</error>
> >>   </assertionResult>
> >> </sample>
> >> <sample s="true" lb="BSS_stopTcpServer" rc="200" rm="OK" tn="tearDown
> >> Thread Group 1-1" dt="text" sc="1" ec="0" ng="1" na="1"/>
> >>
> >> </testResults>
> >>
> >> Total time: 6 minutes 26 seconds
> >> Build step 'Invoke Ant' marked build as failure
> >>
> >
> >
> > --
> > Cordialement.
> > Philippe Mouawad.
>



-- 
Cordialement.
Philippe Mouawad.

Mime
  • Unnamed multipart/alternative (inline, None, 0 bytes)
View raw message