jmeter-dev mailing list archives

Site index · List index
Message view « Date » · « Thread »
Top « Date » · « Thread »
From Apache Jenkins Server <jenk...@builds.apache.org>
Subject Build failed in Jenkins: JMeter Windows #976
Date Fri, 19 Jan 2018 13:34:59 GMT
See <https://builds.apache.org/job/JMeter%20Windows/976/display/redirect?page=changes>

Changes:

[fschumacher] Place a dash or comma behind a pr element, when needed.

------------------------------------------
[...truncated 183.35 KB...]
   [jmeter] Created the tree successfully using testfiles/OS_TESTS.jmx
   [jmeter] Starting the test @ Fri Jan 19 13:31:35 UTC 2018 (1516368695834)
   [jmeter] Waiting for possible Shutdown/StopTestNow/Heapdump message on port 4445
   [jmeter] summary =      3 in 00:00:02 =    1.3/s Avg:   349 Min:    16 Max:  1006 Err:
    0 (0.00%)
   [jmeter] Tidying up ...    @ Fri Jan 19 13:31:38 UTC 2018 (1516368698539)
   [jmeter] ... end of run
     [echo] OS_TESTS output files compared OK

batchtest:
     [echo] Starting FTP_TESTS with file FTP_TESTS.jmx using -X -Jdummy=dummy
   [jmeter] SLF4J: Class path contains multiple SLF4J bindings.
   [jmeter] SLF4J: Found binding in [jar:file:/F:/jenkins/jenkins-slave/workspace/JMeter%20Windows/trunk/lib/log4j-slf4j-impl-2.8.2.jar!/org/slf4j/impl/StaticLoggerBinder.class]
   [jmeter] SLF4J: Found binding in [jar:file:/F:/jenkins/jenkins-slave/workspace/JMeter%20Windows/trunk/lib/opt/activemq-all-5.15.2.jar!/org/slf4j/impl/StaticLoggerBinder.class]
   [jmeter] SLF4J: See http://www.slf4j.org/codes.html#multiple_bindings for an explanation.
   [jmeter] SLF4J: Actual binding is of type [org.apache.logging.slf4j.Log4jLoggerFactory]
   [jmeter] Creating summariser <summary>
   [jmeter] Created the tree successfully using testfiles/FTP_TESTS.jmx
   [jmeter] Starting the test @ Fri Jan 19 13:31:41 UTC 2018 (1516368701877)
   [jmeter] Waiting for possible Shutdown/StopTestNow/Heapdump message on port 4445
   [jmeter] summary =      6 in 00:00:03 =    2.0/s Avg:   301 Min:    15 Max:  1463 Err:
    0 (0.00%)
   [jmeter] Tidying up ...    @ Fri Jan 19 13:31:46 UTC 2018 (1516368706426)
   [jmeter] ... end of run
   [concat] 2018-01-19 13:31:46,307 WARN o.a.f.l.n.FtpLoggingFilter: EXCEPTION :
   [concat] java.io.IOException: An established connection was aborted by the software in
your host machine
   [concat] 	at sun.nio.ch.SocketDispatcher.read0(Native Method) ~[?:1.8.0_152]
   [concat] 	at sun.nio.ch.SocketDispatcher.read(SocketDispatcher.java:43) ~[?:1.8.0_152]
   [concat] 	at sun.nio.ch.IOUtil.readIntoNativeBuffer(IOUtil.java:223) ~[?:1.8.0_152]
   [concat] 	at sun.nio.ch.IOUtil.read(IOUtil.java:197) ~[?:1.8.0_152]
   [concat] 	at sun.nio.ch.SocketChannelImpl.read(SocketChannelImpl.java:380) ~[?:1.8.0_152]
   [concat] 	at org.apache.mina.transport.socket.nio.NioProcessor.read(NioProcessor.java:317)
~[mina-core-2.0.16.jar:?]
   [concat] 	at org.apache.mina.transport.socket.nio.NioProcessor.read(NioProcessor.java:45)
~[mina-core-2.0.16.jar:?]
   [concat] 	at org.apache.mina.core.polling.AbstractPollingIoProcessor.read(AbstractPollingIoProcessor.java:683)
~[mina-core-2.0.16.jar:?]
   [concat] 	at org.apache.mina.core.polling.AbstractPollingIoProcessor.process(AbstractPollingIoProcessor.java:659)
~[mina-core-2.0.16.jar:?]
   [concat] 	at org.apache.mina.core.polling.AbstractPollingIoProcessor.process(AbstractPollingIoProcessor.java:648)
~[mina-core-2.0.16.jar:?]
   [concat] 	at org.apache.mina.core.polling.AbstractPollingIoProcessor.access$600(AbstractPollingIoProcessor.java:68)
~[mina-core-2.0.16.jar:?]
   [concat] 	at org.apache.mina.core.polling.AbstractPollingIoProcessor$Processor.run(AbstractPollingIoProcessor.java:1120)
~[mina-core-2.0.16.jar:?]
   [concat] 	at org.apache.mina.util.NamePreservingRunnable.run(NamePreservingRunnable.java:64)
~[mina-core-2.0.16.jar:?]
   [concat] 	at java.util.concurrent.ThreadPoolExecutor.runWorker(ThreadPoolExecutor.java:1149)
~[?:1.8.0_152]
   [concat] 	at java.util.concurrent.ThreadPoolExecutor$Worker.run(ThreadPoolExecutor.java:624)
~[?:1.8.0_152]
   [concat] 	at java.lang.Thread.run(Thread.java:748) [?:1.8.0_152]
   [concat] 2018-01-19 13:31:46,331 ERROR o.a.f.i.DefaultFtpHandler: Exception caught, closing
session
   [concat] java.io.IOException: An established connection was aborted by the software in
your host machine
   [concat] 	at sun.nio.ch.SocketDispatcher.read0(Native Method) ~[?:1.8.0_152]
   [concat] 	at sun.nio.ch.SocketDispatcher.read(SocketDispatcher.java:43) ~[?:1.8.0_152]
   [concat] 	at sun.nio.ch.IOUtil.readIntoNativeBuffer(IOUtil.java:223) ~[?:1.8.0_152]
   [concat] 	at sun.nio.ch.IOUtil.read(IOUtil.java:197) ~[?:1.8.0_152]
   [concat] 	at sun.nio.ch.SocketChannelImpl.read(SocketChannelImpl.java:380) ~[?:1.8.0_152]
   [concat] 	at org.apache.mina.transport.socket.nio.NioProcessor.read(NioProcessor.java:317)
~[mina-core-2.0.16.jar:?]
   [concat] 	at org.apache.mina.transport.socket.nio.NioProcessor.read(NioProcessor.java:45)
~[mina-core-2.0.16.jar:?]
   [concat] 	at org.apache.mina.core.polling.AbstractPollingIoProcessor.read(AbstractPollingIoProcessor.java:683)
~[mina-core-2.0.16.jar:?]
   [concat] 	at org.apache.mina.core.polling.AbstractPollingIoProcessor.process(AbstractPollingIoProcessor.java:659)
~[mina-core-2.0.16.jar:?]
   [concat] 	at org.apache.mina.core.polling.AbstractPollingIoProcessor.process(AbstractPollingIoProcessor.java:648)
~[mina-core-2.0.16.jar:?]
   [concat] 	at org.apache.mina.core.polling.AbstractPollingIoProcessor.access$600(AbstractPollingIoProcessor.java:68)
~[mina-core-2.0.16.jar:?]
   [concat] 	at org.apache.mina.core.polling.AbstractPollingIoProcessor$Processor.run(AbstractPollingIoProcessor.java:1120)
~[mina-core-2.0.16.jar:?]
   [concat] 	at org.apache.mina.util.NamePreservingRunnable.run(NamePreservingRunnable.java:64)
~[mina-core-2.0.16.jar:?]
   [concat] 	at java.util.concurrent.ThreadPoolExecutor.runWorker(ThreadPoolExecutor.java:1149)
~[?:1.8.0_152]
   [concat] 	at java.util.concurrent.ThreadPoolExecutor$Worker.run(ThreadPoolExecutor.java:624)
~[?:1.8.0_152]
   [concat] 	at java.lang.Thread.run(Thread.java:748) [?:1.8.0_152]
     [echo] FTP_TESTS output files compared OK

batchtest:
     [echo] Starting Bug60607 with file Bug60607.jmx using -X -Jdummy=dummy
   [jmeter] SLF4J: Class path contains multiple SLF4J bindings.
   [jmeter] SLF4J: Found binding in [jar:file:/F:/jenkins/jenkins-slave/workspace/JMeter%20Windows/trunk/lib/log4j-slf4j-impl-2.8.2.jar!/org/slf4j/impl/StaticLoggerBinder.class]
   [jmeter] SLF4J: Found binding in [jar:file:/F:/jenkins/jenkins-slave/workspace/JMeter%20Windows/trunk/lib/opt/activemq-all-5.15.2.jar!/org/slf4j/impl/StaticLoggerBinder.class]
   [jmeter] SLF4J: See http://www.slf4j.org/codes.html#multiple_bindings for an explanation.
   [jmeter] SLF4J: Actual binding is of type [org.apache.logging.slf4j.Log4jLoggerFactory]
   [jmeter] Creating summariser <summary>
   [jmeter] Created the tree successfully using testfiles/Bug60607.jmx
   [jmeter] Starting the test @ Fri Jan 19 13:31:49 UTC 2018 (1516368709858)
   [jmeter] Waiting for possible Shutdown/StopTestNow/Heapdump message on port 4445
   [jmeter] summary =      2 in 00:00:31 =    0.1/s Avg: 15313 Min:   507 Max: 30119 Err:
    0 (0.00%)
   [jmeter] Tidying up ...    @ Fri Jan 19 13:32:21 UTC 2018 (1516368741758)
   [jmeter] ... end of run
     [echo] Bug60607 output files compared OK

batchtest:
     [echo] Starting SlowCharsFeature_HttpClient4 with file SlowCharsFeature.jmx using -X
-Jdummy=dummy
   [jmeter] SLF4J: Class path contains multiple SLF4J bindings.
   [jmeter] SLF4J: Found binding in [jar:file:/F:/jenkins/jenkins-slave/workspace/JMeter%20Windows/trunk/lib/log4j-slf4j-impl-2.8.2.jar!/org/slf4j/impl/StaticLoggerBinder.class]
   [jmeter] SLF4J: Found binding in [jar:file:/F:/jenkins/jenkins-slave/workspace/JMeter%20Windows/trunk/lib/opt/activemq-all-5.15.2.jar!/org/slf4j/impl/StaticLoggerBinder.class]
   [jmeter] SLF4J: See http://www.slf4j.org/codes.html#multiple_bindings for an explanation.
   [jmeter] SLF4J: Actual binding is of type [org.apache.logging.slf4j.Log4jLoggerFactory]
   [jmeter] Creating summariser <summary>
   [jmeter] Created the tree successfully using testfiles/SlowCharsFeature.jmx
   [jmeter] Starting the test @ Fri Jan 19 13:32:26 UTC 2018 (1516368746288)
   [jmeter] Waiting for possible Shutdown/StopTestNow/Heapdump message on port 4445
   [jmeter] summary +      2 in 00:00:07 =    0.3/s Avg:  3373 Min:   788 Max:  5959 Err:
    0 (0.00%) Active: 1 Started: 1 Finished: 0
   [jmeter] summary +      1 in 00:00:12 =    0.1/s Avg: 11576 Min: 11576 Max: 11576 Err:
    0 (0.00%) Active: 0 Started: 1 Finished: 1
   [jmeter] summary =      3 in 00:00:19 =    0.2/s Avg:  6107 Min:   788 Max: 11576 Err:
    0 (0.00%)
   [jmeter] Tidying up ...    @ Fri Jan 19 13:32:46 UTC 2018 (1516368766187)
   [jmeter] ... end of run
     [echo] SlowCharsFeature_HttpClient4 output files compared OK

batchtest:
     [echo] Starting SlowCharsFeature_Java with file SlowCharsFeature.jmx using -X -Jjmeter.httpsampler=Java
   [jmeter] SLF4J: Class path contains multiple SLF4J bindings.
   [jmeter] SLF4J: Found binding in [jar:file:/F:/jenkins/jenkins-slave/workspace/JMeter%20Windows/trunk/lib/log4j-slf4j-impl-2.8.2.jar!/org/slf4j/impl/StaticLoggerBinder.class]
   [jmeter] SLF4J: Found binding in [jar:file:/F:/jenkins/jenkins-slave/workspace/JMeter%20Windows/trunk/lib/opt/activemq-all-5.15.2.jar!/org/slf4j/impl/StaticLoggerBinder.class]
   [jmeter] SLF4J: See http://www.slf4j.org/codes.html#multiple_bindings for an explanation.
   [jmeter] SLF4J: Actual binding is of type [org.apache.logging.slf4j.Log4jLoggerFactory]
   [jmeter] Creating summariser <summary>
   [jmeter] Created the tree successfully using testfiles/SlowCharsFeature.jmx
   [jmeter] Starting the test @ Fri Jan 19 13:32:50 UTC 2018 (1516368770677)
   [jmeter] Waiting for possible Shutdown/StopTestNow/Heapdump message on port 4445
   [jmeter] summary +      2 in 00:00:13 =    0.2/s Avg:  6427 Min:   804 Max: 12050 Err:
    0 (0.00%) Active: 1 Started: 1 Finished: 0
   [jmeter] summary =      2 in 00:00:13 =    0.2/s Avg:  6427 Min:   804 Max: 12050 Err:
    0 (0.00%)
   [jmeter] Tidying up ...    @ Fri Jan 19 13:33:04 UTC 2018 (1516368784981)
   [jmeter] ... end of run
     [echo] SlowCharsFeature_Java output files compared OK

batchtest:
     [echo] Starting Http4ImplPreemptiveBasicAuth with file Http4ImplPreemptiveBasicAuth.jmx
using -X -Jdummy=dummy
   [jmeter] SLF4J: Class path contains multiple SLF4J bindings.
   [jmeter] SLF4J: Found binding in [jar:file:/F:/jenkins/jenkins-slave/workspace/JMeter%20Windows/trunk/lib/log4j-slf4j-impl-2.8.2.jar!/org/slf4j/impl/StaticLoggerBinder.class]
   [jmeter] SLF4J: Found binding in [jar:file:/F:/jenkins/jenkins-slave/workspace/JMeter%20Windows/trunk/lib/opt/activemq-all-5.15.2.jar!/org/slf4j/impl/StaticLoggerBinder.class]
   [jmeter] SLF4J: See http://www.slf4j.org/codes.html#multiple_bindings for an explanation.
   [jmeter] SLF4J: Actual binding is of type [org.apache.logging.slf4j.Log4jLoggerFactory]
   [jmeter] Creating summariser <summary>
   [jmeter] Created the tree successfully using testfiles/Http4ImplPreemptiveBasicAuth.jmx
   [jmeter] Starting the test @ Fri Jan 19 13:33:08 UTC 2018 (1516368788491)
   [jmeter] Waiting for possible Shutdown/StopTestNow/Heapdump message on port 4445
   [jmeter] summary =     12 in 00:00:09 =    1.3/s Avg:   433 Min:   151 Max:  1482 Err:
    0 (0.00%)
   [jmeter] Tidying up ...    @ Fri Jan 19 13:33:19 UTC 2018 (1516368799086)
   [jmeter] ... end of run
     [echo] Http4ImplPreemptiveBasicAuth output files compared OK

batchtest:
     [echo] Starting Http4ImplPreemptiveBasicAuth with file Http4ImplPreemptiveBasicAuth.jmx
using -X -Jjmeter.httpsampler=Java
   [jmeter] SLF4J: Class path contains multiple SLF4J bindings.
   [jmeter] SLF4J: Found binding in [jar:file:/F:/jenkins/jenkins-slave/workspace/JMeter%20Windows/trunk/lib/log4j-slf4j-impl-2.8.2.jar!/org/slf4j/impl/StaticLoggerBinder.class]
   [jmeter] SLF4J: Found binding in [jar:file:/F:/jenkins/jenkins-slave/workspace/JMeter%20Windows/trunk/lib/opt/activemq-all-5.15.2.jar!/org/slf4j/impl/StaticLoggerBinder.class]
   [jmeter] SLF4J: See http://www.slf4j.org/codes.html#multiple_bindings for an explanation.
   [jmeter] SLF4J: Actual binding is of type [org.apache.logging.slf4j.Log4jLoggerFactory]
   [jmeter] Creating summariser <summary>
   [jmeter] Created the tree successfully using testfiles/Http4ImplPreemptiveBasicAuth.jmx
   [jmeter] Starting the test @ Fri Jan 19 13:33:22 UTC 2018 (1516368802726)
   [jmeter] Waiting for possible Shutdown/StopTestNow/Heapdump message on port 4445
   [jmeter] summary +      9 in 00:00:06 =    1.6/s Avg:   304 Min:   151 Max:  1340 Err:
    0 (0.00%) Active: 1 Started: 5 Finished: 4
   [jmeter] summary +      3 in 00:00:01 =    2.8/s Avg:   152 Min:   151 Max:   155 Err:
    0 (0.00%) Active: 0 Started: 6 Finished: 6
   [jmeter] summary =     12 in 00:00:07 =    1.8/s Avg:   266 Min:   151 Max:  1340 Err:
    0 (0.00%)
   [jmeter] Tidying up ...    @ Fri Jan 19 13:33:31 UTC 2018 (1516368811127)
   [jmeter] ... end of run
     [echo] Http4ImplPreemptiveBasicAuth output files compared OK

batchtest:
     [echo] Starting TestKeepAlive with file TestKeepAlive.jmx using -X -Jdummy=dummy
   [jmeter] SLF4J: Class path contains multiple SLF4J bindings.
   [jmeter] SLF4J: Found binding in [jar:file:/F:/jenkins/jenkins-slave/workspace/JMeter%20Windows/trunk/lib/log4j-slf4j-impl-2.8.2.jar!/org/slf4j/impl/StaticLoggerBinder.class]
   [jmeter] SLF4J: Found binding in [jar:file:/F:/jenkins/jenkins-slave/workspace/JMeter%20Windows/trunk/lib/opt/activemq-all-5.15.2.jar!/org/slf4j/impl/StaticLoggerBinder.class]
   [jmeter] SLF4J: See http://www.slf4j.org/codes.html#multiple_bindings for an explanation.
   [jmeter] SLF4J: Actual binding is of type [org.apache.logging.slf4j.Log4jLoggerFactory]
   [jmeter] Creating summariser <summary>
   [jmeter] Created the tree successfully using testfiles/TestKeepAlive.jmx
   [jmeter] Starting the test @ Fri Jan 19 13:33:34 UTC 2018 (1516368814865)
   [jmeter] Waiting for possible Shutdown/StopTestNow/Heapdump message on port 4445
   [jmeter] summary =      7 in 00:01:03 =    0.1/s Avg:   339 Min:   151 Max:   791 Err:
    3 (42.86%)
   [jmeter] Tidying up ...    @ Fri Jan 19 13:34:39 UTC 2018 (1516368879357)
   [jmeter] ... end of run
Target 'batchtest' failed with message 'CSV Files are not identical.
        <https://builds.apache.org/job/JMeter%20Windows/ws/trunk\bin\testfiles\TestKeepAlive.csv>
        JSPP_SetProperties,200,OK,setUp Thread Group 1-1,text,true
HTTP-Warmup,200,OK,Thread Group 1-1,text,true
HTTP_Request_REUSE,200,OK,Thread Group 1-1,text,true
HTTP_Request_REUSE_2,200,OK,Thread Group 1-1,text,true
HTTP_Request_REUSE_AFTER_VALIDATE,200,OK,Thread Group 1-1,text,true
HTTP_Request_NO_REUSE,200,OK,Thread Group 1-1,text,true
HTTP_Request_NO_REUSE,200,OK,Thread Group 1-1,text,true

        <https://builds.apache.org/job/JMeter%20Windows/ws/trunk\bin\TestKeepAlive.csv>
        JSPP_SetProperties,200,OK,setUp Thread Group 1-1,text,true
HTTP-Warmup,200,OK,Thread Group 1-1,text,true
HTTP_Request_REUSE,200,OK,Thread Group 1-1,text,true
HTTP_Request_REUSE_2,200,OK,Thread Group 1-1,text,false
HTTP_Request_REUSE_AFTER_VALIDATE,200,OK,Thread Group 1-1,text,false
HTTP_Request_NO_REUSE,200,OK,Thread Group 1-1,text,false
HTTP_Request_NO_REUSE,200,OK,Thread Group 1-1,text,true'.
Target 'batch_scripts' failed with message 'The following error occurred while executing this
line:
<https://builds.apache.org/job/JMeter%20Windows/ws/trunk\build.xml>:2762: CSV Files
are not identical.
        <https://builds.apache.org/job/JMeter%20Windows/ws/trunk\bin\testfiles\TestKeepAlive.csv>
        JSPP_SetProperties,200,OK,setUp Thread Group 1-1,text,true
HTTP-Warmup,200,OK,Thread Group 1-1,text,true
HTTP_Request_REUSE,200,OK,Thread Group 1-1,text,true
HTTP_Request_REUSE_2,200,OK,Thread Group 1-1,text,true
HTTP_Request_REUSE_AFTER_VALIDATE,200,OK,Thread Group 1-1,text,true
HTTP_Request_NO_REUSE,200,OK,Thread Group 1-1,text,true
HTTP_Request_NO_REUSE,200,OK,Thread Group 1-1,text,true

        <https://builds.apache.org/job/JMeter%20Windows/ws/trunk\bin\TestKeepAlive.csv>
        JSPP_SetProperties,200,OK,setUp Thread Group 1-1,text,true
HTTP-Warmup,200,OK,Thread Group 1-1,text,true
HTTP_Request_REUSE,200,OK,Thread Group 1-1,text,true
HTTP_Request_REUSE_2,200,OK,Thread Group 1-1,text,false
HTTP_Request_REUSE_AFTER_VALIDATE,200,OK,Thread Group 1-1,text,false
HTTP_Request_NO_REUSE,200,OK,Thread Group 1-1,text,false
HTTP_Request_NO_REUSE,200,OK,Thread Group 1-1,text,true'.
Cannot execute '_allbatchtests' - 'batch_scripts' failed or was not executed.
Cannot execute 'test' - '_allbatchtests' failed or was not executed.

download_checkstyle:

_process_checkstyle_jars:

_check_exists:

_check_jarfile:
     [echo] Checking checkstyle-8.5-all.jar
     [echo] Deleting checkstyle-8.5-all.jar (excluding checkstyle-8.5-all.jar)

setproxy:

_get_jarfile:

setproxy:

_get_zipfile:

checkstyle:

_process_checkstyle_jars:

_check_exists:

_check_jarfile:
[checkstyle] Running Checkstyle 8.5 on 1458 files

BUILD FAILED
<https://builds.apache.org/job/JMeter%20Windows/ws/trunk\build.xml>:2950: The following
error occurred while executing this line:
<https://builds.apache.org/job/JMeter%20Windows/ws/trunk\build.xml>:2762: CSV Files
are not identical.
        <https://builds.apache.org/job/JMeter%20Windows/ws/trunk\bin\testfiles\TestKeepAlive.csv>
        JSPP_SetProperties,200,OK,setUp Thread Group 1-1,text,true
HTTP-Warmup,200,OK,Thread Group 1-1,text,true
HTTP_Request_REUSE,200,OK,Thread Group 1-1,text,true
HTTP_Request_REUSE_2,200,OK,Thread Group 1-1,text,true
HTTP_Request_REUSE_AFTER_VALIDATE,200,OK,Thread Group 1-1,text,true
HTTP_Request_NO_REUSE,200,OK,Thread Group 1-1,text,true
HTTP_Request_NO_REUSE,200,OK,Thread Group 1-1,text,true

        <https://builds.apache.org/job/JMeter%20Windows/ws/trunk\bin\TestKeepAlive.csv>
        JSPP_SetProperties,200,OK,setUp Thread Group 1-1,text,true
HTTP-Warmup,200,OK,Thread Group 1-1,text,true
HTTP_Request_REUSE,200,OK,Thread Group 1-1,text,true
HTTP_Request_REUSE_2,200,OK,Thread Group 1-1,text,false
HTTP_Request_REUSE_AFTER_VALIDATE,200,OK,Thread Group 1-1,text,false
HTTP_Request_NO_REUSE,200,OK,Thread Group 1-1,text,false
HTTP_Request_NO_REUSE,200,OK,Thread Group 1-1,text,true

Total time: 10 minutes 5 seconds
Build step 'Invoke Ant' marked build as failure

Mime
View raw message