jmeter-dev mailing list archives

Site index · List index
Message view « Date » · « Thread »
Top « Date » · « Thread »
From Apache Jenkins Server <jenk...@builds.apache.org>
Subject Build failed in Jenkins: JMeter-trunk #6616
Date Tue, 23 Jan 2018 21:47:26 GMT
See <https://builds.apache.org/job/JMeter-trunk/6616/display/redirect?page=changes>

Changes:

[pmouawad] Bug 62039 - Distributed testing : Provide ability to use SSL
Fix bad patching
Add keystore for tests
Bugzilla Id: 62039

[pmouawad] Bug 62039 - Distributed testing : Provide ability to use SSL
Bugzilla Id: 62039

[fschumacher] Use a setenv.sh script if available to preset variables when starting JMeter
with bin/jmeter.

Bugzilla Id: 62026

------------------------------------------
[...truncated 647.99 KB...]
    [junit] Tests run: 5, Failures: 0, Errors: 0, Skipped: 0, Time elapsed: 0.925 sec
    [junit] Running org.apache.jmeter.functions.TestJexl2Function
    [junit] Tests run: 5, Failures: 0, Errors: 0, Skipped: 0, Time elapsed: 1.168 sec
    [junit] Running org.apache.jmeter.functions.TestJexl3Function
    [junit] Tests run: 5, Failures: 0, Errors: 0, Skipped: 0, Time elapsed: 1.419 sec
    [junit] Running org.apache.jmeter.functions.TestMachineIPName
    [junit] Tests run: 5, Failures: 0, Errors: 0, Skipped: 0, Time elapsed: 1.025 sec
    [junit] Running org.apache.jmeter.functions.TestRandomFromMultipleVars
    [junit] Tests run: 4, Failures: 0, Errors: 0, Skipped: 0, Time elapsed: 1.042 sec
    [junit] Running org.apache.jmeter.functions.TestRegexFunction
    [junit] Tests run: 22, Failures: 0, Errors: 0, Skipped: 0, Time elapsed: 1.055 sec
    [junit] Running org.apache.jmeter.functions.TestSamplerNameFunction
    [junit] Tests run: 2, Failures: 0, Errors: 0, Skipped: 0, Time elapsed: 0.963 sec
    [junit] Running org.apache.jmeter.functions.TestSetProperty
    [junit] Tests run: 3, Failures: 0, Errors: 0, Skipped: 0, Time elapsed: 0.988 sec
    [junit] Running org.apache.jmeter.functions.TestSimpleFunctions
    [junit] Tests run: 15, Failures: 0, Errors: 0, Skipped: 0, Time elapsed: 1.074 sec
    [junit] Running org.apache.jmeter.functions.TestTimeFunction
    [junit] Tests run: 15, Failures: 0, Errors: 0, Skipped: 0, Time elapsed: 0.99 sec
    [junit] Running org.apache.jmeter.functions.TestTimeRandomDateFunction
    [junit] Tests run: 14, Failures: 0, Errors: 0, Skipped: 0, Time elapsed: 1.407 sec
    [junit] Running org.apache.jmeter.functions.TestTimeShiftFunction
    [junit] Tests run: 11, Failures: 0, Errors: 0, Skipped: 0, Time elapsed: 1.394 sec
    [junit] Running org.apache.jmeter.functions.TestUrlEncodeDecode
    [junit] Tests run: 3, Failures: 0, Errors: 0, Skipped: 0, Time elapsed: 1.017 sec
    [junit] Running org.apache.jmeter.functions.VariableTest
    [junit] Tests run: 1, Failures: 0, Errors: 0, Skipped: 0, Time elapsed: 1.012 sec
    [junit] Running org.apache.jmeter.gui.action.TestLoad
    [junit] Tests run: 80, Failures: 0, Errors: 0, Skipped: 0, Time elapsed: 3.128 sec
    [junit] Running org.apache.jmeter.gui.action.TestSave
    [junit] Tests run: 1, Failures: 0, Errors: 0, Skipped: 0, Time elapsed: 1.57 sec
    [junit] Running org.apache.jmeter.gui.logging.TestGuiLogEventAppender
    [junit] Tests run: 1, Failures: 0, Errors: 0, Skipped: 0, Time elapsed: 1.562 sec
    [junit] Running org.apache.jmeter.gui.util.JSyntaxTextAreaTest
    [junit] Tests run: 2, Failures: 0, Errors: 0, Skipped: 0, Time elapsed: 0.655 sec
    [junit] Running org.apache.jmeter.junit.JMeterTest
    [junit] Tests run: 709, Failures: 0, Errors: 0, Skipped: 0, Time elapsed: 1.897 sec
    [junit] Running org.apache.jmeter.listeners.TestResultAction
    [junit] Tests run: 5, Failures: 0, Errors: 0, Skipped: 0, Time elapsed: 0.097 sec
    [junit] Running org.apache.jmeter.protocol.http.config.MultipartUrlConfigTest
    [junit] Tests run: 3, Failures: 0, Errors: 0, Skipped: 0, Time elapsed: 1.783 sec
    [junit] Running org.apache.jmeter.protocol.http.config.UrlConfigTest
    [junit] Tests run: 2, Failures: 0, Errors: 0, Skipped: 0, Time elapsed: 0.179 sec
    [junit] Running org.apache.jmeter.protocol.http.control.TestAuthManager
    [junit] Tests run: 6, Failures: 0, Errors: 0, Skipped: 0, Time elapsed: 0.142 sec
    [junit] Running org.apache.jmeter.protocol.http.control.TestAuthorization
    [junit] Tests run: 1, Failures: 0, Errors: 0, Skipped: 0, Time elapsed: 1.574 sec
    [junit] Running org.apache.jmeter.protocol.http.control.TestCacheManagerHC4
    [junit] Tests run: 24, Failures: 0, Errors: 0, Skipped: 0, Time elapsed: 12.829 sec
    [junit] Running org.apache.jmeter.protocol.http.control.TestCacheManagerUrlConnection
    [junit] Tests run: 23, Failures: 0, Errors: 0, Skipped: 0, Time elapsed: 12.79 sec
    [junit] Running org.apache.jmeter.protocol.http.control.TestDNSCacheManager
    [junit] Tests run: 12, Failures: 0, Errors: 0, Skipped: 0, Time elapsed: 0.432 sec
    [junit] Running org.apache.jmeter.protocol.http.control.TestHC4CookieManager
    [junit] Tests run: 33, Failures: 0, Errors: 0, Skipped: 0, Time elapsed: 0.334 sec
    [junit] Running org.apache.jmeter.protocol.http.control.TestHTTPMirrorThread
    [junit] Tests run: 9, Failures: 0, Errors: 0, Skipped: 0, Time elapsed: 1.128 sec
    [junit] Running org.apache.jmeter.protocol.http.control.gui.TestHttpTestSampleGui
    [junit] Tests run: 1, Failures: 0, Errors: 0, Skipped: 0, Time elapsed: 2.687 sec
    [junit] Running org.apache.jmeter.protocol.http.modifier.TestAnchorModifier
    [junit] Tests run: 18, Failures: 0, Errors: 0, Skipped: 0, Time elapsed: 0.989 sec
    [junit] Running org.apache.jmeter.protocol.http.modifier.TestURLRewritingModifier
    [junit] Tests run: 17, Failures: 0, Errors: 0, Skipped: 0, Time elapsed: 0.207 sec
    [junit] Running org.apache.jmeter.protocol.http.parser.TestBaseParser
    [junit] Tests run: 2, Failures: 0, Errors: 0, Skipped: 0, Time elapsed: 1.61 sec
    [junit] Running org.apache.jmeter.protocol.http.parser.TestBug60842HtmlParser
    [junit] Tests run: 42, Failures: 0, Errors: 0, Skipped: 0, Time elapsed: 0.577 sec
    [junit] Running org.apache.jmeter.protocol.http.parser.TestCssParser
    [junit] Tests run: 4, Failures: 0, Errors: 0, Skipped: 0, Time elapsed: 0.976 sec
    [junit] Running org.apache.jmeter.protocol.http.parser.TestHTMLParser
    [junit] Tests run: 103, Failures: 0, Errors: 0, Skipped: 0, Time elapsed: 1.338 sec
    [junit] Running org.apache.jmeter.protocol.http.parser.TestHtmlParsingUtils
    [junit] Tests run: 6, Failures: 0, Errors: 0, Skipped: 0, Time elapsed: 0.363 sec
    [junit] Running org.apache.jmeter.protocol.http.proxy.TestHttpRequestHdr
    [junit] Tests run: 10, Failures: 0, Errors: 0, Skipped: 0, Time elapsed: 1.905 sec
    [junit] Running org.apache.jmeter.protocol.http.proxy.TestProxyControl
    [junit] Tests run: 7, Failures: 0, Errors: 0, Skipped: 0, Time elapsed: 2.024 sec
    [junit] Running org.apache.jmeter.protocol.http.sampler.PackageTest
    [junit] Tests run: 1, Failures: 0, Errors: 0, Skipped: 0, Time elapsed: 2.541 sec
    [junit] Running org.apache.jmeter.protocol.http.sampler.PostWriterTest
    [junit] Tests run: 8, Failures: 0, Errors: 0, Skipped: 0, Time elapsed: 0.324 sec
    [junit] Running org.apache.jmeter.protocol.http.sampler.PutWriterTest
    [junit] Tests run: 2, Failures: 0, Errors: 0, Skipped: 0, Time elapsed: 1.779 sec
    [junit] Running org.apache.jmeter.protocol.http.sampler.TestHTTPSamplers
    [junit] Tests run: 18, Failures: 0, Errors: 0, Skipped: 0, Time elapsed: 1.762 sec
    [junit] Running org.apache.jmeter.protocol.http.sampler.TestHTTPSamplersAgainstHttpMirrorServer
    [junit] Tests run: 52, Failures: 0, Errors: 0, Skipped: 0, Time elapsed: 1.986 sec
    [junit] Running org.apache.jmeter.protocol.http.sampler.TestHttpWebdav
    [junit] Tests run: 2, Failures: 0, Errors: 0, Skipped: 0, Time elapsed: 0.503 sec
    [junit] Running org.apache.jmeter.protocol.http.util.TestHTTPArgument
    [junit] Tests run: 3, Failures: 0, Errors: 0, Skipped: 0, Time elapsed: 1.585 sec
    [junit] Running org.apache.jmeter.protocol.http.util.TestHTTPFileArg
    [junit] Tests run: 3, Failures: 0, Errors: 0, Skipped: 0, Time elapsed: 1.582 sec
    [junit] Running org.apache.jmeter.protocol.http.util.TestHTTPFileArgs
    [junit] Tests run: 5, Failures: 0, Errors: 0, Skipped: 0, Time elapsed: 1.643 sec
    [junit] Running org.apache.jmeter.protocol.http.util.accesslog.TestLogFilter
    [junit] Tests run: 6, Failures: 0, Errors: 0, Skipped: 0, Time elapsed: 0.084 sec
    [junit] Running org.apache.jmeter.protocol.http.util.accesslog.TestSessionFilter
    [junit] Tests run: 3, Failures: 0, Errors: 0, Skipped: 0, Time elapsed: 2.32 sec
    [junit] Running org.apache.jmeter.protocol.http.util.accesslog.TestTCLogParser
    [junit] Tests run: 4, Failures: 0, Errors: 0, Skipped: 0, Time elapsed: 0.1 sec
    [junit] Running org.apache.jmeter.protocol.http.visualizers.RequestViewHTTPTest
    [junit] Tests run: 7, Failures: 0, Errors: 0, Skipped: 0, Time elapsed: 1.661 sec
    [junit] Running org.apache.jmeter.protocol.jms.sampler.PublisherSamplerTest
    [junit] Tests run: 1, Failures: 0, Errors: 0, Skipped: 0, Time elapsed: 1.891 sec
    [junit] Running org.apache.jmeter.protocol.jms.sampler.render.BinaryMessageRendererTest
    [junit] Tests run: 8, Failures: 0, Errors: 0, Skipped: 0, Time elapsed: 1.882 sec
    [junit] Running org.apache.jmeter.protocol.jms.sampler.render.ObjectMessageRendererTest
    [junit] Tests run: 5, Failures: 0, Errors: 0, Skipped: 0, Time elapsed: 2.32 sec
    [junit] Running org.apache.jmeter.protocol.jms.sampler.render.TextMessageRendererTest
    [junit] Tests run: 7, Failures: 0, Errors: 0, Skipped: 0, Time elapsed: 1.867 sec
    [junit] Running org.apache.jmeter.protocol.ldap.config.gui.PackageTest
    [junit] Tests run: 1, Failures: 0, Errors: 0, Skipped: 0, Time elapsed: 2.096 sec
    [junit] Running org.apache.jmeter.protocol.tcp.sampler.BinaryTCPClientImplTest
    [junit] Tests run: 3, Failures: 0, Errors: 0, Skipped: 0, Time elapsed: 1.715 sec
    [junit] Running org.apache.jmeter.protocol.tcp.sampler.LengthPrefixedBinaryTCPClientImplTest
    [junit] Tests run: 2, Failures: 0, Errors: 0, Skipped: 0, Time elapsed: 1.623 sec
    [junit] Running org.apache.jmeter.protocol.tcp.sampler.TCPClientDecoratorTest
    [junit] Tests run: 3, Failures: 0, Errors: 0, Skipped: 0, Time elapsed: 0.446 sec
    [junit] Running org.apache.jmeter.report.core.CsvSampleReaderTest
    [junit] Tests run: 6, Failures: 0, Errors: 0, Skipped: 0, Time elapsed: 0.651 sec
    [junit] Running org.apache.jmeter.report.core.SampleMetadataTest
    [junit] Tests run: 1, Failures: 0, Errors: 0, Skipped: 0, Time elapsed: 0.477 sec
    [junit] Running org.apache.jmeter.report.core.TestCsvSampleWriter
    [junit] Tests run: 5, Failures: 0, Errors: 0, Skipped: 0, Time elapsed: 2.208 sec
    [junit] Running org.apache.jmeter.report.dashboard.ApdexPerTransactionTest
    [junit] Tests run: 7, Failures: 0, Errors: 0, Skipped: 0, Time elapsed: 0.166 sec
    [junit] Running org.apache.jmeter.report.processor.ErrorsSummaryConsumerTest
    [junit] Tests run: 2, Failures: 0, Errors: 0, Skipped: 0, Time elapsed: 1.873 sec
    [junit] Running org.apache.jmeter.report.processor.FieldSampleComparatorTest
    [junit] Tests run: 1, Failures: 0, Errors: 0, Skipped: 0, Time elapsed: 1.713 sec
    [junit] Running org.apache.jmeter.reporters.TestResultSaver
    [junit] Tests run: 5, Failures: 0, Errors: 0, Skipped: 0, Time elapsed: 0.096 sec
    [junit] Running org.apache.jmeter.resources.PackageTest
    [junit] Tests run: 365, Failures: 0, Errors: 0, Skipped: 0, Time elapsed: 1.334 sec
    [junit] Running org.apache.jmeter.resources.TestPropertiesFiles
    [junit] Tests run: 2, Failures: 0, Errors: 0, Skipped: 0, Time elapsed: 0.052 sec
    [junit] Running org.apache.jmeter.samplers.TestSampleResult
    [junit] Tests run: 16, Failures: 0, Errors: 0, Skipped: 0, Time elapsed: 5.572 sec
    [junit] Running org.apache.jmeter.samplers.TestSampleSaveConfiguration
    [junit] Tests run: 7, Failures: 0, Errors: 0, Skipped: 0, Time elapsed: 0.118 sec
    [junit] Running org.apache.jmeter.save.TestCSVSaveService
    [junit] Tests run: 11, Failures: 0, Errors: 0, Skipped: 0, Time elapsed: 0.142 sec
    [junit] Running org.apache.jmeter.save.TestSaveService
    [junit] Tests run: 5, Failures: 0, Errors: 0, Skipped: 0, Time elapsed: 3.514 sec
    [junit] Running org.apache.jmeter.testbeans.gui.PackageTest
    [junit] Tests run: 384, Failures: 0, Errors: 0, Skipped: 0, Time elapsed: 0.708 sec
    [junit] Running org.apache.jmeter.testbeans.gui.TestBooleanPropertyEditor
    [junit] Tests run: 2, Failures: 0, Errors: 0, Skipped: 0, Time elapsed: 0.394 sec
    [junit] Running org.apache.jmeter.testbeans.gui.TestComboStringEditor
    [junit] Tests run: 2, Failures: 0, Errors: 0, Skipped: 0, Time elapsed: 1.974 sec
    [junit] Running org.apache.jmeter.testbeans.gui.TestFieldStringEditor
    [junit] Tests run: 2, Failures: 0, Errors: 0, Skipped: 0, Time elapsed: 1.867 sec
    [junit] Running org.apache.jmeter.testelement.PackageTest
    [junit] Tests run: 2, Failures: 0, Errors: 0, Skipped: 0, Time elapsed: 1.688 sec
    [junit] Running org.apache.jmeter.testelement.TestElementTest
    [junit] Tests run: 134, Failures: 0, Errors: 0, Skipped: 0, Time elapsed: 0.415 sec
    [junit] Running org.apache.jmeter.testelement.TestHeaderManager
    [junit] Tests run: 2, Failures: 0, Errors: 0, Skipped: 0, Time elapsed: 0.105 sec
    [junit] Running org.apache.jmeter.testelement.TestNumberProperty
    [junit] Tests run: 5, Failures: 0, Errors: 0, Skipped: 0, Time elapsed: 1.576 sec
    [junit] Running org.apache.jmeter.testelement.property.AbstractPropertyTest
    [junit] Tests run: 6, Failures: 0, Errors: 0, Skipped: 0, Time elapsed: 1.633 sec
    [junit] Running org.apache.jmeter.testelement.property.PackageTest
    [junit] Tests run: 11, Failures: 0, Errors: 0, Skipped: 0, Time elapsed: 1.623 sec
    [junit] Running org.apache.jmeter.threads.TestJMeterContextService
    [junit] Tests run: 1, Failures: 0, Errors: 0, Skipped: 0, Time elapsed: 0.392 sec
    [junit] Running org.apache.jmeter.threads.TestJMeterThread
    [junit] Tests run: 2, Failures: 0, Errors: 0, Skipped: 0, Time elapsed: 1.656 sec
    [junit] Running org.apache.jmeter.threads.TestTestCompiler
    [junit] Tests run: 1, Failures: 0, Errors: 0, Skipped: 0, Time elapsed: 1.545 sec
    [junit] Running org.apache.jmeter.threads.TestUnmodifiableJMeterVariables
    [junit] Tests run: 17, Failures: 0, Errors: 0, Skipped: 0, Time elapsed: 1.662 sec
    [junit] Running org.apache.jmeter.timers.ConstantThroughputTimerTest
    [junit] Tests run: 9, Failures: 0, Errors: 0, Skipped: 0, Time elapsed: 2.598 sec
    [junit] Running org.apache.jmeter.timers.poissonarrivals.PreciseThroughputTimerTest
    [junit] Tests run: 2, Failures: 0, Errors: 0, Skipped: 0, Time elapsed: 0.131 sec
    [junit] Running org.apache.jmeter.util.JSR223TestElementTest
    [junit] Tests run: 2, Failures: 0, Errors: 0, Skipped: 0, Time elapsed: 2.705 sec
    [junit] Running org.apache.jmeter.util.PackageTest
    [junit] Tests run: 1, Failures: 0, Errors: 0, Skipped: 0, Time elapsed: 1.605 sec
    [junit] Running org.apache.jmeter.util.StringUtilitiesTest
    [junit] Tests run: 5, Failures: 0, Errors: 0, Skipped: 0, Time elapsed: 1.53 sec
    [junit] Running org.apache.jmeter.util.TestJMeterUtils
    [junit] Tests run: 3, Failures: 0, Errors: 0, Skipped: 0, Time elapsed: 1.66 sec
    [junit] Running org.apache.jmeter.util.XPathUtilTest
    [junit] Tests run: 3, Failures: 0, Errors: 0, Skipped: 0, Time elapsed: 1.746 sec
    [junit] Running org.apache.jmeter.visualizers.TestRenderAsJson
    [junit] Tests run: 6, Failures: 0, Errors: 0, Skipped: 0, Time elapsed: 0.544 sec
    [junit] Running org.apache.jmeter.visualizers.TestSampleCompareTo
    [junit] Tests run: 9, Failures: 0, Errors: 0, Skipped: 0, Time elapsed: 0.383 sec
    [junit] Running org.apache.jmeter.visualizers.TestSamplingStatCalculator
    [junit] Tests run: 2, Failures: 0, Errors: 0, Skipped: 0, Time elapsed: 1.663 sec
    [junit] Running org.apache.jmeter.visualizers.backend.SamplerMetricFixedModeTest
    [junit] Tests run: 3, Failures: 0, Errors: 0, Skipped: 0, Time elapsed: 1.838 sec
    [junit] Running org.apache.jmeter.visualizers.backend.SamplerMetricTimedModeTest
    [junit] Tests run: 2, Failures: 0, Errors: 0, Skipped: 0, Time elapsed: 1.78 sec
    [junit] Running org.apache.jorphan.TestFunctorUsers
    [junit] Tests run: 7, Failures: 0, Errors: 0, Skipped: 0, Time elapsed: 0.778 sec
    [junit] Running org.apache.jorphan.TestXMLBuffer
    [junit] Tests run: 4, Failures: 0, Errors: 0, Skipped: 0, Time elapsed: 0.071 sec
    [junit] Running org.apache.jorphan.collections.PackageTest
    [junit] Tests run: 5, Failures: 0, Errors: 0, Skipped: 0, Time elapsed: 0.057 sec
    [junit] Running org.apache.jorphan.exec.TestKeyToolUtils
    [junit] Tests run: 1, Failures: 0, Errors: 0, Skipped: 0, Time elapsed: 0.535 sec
    [junit] Running org.apache.jorphan.gui.ObjectTableModelTest
    [junit] Tests run: 6, Failures: 0, Errors: 0, Skipped: 0, Time elapsed: 1.73 sec
    [junit] Running org.apache.jorphan.gui.ObjectTableSorterTest
    [junit] Tests run: 26, Failures: 0, Errors: 0, Skipped: 0, Time elapsed: 1.802 sec
    [junit] Running org.apache.jorphan.math.TestStatCalculator
    [junit] Tests run: 10, Failures: 0, Errors: 0, Skipped: 2, Time elapsed: 0.47 sec
    [junit] Running org.apache.jorphan.reflect.TestClassFinder
    [junit] Tests run: 10, Failures: 0, Errors: 0, Skipped: 0, Time elapsed: 22.471 sec
    [junit] Running org.apache.jorphan.reflect.TestClassTools
    [junit] Tests run: 4, Failures: 0, Errors: 0, Skipped: 0, Time elapsed: 0.495 sec
    [junit] Running org.apache.jorphan.reflect.TestFunctor
    [junit] Tests run: 6, Failures: 0, Errors: 0, Skipped: 0, Time elapsed: 0.071 sec
    [junit] Running org.apache.jorphan.util.TestConverter
    [junit] Tests run: 8, Failures: 0, Errors: 0, Skipped: 0, Time elapsed: 0.514 sec
    [junit] Running org.apache.jorphan.util.TestJorphanUtils
    [junit] Tests run: 40, Failures: 0, Errors: 0, Skipped: 0, Time elapsed: 0.501 sec

nightlysonar:

checkstyle:

_process_checkstyle_jars:

_check_exists:

_check_jarfile:
[checkstyle] Running Checkstyle 8.5 on 1463 files
[checkstyle] [ERROR] <https://builds.apache.org/job/JMeter-trunk/ws/trunk/src/core/org/apache/jmeter/engine/ClientJMeterEngine.java>:98:51:
Unnecessary parentheses around expression. [UnnecessaryParentheses]
[checkstyle] [ERROR] <https://builds.apache.org/job/JMeter-trunk/ws/trunk/src/core/org/apache/jmeter/rmi/RMIServerSocketFactoryImpl.java>:59:
'if' construct must use '{}'s. [NeedBraces]
[checkstyle] [ERROR] <https://builds.apache.org/job/JMeter-trunk/ws/trunk/src/core/org/apache/jmeter/rmi/RMIServerSocketFactoryImpl.java>:61:
'if' construct must use '{}'s. [NeedBraces]
[checkstyle] [ERROR] <https://builds.apache.org/job/JMeter-trunk/ws/trunk/src/core/org/apache/jmeter/rmi/RMIServerSocketFactoryImpl.java>:63:
'if' construct must use '{}'s. [NeedBraces]
[checkstyle] [ERROR] <https://builds.apache.org/job/JMeter-trunk/ws/trunk/src/core/org/apache/jmeter/rmi/RMIServerSocketFactoryImpl.java>:67:
'if' construct must use '{}'s. [NeedBraces]
[checkstyle] [ERROR] <https://builds.apache.org/job/JMeter-trunk/ws/trunk/src/core/org/apache/jmeter/rmi/RMIServerSocketFactoryImpl.java>:69:
'if' construct must use '{}'s. [NeedBraces]

BUILD FAILED
<https://builds.apache.org/job/JMeter-trunk/ws/trunk/build.xml>:3562: Got 6 errors and
0 warnings.

Total time: 22 minutes 13 seconds
Build step 'Invoke Ant' marked build as failure
[locks-and-latches] Releasing all the locks
[locks-and-latches] All the locks released
Archiving artifacts
[Fast Archiver] Compressed 124.43 MB of artifacts by 28.4% relative to #6615
Recording test results

Mime
View raw message