jmeter-dev mailing list archives

Site index · List index
Message view « Date » · « Thread »
Top « Date » · « Thread »
From Apache Jenkins Server <jenk...@builds.apache.org>
Subject Build failed in Jenkins: JMeter-trunk #6741
Date Thu, 05 Apr 2018 17:32:08 GMT
See <https://builds.apache.org/job/JMeter-trunk/6741/display/redirect?page=changes>

Changes:

[pmouawad] Fix issue in tests:
- Method POST is not set which leads to  HTTPSamplerBase#getUseMultipartForPost() returning
false when it shouldn't

------------------------------------------
[...truncated 154.48 KB...]
  [javadoc] Loading source files for package org.apache.jmeter.protocol.jms.sampler...
  [javadoc] Loading source files for package org.apache.jmeter.protocol.jms.sampler.render...
  [javadoc] Loading source files for package org.apache.jmeter.protocol.system...
  [javadoc] Loading source files for package org.apache.jmeter.protocol.system.gui...
  [javadoc] Loading source files for package org.apache.jmeter.protocol.mongodb.config...
  [javadoc] Loading source files for package org.apache.jmeter.protocol.mongodb.mongo...
  [javadoc] Loading source files for package org.apache.jmeter.protocol.mongodb.sampler...
  [javadoc] Constructing Javadoc information...
  [javadoc] Standard Doclet version 1.8.0_152
  [javadoc] Building tree for all the packages and classes...
  [javadoc] <https://builds.apache.org/job/JMeter-trunk/ws/trunk/src/core/org/apache/jmeter/control/IteratingController.java>:43:
error: identifier expected
  [javadoc]      * @param 
  [javadoc]        ^
  [javadoc] <https://builds.apache.org/job/JMeter-trunk/ws/trunk/src/core/org/apache/jmeter/control/IteratingController.java>:45:
warning: no @param for iterCount
  [javadoc]     default void updateIterationIndex(String elementName, int iterCount) {
  [javadoc]                  ^
  [javadoc] <https://builds.apache.org/job/JMeter-trunk/ws/trunk/src/core/org/apache/jmeter/gui/tree/JMeterTreeNode.java>:94:
warning: no @param for tagged
  [javadoc]     public void setChildrenNodesHaveMatched(boolean tagged) {
  [javadoc]                 ^
  [javadoc] <https://builds.apache.org/job/JMeter-trunk/ws/trunk/src/core/org/apache/jmeter/gui/tree/JMeterTreeNode.java>:132:
warning: no @return
  [javadoc]     public boolean isChildrenMarkedBySearch() {
  [javadoc]                    ^
  [javadoc] <https://builds.apache.org/job/JMeter-trunk/ws/trunk/src/core/org/apache/jmeter/samplers/SampleResult.java>:1482:
warning - Tag @link: can't find setTestLogicalAction(TestLogicalAction) in org.apache.jmeter.samplers.SampleResult
  [javadoc] <https://builds.apache.org/job/JMeter-trunk/ws/trunk/src/core/org/apache/jmeter/threads/JMeterContext.java>:212:
error: @param name not found
  [javadoc]      * @param startNextIterationOfCurrentLoop start next iteration of current
loop in which this component is present
  [javadoc]               ^
  [javadoc] <https://builds.apache.org/job/JMeter-trunk/ws/trunk/src/core/org/apache/jmeter/threads/JMeterContext.java>:214:
warning: no @param for actionOnExecution
  [javadoc]     public void setTestLogicalAction(TestLogicalAction actionOnExecution) {
  [javadoc]                 ^
  [javadoc] <https://builds.apache.org/job/JMeter-trunk/ws/trunk/src/core/org/apache/jmeter/threads/JMeterContext.java>:241:
error: reference not found
  [javadoc]      * @deprecated use {@link JMeterContext#isTestLogicalAction()}
  [javadoc]                               ^
  [javadoc] <https://builds.apache.org/job/JMeter-trunk/ws/trunk/src/core/org/apache/jmeter/threads/JMeterContext.java>:244:
warning - Tag @link: can't find isTestLogicalAction() in org.apache.jmeter.threads.JMeterContext
  [javadoc] <https://builds.apache.org/job/JMeter-trunk/ws/trunk/src/protocol/http/org/apache/jmeter/protocol/http/control/AuthManager.java>:465:
warning: no description for @param
  [javadoc]      * @param auth
  [javadoc]        ^
  [javadoc] <https://builds.apache.org/job/JMeter-trunk/ws/trunk/src/protocol/http/org/apache/jmeter/protocol/http/control/AuthManager.java>:466:
warning: no description for @param
  [javadoc]      * @param url
  [javadoc]        ^
  [javadoc] <https://builds.apache.org/job/JMeter-trunk/ws/trunk/src/protocol/http/org/apache/jmeter/protocol/http/control/AuthManager.java>:467:
warning: no description for @param
  [javadoc]      * @param localContext 
  [javadoc]        ^
  [javadoc] <https://builds.apache.org/job/JMeter-trunk/ws/trunk/src/protocol/http/org/apache/jmeter/protocol/http/control/AuthManager.java>:468:
warning: no description for @param
  [javadoc]      * @param credentialsProvider
  [javadoc]        ^
  [javadoc] <https://builds.apache.org/job/JMeter-trunk/ws/trunk/src/protocol/http/org/apache/jmeter/protocol/http/control/AuthManager.java>:469:
warning: no description for @param
  [javadoc]      * @param localhost
  [javadoc]        ^
  [javadoc] <https://builds.apache.org/job/JMeter-trunk/ws/trunk/src/protocol/http/org/apache/jmeter/protocol/http/sampler/hc/LaxDeflateInputStream.java>:40:
warning: no description for @param
  [javadoc]      * @param wrapped
  [javadoc]        ^
  [javadoc] <https://builds.apache.org/job/JMeter-trunk/ws/trunk/src/protocol/http/org/apache/jmeter/protocol/http/sampler/hc/LaxDeflateInputStream.java>:41:
warning: no description for @param
  [javadoc]      * @param relax
  [javadoc]        ^
  [javadoc] <https://builds.apache.org/job/JMeter-trunk/ws/trunk/src/protocol/http/org/apache/jmeter/protocol/http/sampler/hc/LaxDeflateInputStream.java>:42:
warning: no description for @throws
  [javadoc]      * @throws IOException
  [javadoc]        ^
  [javadoc] <https://builds.apache.org/job/JMeter-trunk/ws/trunk/src/jorphan/org/apache/jorphan/util/JOrphanUtils.java>:611:
warning: no description for @param
  [javadoc]      * @param deleteFolderIfExists 
  [javadoc]        ^
  [javadoc] Building index for all the packages and classes...
  [javadoc] Building index for all classes...
  [javadoc] Generating <https://builds.apache.org/job/JMeter-trunk/ws/trunk/docs/api/help-doc.html...>
  [javadoc] 3 errors
  [javadoc] 15 warnings

compile-tests:
    [javac] Compiling 188 source files to <https://builds.apache.org/job/JMeter-trunk/ws/trunk/build/test>
    [javac] Note: Some input files use or override a deprecated API.
    [javac] Note: Recompile with -Xlint:deprecation for details.
  [groovyc] Compiling 19 source files to <https://builds.apache.org/job/JMeter-trunk/ws/trunk/build/test>
  [groovyc] <https://builds.apache.org/job/JMeter-trunk/ws/trunk/test/src/org/apache/jmeter/assertions/MD5HexAssertionSpec.groovy>
  [groovyc] <https://builds.apache.org/job/JMeter-trunk/ws/trunk/test/src/org/apache/jmeter/control/RandomOrderControllerSpec.groovy>
  [groovyc] <https://builds.apache.org/job/JMeter-trunk/ws/trunk/test/src/org/apache/jmeter/control/RunTimeSpec.groovy>
  [groovyc] <https://builds.apache.org/job/JMeter-trunk/ws/trunk/test/src/org/apache/jmeter/control/ThroughputControllerSpec.groovy>
  [groovyc] <https://builds.apache.org/job/JMeter-trunk/ws/trunk/test/src/org/apache/jmeter/engine/util/PackageSpec.groovy>
  [groovyc] <https://builds.apache.org/job/JMeter-trunk/ws/trunk/test/src/org/apache/jmeter/extractor/BoundaryExtractorSpec.groovy>
  [groovyc] <https://builds.apache.org/job/JMeter-trunk/ws/trunk/test/src/org/apache/jmeter/functions/ChangeCaseSpec.groovy>
  [groovyc] <https://builds.apache.org/job/JMeter-trunk/ws/trunk/test/src/org/apache/jmeter/gui/util/MenuFactorySpec.groovy>
  [groovyc] <https://builds.apache.org/job/JMeter-trunk/ws/trunk/test/src/org/apache/jmeter/junit/spock/JMeterSpec.groovy>
  [groovyc] <https://builds.apache.org/job/JMeter-trunk/ws/trunk/test/src/org/apache/jmeter/protocol/http/util/HTTPUtilsSpec.groovy>
  [groovyc] <https://builds.apache.org/job/JMeter-trunk/ws/trunk/test/src/org/apache/jmeter/protocol/jdbc/sampler/JDBCSamplerSpec.groovy>
  [groovyc] <https://builds.apache.org/job/JMeter-trunk/ws/trunk/test/src/org/apache/jmeter/report/core/SampleMetadataParserSpec.groovy>
  [groovyc] <https://builds.apache.org/job/JMeter-trunk/ws/trunk/test/src/org/apache/jmeter/report/processor/ApdexSummaryConsumerSpec.groovy>
  [groovyc] <https://builds.apache.org/job/JMeter-trunk/ws/trunk/test/src/org/apache/jmeter/report/processor/ListResultDataSpec.groovy>
  [groovyc] <https://builds.apache.org/job/JMeter-trunk/ws/trunk/test/src/org/apache/jmeter/report/processor/Top5ErrorsBySamplerConsumerSpec.groovy>
  [groovyc] <https://builds.apache.org/job/JMeter-trunk/ws/trunk/test/src/org/apache/jmeter/report/processor/Top5ErrorsSummaryDataSpec.groovy>
  [groovyc] <https://builds.apache.org/job/JMeter-trunk/ws/trunk/test/src/org/apache/jmeter/services/FileServerSpec.groovy>
  [groovyc] <https://builds.apache.org/job/JMeter-trunk/ws/trunk/test/src/org/apache/jmeter/timers/UniformRandomTimerSpec.groovy>
  [groovyc] <https://builds.apache.org/job/JMeter-trunk/ws/trunk/test/src/org/apache/jorphan/io/TextFileSpec.groovy>

_test:
     [echo] 
     [echo]    gump.run = false
     [echo]    java.awt.headless = true
     [echo]    test.headless = true
     [echo]    user.dir = <https://builds.apache.org/job/JMeter-trunk/ws/trunk>
     [echo]    basedir = <https://builds.apache.org/job/JMeter-trunk/ws/trunk>
     [echo]    test dir = build/test
     [echo]    test dir gump = build/test
     [echo]    testsaveservice.saveout = ${testsaveservice.saveout}
     [echo]    test.encoding = UTF-8
     [echo]     
     [java] SLF4J: Class path contains multiple SLF4J bindings.
     [java] SLF4J: Found binding in [jar:<https://builds.apache.org/job/JMeter-trunk/ws/trunk/lib/log4j-slf4j-impl-2.10.0.jar!/org/slf4j/impl/StaticLoggerBinder.class]>
     [java] SLF4J: Found binding in [jar:<https://builds.apache.org/job/JMeter-trunk/ws/trunk/lib/opt/activemq-all-5.15.2.jar!/org/slf4j/impl/StaticLoggerBinder.class]>
     [java] SLF4J: See http://www.slf4j.org/codes.html#multiple_bindings for an explanation.
     [java] SLF4J: Actual binding is of type [org.apache.logging.slf4j.Log4jLoggerFactory]
     [java] Setting JMeterHome: <https://builds.apache.org/job/JMeter-trunk/ws/trunk>
     [java] Using initializeProperties() from org.apache.jmeter.util.JMeterUtils
     [java] Setting up initial properties using: <https://builds.apache.org/job/JMeter-trunk/ws/trunk/bin/jmeter.properties>
     [java] Initializing Properties: <https://builds.apache.org/job/JMeter-trunk/ws/trunk/bin/jmeter.properties>
     [java] JMeterVersion=r1828454
     [java] java.version=1.8.0_152
     [java] java.home=/usr/local/asfpackages/java/jdk1.8.0_152/jre
     [java] file.encoding=UTF-8
     [java] default encoding=UTF-8
     [java] user.dir=<https://builds.apache.org/job/JMeter-trunk/ws/trunk/bin>
     [java] Locale=en_US
     [java] os.name=Linux
     [java] os.version=4.4.0-43-generic
     [java] JCE max key length = 128
     [java] +++++++++++
     [java] java.awt.headless=true
     [java] java.awt.graphicsenv=sun.awt.X11GraphicsEnvironment
     [java] ------------
     [java] Searching junit tests in : build/test
     [java] o.a.j.junit.JMeterTest INFO: JMeterGUIComponent: skipping some tests org.apache.jmeter.testbeans.gui.TestBeanGUI
     [java] o.a.j.junit.JMeterTest Error creating org.apache.jmeter.SplashScreen java.awt.HeadlessException
     [java] o.a.j.junit.JMeterTest Error creating org.apache.jmeter.config.gui.RowDetailDialog
java.awt.HeadlessException
     [java] o.a.j.junit.JMeterTest Error creating org.apache.jmeter.functions.gui.FunctionHelper
java.awt.HeadlessException
     [java] o.a.j.junit.JMeterTest WARN: java.io.Serializable: NoSuchMethodException  org.apache.jmeter.gui.GlobalUndoableEdit,
missing empty Constructor or Constructor with Object parameter
     [java] o.a.j.junit.JMeterTest Error creating org.apache.jmeter.gui.MainFrame java.awt.HeadlessException
     [java] o.a.j.junit.JMeterTest Error creating org.apache.jmeter.gui.SavePropertyDialog
java.awt.HeadlessException
     [java] o.a.j.junit.JMeterTest Error creating org.apache.jmeter.gui.action.SearchTreeDialog
java.awt.HeadlessException
     [java] o.a.j.junit.JMeterTest Error creating org.apache.jmeter.gui.action.SelectTemplatesDialog
java.awt.HeadlessException
     [java] o.a.j.junit.JMeterTest Error creating org.apache.jmeter.gui.util.EscapeDialog
java.awt.HeadlessException
     [java] o.a.j.junit.JMeterTest Error creating org.apache.jmeter.gui.util.JSyntaxTextArea
java.awt.HeadlessException
     [java] o.a.j.junit.JMeterTest Error creating org.apache.jmeter.protocol.http.proxy.gui.RecorderDialog
java.awt.HeadlessException
     [java] o.a.j.junit.JMeterTest WARN: java.io.Serializable: NoSuchMethodException  org.apache.jmeter.rmi.RMIServerSocketFactoryImpl,
missing empty Constructor or Constructor with Object parameter
     [java] o.a.j.junit.JMeterTest WARN: java.io.Serializable: NoSuchMethodException  org.apache.jmeter.rmi.SSLRMIServerSocketFactory,
missing empty Constructor or Constructor with Object parameter
     [java] java.rmi.server.hostname=null
     [java] asf926.gq1.ygridcore.net/67.195.81.162
     [java] isSiteLocalAddress:false
     [java] isAnyLocalAddress:false
     [java] isLinkLocalAddress:false
     [java] isLoopbackAddress:false
     [java] isMulticastAddress:false
     [java] localhost/127.0.0.1
     [java] isSiteLocalAddress:false
     [java] isAnyLocalAddress:false
     [java] isLinkLocalAddress:false
     [java] isLoopbackAddress:true
     [java] isMulticastAddress:false
     [java] ====================
     [java] asf926.gq1.ygridcore.net/67.195.81.162
     [java] isSiteLocalAddress:false
     [java] isAnyLocalAddress:false
     [java] isLinkLocalAddress:false
     [java] isLoopbackAddress:false
     [java] isMulticastAddress:false
     [java] Interfaces: {name:veth34257ae (veth34257ae) => [/fe80:0:0:0:8c5e:aff:fe4f:f70b%veth34257ae/64
[null]], name:br-88c84734ad97 (br-88c84734ad97) => [/fe80:0:0:0:42:2eff:fe5a:1e4a%br-88c84734ad97/64
[null], /172.25.0.1/16 [/0.0.0.0]], name:br-2847b734297a (br-2847b734297a) => [/fe80:0:0:0:42:58ff:fe3c:8a20%br-2847b734297a/64
[null], /172.24.0.1/16 [/0.0.0.0]], name:br-8f89c37d35d4 (br-8f89c37d35d4) => [/fe80:0:0:0:42:6fff:feb1:eb8a%br-8f89c37d35d4/64
[null], /172.23.0.1/16 [/0.0.0.0]], name:br-19ba39e54fd6 (br-19ba39e54fd6) => [/fe80:0:0:0:42:5fff:fee6:7e8%br-19ba39e54fd6/64
[null], /172.22.0.1/16 [/0.0.0.0]], name:br-2df9e3103997 (br-2df9e3103997) => [/fe80:0:0:0:42:9eff:fee9:8013%br-2df9e3103997/64
[null], /172.21.0.1/16 [/0.0.0.0]], name:br-0b5bcb7fc8b2 (br-0b5bcb7fc8b2) => [/fe80:0:0:0:42:d3ff:fea5:a091%br-0b5bcb7fc8b2/64
[null], /172.20.0.1/16 [/0.0.0.0]], name:br-a172e0105980 (br-a172e0105980) => [/fe80:0:0:0:42:7dff:fe31:5b26%br-a172e0105980/64
[null], /172.19.0.1/16 [/0.0.0.0]], name:br-7a33973d4cd9 (br-7a33973d4cd9) => [/fe80:0:0:0:42:dfff:fe2c:a5e%br-7a33973d4cd9/64
[null], /172.18.0.1/16 [/0.0.0.0]], name:docker0 (docker0) => [/fe80:0:0:0:42:ccff:fef4:85be%docker0/64
[null], /172.17.0.1/16 [/0.0.0.0]], name:eno1 (eno1) => [/fe80:0:0:0:92b1:1cff:fe38:6ea1%eno1/64
[null], /67.195.81.162/26 [/67.195.81.191]], name:lo (lo) => [/0:0:0:0:0:0:0:1%lo/128 [null],
/127.0.0.1/8 [null]]}
     [java] java.rmi.server.hostname=null
     [java] Security framework of XStream not initialized, XStream is probably vulnerable.
     [java] Security framework of XStream not initialized, XStream is probably vulnerable.
     [java] Security framework of XStream not initialized, XStream is probably vulnerable.
     [java] Security framework of XStream not initialized, XStream is probably vulnerable.
     [java] ........................................................................................................................................................I..........................................................................................................................................................................................................................................................................................................................................................................................................................................................................................................................................................................................................................................................................................................................................................................................................................................................................................................................................................................................................................................................................................................................................................................................................................................................................................................................................................................................................................................................................................................................................................................................................................................................................................................EE......................................................................................................................................................................................................................................................................................................................................................................................................................................................................................................................................................................................................................................Ignoring
missing junit_failure_default_code=0001 in org/apache/jmeter/resources/messages_fr.properties
     [java] Ignoring missing aggregate_report_90=90% in org/apache/jmeter/resources/messages_fr.properties
     [java] Ignoring missing junit_error_default_code=9999 in org/apache/jmeter/resources/messages_fr.properties
     [java] Ignoring missing junit_success_default_code=1000 in org/apache/jmeter/resources/messages_fr.properties
     [java] ..................................................................................................................................................................................................................................................................................................................................................................................................................................................................................................................................................................................................................................................................................................................................................................II.........................................................................
     [java] Time: 25.421
     [java] There were 2 failures:
     [java] 1) testSetHeaders_NoFilename(org.apache.jmeter.protocol.http.sampler.PostWriterTest)
     [java] org.junit.ComparisonFailure: expected:<[application/x-www-form-urlencoded]>
but was:<[multipart/form-data; boundary=---------------------------7d159c1302d0y0]>
     [java] 	at org.junit.Assert.assertEquals(Assert.java:115)
     [java] 	at org.junit.Assert.assertEquals(Assert.java:144)
     [java] 	at org.apache.jmeter.protocol.http.sampler.PostWriterTest.checkContentTypeUrlEncoded(PostWriterTest.java:924)
     [java] 	at org.apache.jmeter.protocol.http.sampler.PostWriterTest.testSetHeaders_NoFilename(PostWriterTest.java:616)
     [java] 	at sun.reflect.NativeMethodAccessorImpl.invoke0(Native Method)
     [java] 	at sun.reflect.NativeMethodAccessorImpl.invoke(NativeMethodAccessorImpl.java:62)
     [java] 	at sun.reflect.DelegatingMethodAccessorImpl.invoke(DelegatingMethodAccessorImpl.java:43)
     [java] 	at java.lang.reflect.Method.invoke(Method.java:498)
     [java] 	at org.junit.runners.model.FrameworkMethod$1.runReflectiveCall(FrameworkMethod.java:50)
     [java] 	at org.junit.internal.runners.model.ReflectiveCallable.run(ReflectiveCallable.java:12)
     [java] 	at org.junit.runners.model.FrameworkMethod.invokeExplosively(FrameworkMethod.java:47)
     [java] 	at org.junit.internal.runners.statements.InvokeMethod.evaluate(InvokeMethod.java:17)
     [java] 	at org.junit.internal.runners.statements.RunBefores.evaluate(RunBefores.java:26)
     [java] 	at org.junit.internal.runners.statements.RunAfters.evaluate(RunAfters.java:27)
     [java] 	at org.junit.runners.ParentRunner.runLeaf(ParentRunner.java:325)
     [java] 	at org.junit.runners.BlockJUnit4ClassRunner.runChild(BlockJUnit4ClassRunner.java:78)
     [java] 	at org.junit.runners.BlockJUnit4ClassRunner.runChild(BlockJUnit4ClassRunner.java:57)
     [java] 	at org.junit.runners.ParentRunner$3.run(ParentRunner.java:290)
     [java] 	at java.util.concurrent.Executors$RunnableAdapter.call(Executors.java:511)
     [java] 	at java.util.concurrent.FutureTask.run(FutureTask.java:266)
     [java] 	at java.util.concurrent.ThreadPoolExecutor.runWorker(ThreadPoolExecutor.java:1149)
     [java] 	at java.util.concurrent.ThreadPoolExecutor$Worker.run(ThreadPoolExecutor.java:624)
     [java] 	at java.lang.Thread.run(Thread.java:748)
     [java] 2) testSendPostData_NoFilename(org.apache.jmeter.protocol.http.sampler.PostWriterTest)
     [java] java.io.FileNotFoundException:  (No such file or directory)
     [java] 	at java.io.FileInputStream.open0(Native Method)
     [java] 	at java.io.FileInputStream.open(FileInputStream.java:195)
     [java] 	at java.io.FileInputStream.<init>(FileInputStream.java:138)
     [java] 	at java.io.FileInputStream.<init>(FileInputStream.java:93)
     [java] 	at org.apache.jmeter.protocol.http.sampler.PostWriter.writeFileToStream(PostWriter.java:412)
     [java] 	at org.apache.jmeter.protocol.http.sampler.PostWriter.sendPostData(PostWriter.java:123)
     [java] 	at org.apache.jmeter.protocol.http.sampler.PostWriterTest.testSendPostData_NoFilename(PostWriterTest.java:176)
     [java] 	at sun.reflect.NativeMethodAccessorImpl.invoke0(Native Method)
     [java] 	at sun.reflect.NativeMethodAccessorImpl.invoke(NativeMethodAccessorImpl.java:62)
     [java] 	at sun.reflect.DelegatingMethodAccessorImpl.invoke(DelegatingMethodAccessorImpl.java:43)
     [java] 	at java.lang.reflect.Method.invoke(Method.java:498)
     [java] 	at org.junit.runners.model.FrameworkMethod$1.runReflectiveCall(FrameworkMethod.java:50)
     [java] 	at org.junit.internal.runners.model.ReflectiveCallable.run(ReflectiveCallable.java:12)
     [java] 	at org.junit.runners.model.FrameworkMethod.invokeExplosively(FrameworkMethod.java:47)
     [java] 	at org.junit.internal.runners.statements.InvokeMethod.evaluate(InvokeMethod.java:17)
     [java] 	at org.junit.internal.runners.statements.RunBefores.evaluate(RunBefores.java:26)
     [java] 	at org.junit.internal.runners.statements.RunAfters.evaluate(RunAfters.java:27)
     [java] 	at org.junit.runners.ParentRunner.runLeaf(ParentRunner.java:325)
     [java] 	at org.junit.runners.BlockJUnit4ClassRunner.runChild(BlockJUnit4ClassRunner.java:78)
     [java] 	at org.junit.runners.BlockJUnit4ClassRunner.runChild(BlockJUnit4ClassRunner.java:57)
     [java] 	at org.junit.runners.ParentRunner$3.run(ParentRunner.java:290)
     [java] 	at java.util.concurrent.Executors$RunnableAdapter.call(Executors.java:511)
     [java] 	at java.util.concurrent.FutureTask.run(FutureTask.java:266)
     [java] 	at java.util.concurrent.ThreadPoolExecutor.runWorker(ThreadPoolExecutor.java:1149)
     [java] 	at java.util.concurrent.ThreadPoolExecutor$Worker.run(ThreadPoolExecutor.java:624)
     [java] 	at java.lang.Thread.run(Thread.java:748)
     [java] 
     [java] FAILURES!!!
     [java] Tests run: 3219,  Failures: 2
     [java] 
     [java] ................................................
     [java] Time: 4.305
     [java] 
     [java] OK (48 tests)
     [java] 

BUILD FAILED
<https://builds.apache.org/job/JMeter-trunk/ws/trunk/build.xml>:3068: Java returned:
1

Total time: 2 minutes 8 seconds
Build step 'Invoke Ant' marked build as failure
[locks-and-latches] Releasing all the locks
[locks-and-latches] All the locks released
Archiving artifacts
Recording test results
ERROR: Step ?Publish JUnit test result report? failed: Test reports were found but none of
them are new. Did leafNodes run? 
For example, <https://builds.apache.org/job/JMeter-trunk/ws/trunk/reports/TEST-org.apache.commons.cli.avalon.ClutilTestCase.xml>
is 9 days 23 hr old


Mime
View raw message