jmeter-dev mailing list archives

Site index · List index
Message view « Date » · « Thread »
Top « Date » · « Thread »
From Apache Jenkins Server <jenk...@builds.apache.org>
Subject Build failed in Jenkins: JMeter-trunk #6784
Date Mon, 14 May 2018 05:56:34 GMT
See <https://builds.apache.org/job/JMeter-trunk/6784/display/redirect>

------------------------------------------
[...truncated 190.02 KB...]

batchtest:
     [echo] Starting TestCookieManager with file TestCookieManager.jmx using -X -Jdummy=dummy
   [jmeter] SLF4J: Class path contains multiple SLF4J bindings.
   [jmeter] SLF4J: Found binding in [jar:<https://builds.apache.org/job/JMeter-trunk/ws/trunk/lib/log4j-slf4j-impl-2.10.0.jar!/org/slf4j/impl/StaticLoggerBinder.class]>
   [jmeter] SLF4J: Found binding in [jar:<https://builds.apache.org/job/JMeter-trunk/ws/trunk/lib/opt/activemq-all-5.15.2.jar!/org/slf4j/impl/StaticLoggerBinder.class]>
   [jmeter] SLF4J: See http://www.slf4j.org/codes.html#multiple_bindings for an explanation.
   [jmeter] SLF4J: Actual binding is of type [org.apache.logging.slf4j.Log4jLoggerFactory]
   [jmeter] Creating summariser <summary>
   [jmeter] Created the tree successfully using testfiles/TestCookieManager.jmx
   [jmeter] Starting the test @ Mon May 14 05:54:13 UTC 2018 (1526277253862)
   [jmeter] Waiting for possible Shutdown/StopTestNow/Heapdump message on port 4445
   [jmeter] summary =     10 in 00:00:02 =    6.5/s Avg:   105 Min:     2 Max:   560 Err:
    0 (0.00%)
   [jmeter] Tidying up ...    @ Mon May 14 05:54:16 UTC 2018 (1526277256650)
   [jmeter] ... end of run
     [echo] TestCookieManager output files compared OK

batchtest:
     [echo] Starting TCP_TESTS with file TCP_TESTS.jmx using -X -Jdummy=dummy
   [jmeter] SLF4J: Class path contains multiple SLF4J bindings.
   [jmeter] SLF4J: Found binding in [jar:<https://builds.apache.org/job/JMeter-trunk/ws/trunk/lib/log4j-slf4j-impl-2.10.0.jar!/org/slf4j/impl/StaticLoggerBinder.class]>
   [jmeter] SLF4J: Found binding in [jar:<https://builds.apache.org/job/JMeter-trunk/ws/trunk/lib/opt/activemq-all-5.15.2.jar!/org/slf4j/impl/StaticLoggerBinder.class]>
   [jmeter] SLF4J: See http://www.slf4j.org/codes.html#multiple_bindings for an explanation.
   [jmeter] SLF4J: Actual binding is of type [org.apache.logging.slf4j.Log4jLoggerFactory]
   [jmeter] Creating summariser <summary>
   [jmeter] Created the tree successfully using testfiles/TCP_TESTS.jmx
   [jmeter] Starting the test @ Mon May 14 05:54:20 UTC 2018 (1526277260592)
   [jmeter] Waiting for possible Shutdown/StopTestNow/Heapdump message on port 4445
   [jmeter] 14/05/2018 05:54:25
   [jmeter] 
   [jmeter] 
   [jmeter] summary =     11 in 00:00:05 =    2.0/s Avg:   364 Min:     0 Max:  1020 Err:
    0 (0.00%)
   [jmeter] Tidying up ...    @ Mon May 14 05:54:27 UTC 2018 (1526277267327)
   [jmeter] ... end of run
   [concat] 2018-05-14 05:54:25,234 ERROR o.a.j.p.t.s.TCPSampler: 
   [concat] org.apache.jmeter.protocol.tcp.sampler.ReadException: Error reading from server,
bytes read: 0
   [concat] 	at org.apache.jmeter.protocol.tcp.sampler.TCPClientImpl.read(TCPClientImpl.java:131)
~[ApacheJMeter_tcp.jar:r1831527]
   [concat] 	at org.apache.jmeter.protocol.tcp.sampler.TCPSampler.sample(TCPSampler.java:402)
[ApacheJMeter_tcp.jar:r1831527]
   [concat] 	at org.apache.jmeter.threads.JMeterThread.doSampling(JMeterThread.java:622) [ApacheJMeter_core.jar:r1831527]
   [concat] 	at org.apache.jmeter.threads.JMeterThread.executeSamplePackage(JMeterThread.java:546)
[ApacheJMeter_core.jar:r1831527]
   [concat] 	at org.apache.jmeter.threads.JMeterThread.processSampler(JMeterThread.java:486)
[ApacheJMeter_core.jar:r1831527]
   [concat] 	at org.apache.jmeter.threads.JMeterThread.run(JMeterThread.java:253) [ApacheJMeter_core.jar:r1831527]
   [concat] 	at java.lang.Thread.run(Thread.java:748) [?:1.8.0_172]
   [concat] Caused by: java.net.SocketTimeoutException: Read timed out
   [concat] 	at java.net.SocketInputStream.socketRead0(Native Method) ~[?:1.8.0_172]
   [concat] 	at java.net.SocketInputStream.socketRead(SocketInputStream.java:116) ~[?:1.8.0_172]
   [concat] 	at java.net.SocketInputStream.read(SocketInputStream.java:171) ~[?:1.8.0_172]
   [concat] 	at java.net.SocketInputStream.read(SocketInputStream.java:141) ~[?:1.8.0_172]
   [concat] 	at java.net.SocketInputStream.read(SocketInputStream.java:127) ~[?:1.8.0_172]
   [concat] 	at org.apache.jmeter.protocol.tcp.sampler.TCPClientImpl.read(TCPClientImpl.java:114)
~[ApacheJMeter_tcp.jar:r1831527]
   [concat] 	... 6 more
   [concat] 2018-05-14 05:54:26,314 ERROR o.a.j.p.t.s.TCPSampler: 
   [concat] org.apache.jmeter.protocol.tcp.sampler.ReadException: 
   [concat] 	at org.apache.jmeter.protocol.tcp.sampler.BinaryTCPClientImpl.read(BinaryTCPClientImpl.java:152)
~[ApacheJMeter_tcp.jar:r1831527]
   [concat] 	at org.apache.jmeter.protocol.tcp.sampler.TCPSampler.sample(TCPSampler.java:402)
[ApacheJMeter_tcp.jar:r1831527]
   [concat] 	at org.apache.jmeter.threads.JMeterThread.doSampling(JMeterThread.java:622) [ApacheJMeter_core.jar:r1831527]
   [concat] 	at org.apache.jmeter.threads.JMeterThread.executeSamplePackage(JMeterThread.java:546)
[ApacheJMeter_core.jar:r1831527]
   [concat] 	at org.apache.jmeter.threads.JMeterThread.processSampler(JMeterThread.java:486)
[ApacheJMeter_core.jar:r1831527]
   [concat] 	at org.apache.jmeter.threads.JMeterThread.run(JMeterThread.java:253) [ApacheJMeter_core.jar:r1831527]
   [concat] 	at java.lang.Thread.run(Thread.java:748) [?:1.8.0_172]
   [concat] Caused by: java.net.SocketTimeoutException: Read timed out
   [concat] 	at java.net.SocketInputStream.socketRead0(Native Method) ~[?:1.8.0_172]
   [concat] 	at java.net.SocketInputStream.socketRead(SocketInputStream.java:116) ~[?:1.8.0_172]
   [concat] 	at java.net.SocketInputStream.read(SocketInputStream.java:171) ~[?:1.8.0_172]
   [concat] 	at java.net.SocketInputStream.read(SocketInputStream.java:141) ~[?:1.8.0_172]
   [concat] 	at java.net.SocketInputStream.read(SocketInputStream.java:127) ~[?:1.8.0_172]
   [concat] 	at org.apache.jmeter.protocol.tcp.sampler.BinaryTCPClientImpl.read(BinaryTCPClientImpl.java:134)
~[ApacheJMeter_tcp.jar:r1831527]
   [concat] 	... 6 more
   [concat] 2018-05-14 05:54:26,332 WARN o.a.j.p.t.s.TCPSampler: Could not create socket for
tcp://localhost:2223
   [concat] java.net.ConnectException: Connection refused (Connection refused)
   [concat] 	at java.net.PlainSocketImpl.socketConnect(Native Method) ~[?:1.8.0_172]
   [concat] 	at java.net.AbstractPlainSocketImpl.doConnect(AbstractPlainSocketImpl.java:350)
~[?:1.8.0_172]
   [concat] 	at java.net.AbstractPlainSocketImpl.connectToAddress(AbstractPlainSocketImpl.java:206)
~[?:1.8.0_172]
   [concat] 	at java.net.AbstractPlainSocketImpl.connect(AbstractPlainSocketImpl.java:188)
~[?:1.8.0_172]
   [concat] 	at java.net.SocksSocketImpl.connect(SocksSocketImpl.java:392) ~[?:1.8.0_172]
   [concat] 	at java.net.Socket.connect(Socket.java:589) ~[?:1.8.0_172]
   [concat] 	at org.apache.jmeter.protocol.tcp.sampler.TCPSampler.getSocket(TCPSampler.java:168)
[ApacheJMeter_tcp.jar:r1831527]
   [concat] 	at org.apache.jmeter.protocol.tcp.sampler.TCPSampler.sample(TCPSampler.java:384)
[ApacheJMeter_tcp.jar:r1831527]
   [concat] 	at org.apache.jmeter.threads.JMeterThread.doSampling(JMeterThread.java:622) [ApacheJMeter_core.jar:r1831527]
   [concat] 	at org.apache.jmeter.threads.JMeterThread.executeSamplePackage(JMeterThread.java:546)
[ApacheJMeter_core.jar:r1831527]
   [concat] 	at org.apache.jmeter.threads.JMeterThread.processSampler(JMeterThread.java:486)
[ApacheJMeter_core.jar:r1831527]
   [concat] 	at org.apache.jmeter.threads.JMeterThread.run(JMeterThread.java:253) [ApacheJMeter_core.jar:r1831527]
   [concat] 	at java.lang.Thread.run(Thread.java:748) [?:1.8.0_172]
   [concat] 2018-05-14 05:54:26,418 WARN o.a.j.p.t.s.TCPSampler: Unknown host for tcp://localhostXXXX:2223
   [concat] java.net.UnknownHostException: localhostXXXX
   [concat] 	at java.net.AbstractPlainSocketImpl.connect(AbstractPlainSocketImpl.java:184)
~[?:1.8.0_172]
   [concat] 	at java.net.SocksSocketImpl.connect(SocksSocketImpl.java:392) ~[?:1.8.0_172]
   [concat] 	at java.net.Socket.connect(Socket.java:589) ~[?:1.8.0_172]
   [concat] 	at org.apache.jmeter.protocol.tcp.sampler.TCPSampler.getSocket(TCPSampler.java:168)
[ApacheJMeter_tcp.jar:r1831527]
   [concat] 	at org.apache.jmeter.protocol.tcp.sampler.TCPSampler.sample(TCPSampler.java:384)
[ApacheJMeter_tcp.jar:r1831527]
   [concat] 	at org.apache.jmeter.threads.JMeterThread.doSampling(JMeterThread.java:622) [ApacheJMeter_core.jar:r1831527]
   [concat] 	at org.apache.jmeter.threads.JMeterThread.executeSamplePackage(JMeterThread.java:546)
[ApacheJMeter_core.jar:r1831527]
   [concat] 	at org.apache.jmeter.threads.JMeterThread.processSampler(JMeterThread.java:486)
[ApacheJMeter_core.jar:r1831527]
   [concat] 	at org.apache.jmeter.threads.JMeterThread.run(JMeterThread.java:253) [ApacheJMeter_core.jar:r1831527]
   [concat] 	at java.lang.Thread.run(Thread.java:748) [?:1.8.0_172]
   [concat] 2018-05-14 05:54:26,422 ERROR o.a.j.p.t.s.TCPSampler: Could not find protocol
class 'org.foo.xxx'
     [echo] TCP_TESTS output files compared OK

batchtest:
     [echo] Starting JDBC_TESTS with file JDBC_TESTS.jmx using -X -Jdummy=dummy
   [jmeter] SLF4J: Class path contains multiple SLF4J bindings.
   [jmeter] SLF4J: Found binding in [jar:<https://builds.apache.org/job/JMeter-trunk/ws/trunk/lib/log4j-slf4j-impl-2.10.0.jar!/org/slf4j/impl/StaticLoggerBinder.class]>
   [jmeter] SLF4J: Found binding in [jar:<https://builds.apache.org/job/JMeter-trunk/ws/trunk/lib/opt/activemq-all-5.15.2.jar!/org/slf4j/impl/StaticLoggerBinder.class]>
   [jmeter] SLF4J: See http://www.slf4j.org/codes.html#multiple_bindings for an explanation.
   [jmeter] SLF4J: Actual binding is of type [org.apache.logging.slf4j.Log4jLoggerFactory]
   [jmeter] Creating summariser <summary>
   [jmeter] Created the tree successfully using testfiles/JDBC_TESTS.jmx
   [jmeter] Starting the test @ Mon May 14 05:54:30 UTC 2018 (1526277270434)
   [jmeter] Waiting for possible Shutdown/StopTestNow/Heapdump message on port 4445
   [jmeter] summary +      1 in 00:00:01 =    2.0/s Avg:   451 Min:   451 Max:   451 Err:
    0 (0.00%) Active: 1 Started: 1 Finished: 0
   [jmeter] summary +     20 in 00:00:01 =   19.6/s Avg:     2 Min:     0 Max:    21 Err:
    0 (0.00%) Active: 0 Started: 2 Finished: 2
   [jmeter] summary =     21 in 00:00:02 =   13.8/s Avg:    24 Min:     0 Max:   451 Err:
    0 (0.00%)
   [jmeter] Tidying up ...    @ Mon May 14 05:54:33 UTC 2018 (1526277273074)
   [jmeter] ... end of run
   [concat] 2018-05-14 05:54:33,043 ERROR o.a.j.t.JMeterThread: Error while processing sampler:
'JDBC_With_Failing_PreProcessor'.
   [concat] java.lang.IllegalArgumentException: Variable Name must not be null in JDBC PreProcessor
   [concat] 	at org.apache.jmeter.protocol.jdbc.processor.AbstractJDBCProcessor.process(AbstractJDBCProcessor.java:45)
~[ApacheJMeter_jdbc.jar:r1831527]
   [concat] 	at org.apache.jmeter.protocol.jdbc.processor.JDBCPreProcessor.process(JDBCPreProcessor.java:33)
~[ApacheJMeter_jdbc.jar:r1831527]
   [concat] 	at org.apache.jmeter.threads.JMeterThread.runPreProcessors(JMeterThread.java:935)
~[ApacheJMeter_core.jar:r1831527]
   [concat] 	at org.apache.jmeter.threads.JMeterThread.executeSamplePackage(JMeterThread.java:537)
~[ApacheJMeter_core.jar:r1831527]
   [concat] 	at org.apache.jmeter.threads.JMeterThread.processSampler(JMeterThread.java:486)
[ApacheJMeter_core.jar:r1831527]
   [concat] 	at org.apache.jmeter.threads.JMeterThread.run(JMeterThread.java:253) [ApacheJMeter_core.jar:r1831527]
   [concat] 	at java.lang.Thread.run(Thread.java:748) [?:1.8.0_172]
   [concat] 2018-05-14 05:54:33,055 ERROR o.a.j.t.JMeterThread: Error while processing sampler:
'JDBC_With_Failing_PostProcessor'.
   [concat] java.lang.IllegalArgumentException: Variable Name must not be null in JDBC PostProcessor
   [concat] 	at org.apache.jmeter.protocol.jdbc.processor.AbstractJDBCProcessor.process(AbstractJDBCProcessor.java:45)
~[ApacheJMeter_jdbc.jar:r1831527]
   [concat] 	at org.apache.jmeter.protocol.jdbc.processor.JDBCPostProcessor.process(JDBCPostProcessor.java:33)
~[ApacheJMeter_jdbc.jar:r1831527]
   [concat] 	at org.apache.jmeter.threads.JMeterThread.runPostProcessors(JMeterThread.java:925)
~[ApacheJMeter_core.jar:r1831527]
   [concat] 	at org.apache.jmeter.threads.JMeterThread.executeSamplePackage(JMeterThread.java:564)
~[ApacheJMeter_core.jar:r1831527]
   [concat] 	at org.apache.jmeter.threads.JMeterThread.processSampler(JMeterThread.java:486)
[ApacheJMeter_core.jar:r1831527]
   [concat] 	at org.apache.jmeter.threads.JMeterThread.run(JMeterThread.java:253) [ApacheJMeter_core.jar:r1831527]
   [concat] 	at java.lang.Thread.run(Thread.java:748) [?:1.8.0_172]
   [concat] 2018-05-14 05:54:33,056 WARN o.a.j.p.j.p.AbstractJDBCProcessor: SQL Problem in
JDBC PreProcessor: java.sql.SQLSyntaxErrorException: unexpected token: USERS
   [concat] 2018-05-14 05:54:33,068 WARN o.a.j.p.j.p.AbstractJDBCProcessor: SQL Problem in
JDBC PostProcessor: java.sql.SQLSyntaxErrorException: unexpected token: USERS
     [echo] JDBC_TESTS output files compared OK

batchtest:
     [echo] Starting JMS_TESTS with file JMS_TESTS.jmx using -X -Jdummy=dummy
   [jmeter] SLF4J: Class path contains multiple SLF4J bindings.
   [jmeter] SLF4J: Found binding in [jar:<https://builds.apache.org/job/JMeter-trunk/ws/trunk/lib/log4j-slf4j-impl-2.10.0.jar!/org/slf4j/impl/StaticLoggerBinder.class]>
   [jmeter] SLF4J: Found binding in [jar:<https://builds.apache.org/job/JMeter-trunk/ws/trunk/lib/opt/activemq-all-5.15.2.jar!/org/slf4j/impl/StaticLoggerBinder.class]>
   [jmeter] SLF4J: See http://www.slf4j.org/codes.html#multiple_bindings for an explanation.
   [jmeter] SLF4J: Actual binding is of type [org.apache.logging.slf4j.Log4jLoggerFactory]
   [jmeter] Creating summariser <summary>
   [jmeter] Created the tree successfully using testfiles/JMS_TESTS.jmx
   [jmeter] Starting the test @ Mon May 14 05:54:36 UTC 2018 (1526277276231)
   [jmeter] Waiting for possible Shutdown/StopTestNow/Heapdump message on port 4445
   [jmeter] summary +     24 in 00:00:27 =    0.9/s Avg:   540 Min:     0 Max:  3000 Err:
    0 (0.00%) Active: 1 Started: 5 Finished: 4
   [jmeter] summary +      3 in 00:00:08 =    0.4/s Avg:  1031 Min:     0 Max:  3000 Err:
    0 (0.00%) Active: 0 Started: 1 Finished: 1
   [jmeter] summary =     27 in 00:00:36 =    0.8/s Avg:   595 Min:     0 Max:  3000 Err:
    0 (0.00%)
   [jmeter] Tidying up ...    @ Mon May 14 05:55:13 UTC 2018 (1526277313119)
   [jmeter] ... end of run
     [echo] JMS_TESTS output files compared OK

batchtest:
     [echo] Starting OS_TESTS with file OS_TESTS.jmx using -X -Jdummy=dummy
   [jmeter] SLF4J: Class path contains multiple SLF4J bindings.
   [jmeter] SLF4J: Found binding in [jar:<https://builds.apache.org/job/JMeter-trunk/ws/trunk/lib/log4j-slf4j-impl-2.10.0.jar!/org/slf4j/impl/StaticLoggerBinder.class]>
   [jmeter] SLF4J: Found binding in [jar:<https://builds.apache.org/job/JMeter-trunk/ws/trunk/lib/opt/activemq-all-5.15.2.jar!/org/slf4j/impl/StaticLoggerBinder.class]>
   [jmeter] SLF4J: See http://www.slf4j.org/codes.html#multiple_bindings for an explanation.
   [jmeter] SLF4J: Actual binding is of type [org.apache.logging.slf4j.Log4jLoggerFactory]
   [jmeter] Creating summariser <summary>
   [jmeter] Created the tree successfully using testfiles/OS_TESTS.jmx
   [jmeter] Starting the test @ Mon May 14 05:55:16 UTC 2018 (1526277316612)
   [jmeter] Waiting for possible Shutdown/StopTestNow/Heapdump message on port 4445
   [jmeter] summary =      3 in 00:00:02 =    1.5/s Avg:   340 Min:     3 Max:  1003 Err:
    0 (0.00%)
   [jmeter] Tidying up ...    @ Mon May 14 05:55:18 UTC 2018 (1526277318842)
   [jmeter] ... end of run
     [echo] OS_TESTS output files compared OK

batchtest:
     [echo] Starting FTP_TESTS with file FTP_TESTS.jmx using -X -Jdummy=dummy
   [jmeter] SLF4J: Class path contains multiple SLF4J bindings.
   [jmeter] SLF4J: Found binding in [jar:<https://builds.apache.org/job/JMeter-trunk/ws/trunk/lib/log4j-slf4j-impl-2.10.0.jar!/org/slf4j/impl/StaticLoggerBinder.class]>
   [jmeter] SLF4J: Found binding in [jar:<https://builds.apache.org/job/JMeter-trunk/ws/trunk/lib/opt/activemq-all-5.15.2.jar!/org/slf4j/impl/StaticLoggerBinder.class]>
   [jmeter] SLF4J: See http://www.slf4j.org/codes.html#multiple_bindings for an explanation.
   [jmeter] SLF4J: Actual binding is of type [org.apache.logging.slf4j.Log4jLoggerFactory]
   [jmeter] Creating summariser <summary>
   [jmeter] Created the tree successfully using testfiles/FTP_TESTS.jmx
   [jmeter] Starting the test @ Mon May 14 05:55:21 UTC 2018 (1526277321769)
   [jmeter] Waiting for possible Shutdown/StopTestNow/Heapdump message on port 4445
   [jmeter] summary =      6 in 00:00:03 =    2.4/s Avg:   198 Min:    15 Max:   950 Err:
    0 (0.00%)
   [jmeter] Tidying up ...    @ Mon May 14 05:55:25 UTC 2018 (1526277325379)
   [jmeter] ... end of run
     [echo] FTP_TESTS output files compared OK

batchtest:
     [echo] Starting Bug60607 with file Bug60607.jmx using -X -Jdummy=dummy
   [jmeter] SLF4J: Class path contains multiple SLF4J bindings.
   [jmeter] SLF4J: Found binding in [jar:<https://builds.apache.org/job/JMeter-trunk/ws/trunk/lib/log4j-slf4j-impl-2.10.0.jar!/org/slf4j/impl/StaticLoggerBinder.class]>
   [jmeter] SLF4J: Found binding in [jar:<https://builds.apache.org/job/JMeter-trunk/ws/trunk/lib/opt/activemq-all-5.15.2.jar!/org/slf4j/impl/StaticLoggerBinder.class]>
   [jmeter] SLF4J: See http://www.slf4j.org/codes.html#multiple_bindings for an explanation.
   [jmeter] SLF4J: Actual binding is of type [org.apache.logging.slf4j.Log4jLoggerFactory]
   [jmeter] Creating summariser <summary>
   [jmeter] Created the tree successfully using testfiles/Bug60607.jmx
   [jmeter] Starting the test @ Mon May 14 05:55:28 UTC 2018 (1526277328317)
   [jmeter] Waiting for possible Shutdown/StopTestNow/Heapdump message on port 4445
   [jmeter] summary +      2 in 00:00:31 =    0.1/s Avg: 15245 Min:   385 Max: 30106 Err:
    0 (0.00%) Active: 1 Started: 2 Finished: 1
   [jmeter] summary =      2 in 00:00:31 =    0.1/s Avg: 15245 Min:   385 Max: 30106 Err:
    0 (0.00%)
   [jmeter] Tidying up ...    @ Mon May 14 05:56:00 UTC 2018 (1526277360050)
   [jmeter] ... end of run
     [echo] Bug60607 output files compared OK

batchtest:
     [echo] Starting SlowCharsFeature_HttpClient4 with file SlowCharsFeature.jmx using -X
-Jdummy=dummy
   [jmeter] SLF4J: Class path contains multiple SLF4J bindings.
   [jmeter] SLF4J: Found binding in [jar:<https://builds.apache.org/job/JMeter-trunk/ws/trunk/lib/log4j-slf4j-impl-2.10.0.jar!/org/slf4j/impl/StaticLoggerBinder.class]>
   [jmeter] SLF4J: Found binding in [jar:<https://builds.apache.org/job/JMeter-trunk/ws/trunk/lib/opt/activemq-all-5.15.2.jar!/org/slf4j/impl/StaticLoggerBinder.class]>
   [jmeter] SLF4J: See http://www.slf4j.org/codes.html#multiple_bindings for an explanation.
   [jmeter] SLF4J: Actual binding is of type [org.apache.logging.slf4j.Log4jLoggerFactory]
   [jmeter] Creating summariser <summary>
   [jmeter] Created the tree successfully using testfiles/SlowCharsFeature.jmx
   [jmeter] Starting the test @ Mon May 14 05:56:03 UTC 2018 (1526277363474)
   [jmeter] Waiting for possible Shutdown/StopTestNow/Heapdump message on port 4445
   [jmeter] summary +      1 in 00:00:01 =    1.7/s Avg:   531 Min:   531 Max:   531 Err:
    0 (0.00%) Active: 1 Started: 1 Finished: 0
   [jmeter] summary +      4 in 00:00:28 =    0.1/s Avg:  6964 Min:  5601 Max: 10930 Err:
    3 (75.00%) Active: 1 Started: 1 Finished: 0
   [jmeter] summary =      5 in 00:00:29 =    0.2/s Avg:  5678 Min:   531 Max: 10930 Err:
    3 (60.00%)
   [jmeter] summary =      5 in 00:00:29 =    0.2/s Avg:  5678 Min:   531 Max: 10930 Err:
    3 (60.00%)
   [jmeter] Tidying up ...    @ Mon May 14 05:56:33 UTC 2018 (1526277393156)
   [jmeter] ... end of run

BUILD FAILED
<https://builds.apache.org/job/JMeter-trunk/ws/trunk/build.xml>:2945: The following
error occurred while executing this line:
<https://builds.apache.org/job/JMeter-trunk/ws/trunk/build.xml>:2773: CSV Files are
not identical.
        <https://builds.apache.org/job/JMeter-trunk/ws/trunk/bin/testfiles/SlowCharsFeature_HttpClient4.csv>
        label,responseCode,responseMessage,threadName,dataType,success
JSS_setCPS,200,OK,setUp Thread Group 1-1,text,true
ApacheJMeter-HP-NonSecure,206,Partial Content,Thread Group 1-1,text,true
ApacheJMeter-HP-Secure,206,Partial Content,Thread Group 1-1,text,true
HTTPS-SNI-without-timeout,206,Partial Content,Thread Group 1-1,text,true
HTTPS-SNI-with-timeout,206,Partial Content,Thread Group 1-1,text,true

        <https://builds.apache.org/job/JMeter-trunk/ws/trunk/bin/SlowCharsFeature_HttpClient4.csv>
        label,responseCode,responseMessage,threadName,dataType,success
JSS_setCPS,200,OK,setUp Thread Group 1-1,text,true
ApacheJMeter-HP-NonSecure,206,Partial Content,Thread Group 1-1,text,false
ApacheJMeter-HP-Secure,206,Partial Content,Thread Group 1-1,text,true
HTTPS-SNI-without-timeout,206,Partial Content,Thread Group 1-1,text,false
HTTPS-SNI-with-timeout,206,Partial Content,Thread Group 1-1,text,false

Total time: 8 minutes 15 seconds
Build step 'Invoke Ant' marked build as failure
[locks-and-latches] Releasing all the locks
[locks-and-latches] All the locks released
Archiving artifacts
Recording test results
ERROR: Step ?Publish JUnit test result report? failed: Test reports were found but none of
them are new. Did leafNodes run? 
For example, <https://builds.apache.org/job/JMeter-trunk/ws/trunk/reports/TEST-org.apache.commons.cli.avalon.ClutilTestCase.xml>
is 7 days 13 hr old


Mime
View raw message