jmeter-dev mailing list archives

Site index · List index
Message view « Date » · « Thread »
Top « Date » · « Thread »
From Felix Schumacher <felix.schumac...@internetallee.de>
Subject Re: Build failed in Jenkins: JMeter Windows #1095
Date Fri, 29 Jun 2018 04:44:12 GMT


Am 18. Juni 2018 02:33:48 MESZ schrieb Rajan Upadhyay <rajanpupa@gmail.com>:
>How do i unsubscribe from this?

Send an email to dev-unsubscribe@jmeter.apache.org from the email address that is subscribed.


More information can be found at http://jmeter.apache.org/mail2.html#JMeterDev

Regards, 
 Felix 

>
>On Sun, Jun 17, 2018 at 7:45 AM, Apache Jenkins Server <
>jenkins@builds.apache.org> wrote:
>
>> See <https://builds.apache.org/job/JMeter%20Windows/1095/
>> display/redirect?page=changes>
>>
>> Changes:
>>
>> [fschumacher] Set start- and end-time on JMS publisher sampler, even
>if
>> initialization fails.
>>
>> Bugzilla Id: 62464
>>
>> [fschumacher] Make checkstyle happy.
>>
>> Follow up to r1833637
>>
>> Bugzilla Id: 62462
>> Relates to #387 on github
>>
>> [fschumacher] Make delegation of credentials in SPNEGO possible
>again.
>>
>> Newer versions of httpcomponents-client (at least in the 4.x branch)
>> removed the ability to delegate
>> kerberos credentials via SPNEGO. This will make it possible to
>re-enable
>> delegation by specifying
>> a system property.
>>
>> Bugzilla Id: 62462
>> Closes #387 on github
>>
>> ------------------------------------------
>> [...truncated 190.35 KB...]
>>    [concat]     at java.net.AbstractPlainSocketImpl.connect(
>> AbstractPlainSocketImpl.java:184) ~[?:1.8.0_152]
>>    [concat]     at
>java.net.PlainSocketImpl.connect(PlainSocketImpl.java:172)
>> ~[?:1.8.0_152]
>>    [concat]     at
>java.net.SocksSocketImpl.connect(SocksSocketImpl.java:392)
>> ~[?:1.8.0_152]
>>    [concat]     at java.net.Socket.connect(Socket.java:589)
>~[?:1.8.0_152]
>>    [concat]     at
>org.apache.jmeter.protocol.tcp.sampler.TCPSampler.getSocket(TCPSampler.java:168)
>> [ApacheJMeter_tcp.jar:r1833661]
>>    [concat]     at org.apache.jmeter.protocol.
>> tcp.sampler.TCPSampler.sample(TCPSampler.java:384)
>[ApacheJMeter_tcp.jar:
>> r1833661]
>>    [concat]     at
>org.apache.jmeter.threads.JMeterThread.doSampling(JMeterThread.java:622)
>> [ApacheJMeter_core.jar:r1833661]
>>    [concat]     at org.apache.jmeter.threads.JMeterThread.
>> executeSamplePackage(JMeterThread.java:546) [ApacheJMeter_core.jar:
>> r1833661]
>>    [concat]     at
>org.apache.jmeter.threads.JMeterThread.processSampler(JMeterThread.java:486)
>> [ApacheJMeter_core.jar:r1833661]
>>    [concat]     at org.apache.jmeter.threads.
>> JMeterThread.run(JMeterThread.java:253)
>[ApacheJMeter_core.jar:r1833661]
>>    [concat]     at java.lang.Thread.run(Thread.java:748)
>[?:1.8.0_152]
>>    [concat] 2018-06-17 11:42:58,105 ERROR o.a.j.p.t.s.TCPSampler:
>Could
>> not find protocol class 'org.foo.xxx'
>>      [echo] TCP_TESTS output files compared OK
>>
>> batchtest:
>>      [echo] Starting JDBC_TESTS with file JDBC_TESTS.jmx using -X
>> -Jdummy=dummy
>>    [jmeter] SLF4J: Class path contains multiple SLF4J bindings.
>>    [jmeter] SLF4J: Found binding in [jar:file:/F:/jenkins/jenkins-
>> slave/workspace/JMeter%20Windows/trunk/lib/log4j-
>> slf4j-impl-2.10.0.jar!/org/slf4j/impl/StaticLoggerBinder.class]
>>    [jmeter] SLF4J: Found binding in [jar:file:/F:/jenkins/jenkins-
>> slave/workspace/JMeter%20Windows/trunk/lib/opt/
>> activemq-all-5.15.2.jar!/org/slf4j/impl/StaticLoggerBinder.class]
>>    [jmeter] SLF4J: See
>http://www.slf4j.org/codes.html#multiple_bindings
>> for an explanation.
>>    [jmeter] SLF4J: Actual binding is of type
>[org.apache.logging.slf4j.
>> Log4jLoggerFactory]
>>    [jmeter] Creating summariser <summary>
>>    [jmeter] Created the tree successfully using
>testfiles/JDBC_TESTS.jmx
>>    [jmeter] Starting the test @ Sun Jun 17 11:42:59 UTC 2018
>> (1529235779789)
>>    [jmeter] Waiting for possible Shutdown/StopTestNow/Heapdump
>message on
>> port 4445
>>    [jmeter] Jun 17, 2018 11:42:59 AM
>java.util.prefs.WindowsPreferences
>> <init>
>>    [jmeter] WARNING: Could not open/create prefs root node
>> Software\JavaSoft\Prefs at root 0x80000002. Windows
>RegCreateKeyEx(...)
>> returned error code 5.
>>    [jmeter] summary +      1 in 00:00:00 =    3.0/s Avg:   318 Min:  
>318
>> Max:   318 Err:     0 (0.00%) Active: 1 Started: 1 Finished: 0
>>    [jmeter] summary +     20 in 00:00:01 =   37.5/s Avg:     1 Min:  
>  0
>> Max:    14 Err:     0 (0.00%) Active: 0 Started: 2 Finished: 2
>>    [jmeter] summary =     21 in 00:00:01 =   24.1/s Avg:    16 Min:  
>  0
>> Max:   318 Err:     0 (0.00%)
>>    [jmeter] Tidying up ...    @ Sun Jun 17 11:43:01 UTC 2018
>> (1529235781234)
>>    [jmeter] ... end of run
>>    [concat] 2018-06-17 11:43:01,205 ERROR o.a.j.t.JMeterThread: Error
>> while processing sampler: 'JDBC_With_Failing_PreProcessor'.
>>    [concat] java.lang.IllegalArgumentException: Variable Name must
>not be
>> null in JDBC PreProcessor
>>    [concat]     at org.apache.jmeter.protocol.jdbc.processor.
>> AbstractJDBCProcessor.process(AbstractJDBCProcessor.java:45)
>> ~[ApacheJMeter_jdbc.jar:r1833661]
>>    [concat]     at org.apache.jmeter.protocol.jdbc.processor.
>> JDBCPreProcessor.process(JDBCPreProcessor.java:33)
>> ~[ApacheJMeter_jdbc.jar:r1833661]
>>    [concat]     at org.apache.jmeter.threads.
>> JMeterThread.runPreProcessors(JMeterThread.java:935)
>> ~[ApacheJMeter_core.jar:r1833661]
>>    [concat]     at org.apache.jmeter.threads.JMeterThread.
>> executeSamplePackage(JMeterThread.java:537) ~[ApacheJMeter_core.jar:
>> r1833661]
>>    [concat]     at
>org.apache.jmeter.threads.JMeterThread.processSampler(JMeterThread.java:486)
>> [ApacheJMeter_core.jar:r1833661]
>>    [concat]     at org.apache.jmeter.threads.
>> JMeterThread.run(JMeterThread.java:253)
>[ApacheJMeter_core.jar:r1833661]
>>    [concat]     at java.lang.Thread.run(Thread.java:748)
>[?:1.8.0_152]
>>    [concat] 2018-06-17 11:43:01,210 ERROR o.a.j.t.JMeterThread: Error
>> while processing sampler: 'JDBC_With_Failing_PostProcessor'.
>>    [concat] java.lang.IllegalArgumentException: Variable Name must
>not be
>> null in JDBC PostProcessor
>>    [concat]     at org.apache.jmeter.protocol.jdbc.processor.
>> AbstractJDBCProcessor.process(AbstractJDBCProcessor.java:45)
>> ~[ApacheJMeter_jdbc.jar:r1833661]
>>    [concat]     at org.apache.jmeter.protocol.jdbc.processor.
>> JDBCPostProcessor.process(JDBCPostProcessor.java:33)
>> ~[ApacheJMeter_jdbc.jar:r1833661]
>>    [concat]     at org.apache.jmeter.threads.JMeterThread.
>> runPostProcessors(JMeterThread.java:925)
>~[ApacheJMeter_core.jar:r1833661]
>>    [concat]     at org.apache.jmeter.threads.JMeterThread.
>> executeSamplePackage(JMeterThread.java:564) ~[ApacheJMeter_core.jar:
>> r1833661]
>>    [concat]     at
>org.apache.jmeter.threads.JMeterThread.processSampler(JMeterThread.java:486)
>> [ApacheJMeter_core.jar:r1833661]
>>    [concat]     at org.apache.jmeter.threads.
>> JMeterThread.run(JMeterThread.java:253)
>[ApacheJMeter_core.jar:r1833661]
>>    [concat]     at java.lang.Thread.run(Thread.java:748)
>[?:1.8.0_152]
>>    [concat] 2018-06-17 11:43:01,211 WARN
>o.a.j.p.j.p.AbstractJDBCProcessor:
>> SQL Problem in JDBC PreProcessor: java.sql.SQLSyntaxErrorException:
>> unexpected token: USERS
>>    [concat] 2018-06-17 11:43:01,215 WARN
>o.a.j.p.j.p.AbstractJDBCProcessor:
>> SQL Problem in JDBC PostProcessor: java.sql.SQLSyntaxErrorException:
>> unexpected token: USERS
>>      [echo] JDBC_TESTS output files compared OK
>>
>> batchtest:
>>      [echo] Starting JMS_TESTS with file JMS_TESTS.jmx using -X
>> -Jdummy=dummy
>>    [jmeter] SLF4J: Class path contains multiple SLF4J bindings.
>>    [jmeter] SLF4J: Found binding in [jar:file:/F:/jenkins/jenkins-
>> slave/workspace/JMeter%20Windows/trunk/lib/log4j-
>> slf4j-impl-2.10.0.jar!/org/slf4j/impl/StaticLoggerBinder.class]
>>    [jmeter] SLF4J: Found binding in [jar:file:/F:/jenkins/jenkins-
>> slave/workspace/JMeter%20Windows/trunk/lib/opt/
>> activemq-all-5.15.2.jar!/org/slf4j/impl/StaticLoggerBinder.class]
>>    [jmeter] SLF4J: See
>http://www.slf4j.org/codes.html#multiple_bindings
>> for an explanation.
>>    [jmeter] SLF4J: Actual binding is of type
>[org.apache.logging.slf4j.
>> Log4jLoggerFactory]
>>    [jmeter] Creating summariser <summary>
>>    [jmeter] Created the tree successfully using
>testfiles/JMS_TESTS.jmx
>>    [jmeter] Starting the test @ Sun Jun 17 11:43:02 UTC 2018
>> (1529235782881)
>>    [jmeter] Waiting for possible Shutdown/StopTestNow/Heapdump
>message on
>> port 4445
>>    [jmeter] Jun 17, 2018 11:43:02 AM
>java.util.prefs.WindowsPreferences
>> <init>
>>    [jmeter] WARNING: Could not open/create prefs root node
>> Software\JavaSoft\Prefs at root 0x80000002. Windows
>RegCreateKeyEx(...)
>> returned error code 5.
>>    [jmeter] summary +      1 in 00:00:02 =    0.6/s Avg:  1653 Min: 
>1653
>> Max:  1653 Err:     0 (0.00%) Active: 1 Started: 1 Finished: 0
>>    [jmeter] summary +     24 in 00:00:28 =    0.9/s Avg:   558 Min:  
>  0
>> Max:  3001 Err:     0 (0.00%) Active: 1 Started: 6 Finished: 5
>>    [jmeter] summary =     25 in 00:00:29 =    0.9/s Avg:   602 Min:  
>  0
>> Max:  3001 Err:     0 (0.00%)
>>    [jmeter] summary +      2 in 00:00:05 =    0.4/s Avg:    29 Min:  
>  0
>> Max:    59 Err:     0 (0.00%) Active: 0 Started: 1 Finished: 1
>>    [jmeter] summary =     27 in 00:00:34 =    0.8/s Avg:   559 Min:  
>  0
>> Max:  3001 Err:     0 (0.00%)
>>    [jmeter] Tidying up ...    @ Sun Jun 17 11:43:37 UTC 2018
>> (1529235817891)
>>    [jmeter] ... end of run
>>      [echo] JMS_TESTS output files compared OK
>>
>> batchtest:
>>      [echo] Starting OS_TESTS with file OS_TESTS.jmx using -X
>-Jdummy=dummy
>>    [jmeter] SLF4J: Class path contains multiple SLF4J bindings.
>>    [jmeter] SLF4J: Found binding in [jar:file:/F:/jenkins/jenkins-
>> slave/workspace/JMeter%20Windows/trunk/lib/log4j-
>> slf4j-impl-2.10.0.jar!/org/slf4j/impl/StaticLoggerBinder.class]
>>    [jmeter] SLF4J: Found binding in [jar:file:/F:/jenkins/jenkins-
>> slave/workspace/JMeter%20Windows/trunk/lib/opt/
>> activemq-all-5.15.2.jar!/org/slf4j/impl/StaticLoggerBinder.class]
>>    [jmeter] SLF4J: See
>http://www.slf4j.org/codes.html#multiple_bindings
>> for an explanation.
>>    [jmeter] SLF4J: Actual binding is of type
>[org.apache.logging.slf4j.
>> Log4jLoggerFactory]
>>    [jmeter] Jun 17, 2018 11:43:39 AM
>java.util.prefs.WindowsPreferences
>> <init>
>>    [jmeter] WARNING: Could not open/create prefs root node
>> Software\JavaSoft\Prefs at root 0x80000002. Windows
>RegCreateKeyEx(...)
>> returned error code 5.
>>    [jmeter] Creating summariser <summary>
>>    [jmeter] Created the tree successfully using
>testfiles/OS_TESTS.jmx
>>    [jmeter] Starting the test @ Sun Jun 17 11:43:39 UTC 2018
>> (1529235819710)
>>    [jmeter] Waiting for possible Shutdown/StopTestNow/Heapdump
>message on
>> port 4445
>>    [jmeter] summary =      3 in 00:00:02 =    2.0/s Avg:   348 Min:  
> 16
>> Max:  1008 Err:     0 (0.00%)
>>    [jmeter] Tidying up ...    @ Sun Jun 17 11:43:41 UTC 2018
>> (1529235821380)
>>    [jmeter] ... end of run
>>      [echo] OS_TESTS output files compared OK
>>
>> batchtest:
>>      [echo] Starting FTP_TESTS with file FTP_TESTS.jmx using -X
>> -Jdummy=dummy
>>    [jmeter] SLF4J: Class path contains multiple SLF4J bindings.
>>    [jmeter] SLF4J: Found binding in [jar:file:/F:/jenkins/jenkins-
>> slave/workspace/JMeter%20Windows/trunk/lib/log4j-
>> slf4j-impl-2.10.0.jar!/org/slf4j/impl/StaticLoggerBinder.class]
>>    [jmeter] SLF4J: Found binding in [jar:file:/F:/jenkins/jenkins-
>> slave/workspace/JMeter%20Windows/trunk/lib/opt/
>> activemq-all-5.15.2.jar!/org/slf4j/impl/StaticLoggerBinder.class]
>>    [jmeter] SLF4J: See
>http://www.slf4j.org/codes.html#multiple_bindings
>> for an explanation.
>>    [jmeter] SLF4J: Actual binding is of type
>[org.apache.logging.slf4j.
>> Log4jLoggerFactory]
>>    [jmeter] Jun 17, 2018 11:43:42 AM
>java.util.prefs.WindowsPreferences
>> <init>
>>    [jmeter] WARNING: Could not open/create prefs root node
>> Software\JavaSoft\Prefs at root 0x80000002. Windows
>RegCreateKeyEx(...)
>> returned error code 5.
>>    [jmeter] Creating summariser <summary>
>>    [jmeter] Created the tree successfully using
>testfiles/FTP_TESTS.jmx
>>    [jmeter] Starting the test @ Sun Jun 17 11:43:42 UTC 2018
>> (1529235822961)
>>    [jmeter] Waiting for possible Shutdown/StopTestNow/Heapdump
>message on
>> port 4445
>>    [jmeter] summary =      6 in 00:00:02 =    3.0/s Avg:   133 Min:  
> 14
>> Max:   627 Err:     0 (0.00%)
>>    [jmeter] Tidying up ...    @ Sun Jun 17 11:43:45 UTC 2018
>> (1529235825481)
>>    [jmeter] ... end of run
>>      [echo] FTP_TESTS output files compared OK
>>
>> batchtest:
>>      [echo] Starting Bug60607 with file Bug60607.jmx using -X
>-Jdummy=dummy
>>    [jmeter] SLF4J: Class path contains multiple SLF4J bindings.
>>    [jmeter] SLF4J: Found binding in [jar:file:/F:/jenkins/jenkins-
>> slave/workspace/JMeter%20Windows/trunk/lib/log4j-
>> slf4j-impl-2.10.0.jar!/org/slf4j/impl/StaticLoggerBinder.class]
>>    [jmeter] SLF4J: Found binding in [jar:file:/F:/jenkins/jenkins-
>> slave/workspace/JMeter%20Windows/trunk/lib/opt/
>> activemq-all-5.15.2.jar!/org/slf4j/impl/StaticLoggerBinder.class]
>>    [jmeter] SLF4J: See
>http://www.slf4j.org/codes.html#multiple_bindings
>> for an explanation.
>>    [jmeter] SLF4J: Actual binding is of type
>[org.apache.logging.slf4j.
>> Log4jLoggerFactory]
>>    [jmeter] Jun 17, 2018 11:43:47 AM
>java.util.prefs.WindowsPreferences
>> <init>
>>    [jmeter] WARNING: Could not open/create prefs root node
>> Software\JavaSoft\Prefs at root 0x80000002. Windows
>RegCreateKeyEx(...)
>> returned error code 5.
>>    [jmeter] Creating summariser <summary>
>>    [jmeter] Created the tree successfully using
>testfiles/Bug60607.jmx
>>    [jmeter] Starting the test @ Sun Jun 17 11:43:47 UTC 2018
>> (1529235827086)
>>    [jmeter] Waiting for possible Shutdown/StopTestNow/Heapdump
>message on
>> port 4445
>>    [jmeter] summary +      2 in 00:00:45 =    0.0/s Avg: 22545 Min:  
> 46
>> Max: 45045 Err:     0 (0.00%) Active: 1 Started: 2 Finished: 1
>>    [jmeter] summary =      2 in 00:00:45 =    0.0/s Avg: 22545 Min:  
> 46
>> Max: 45045 Err:     0 (0.00%)
>>    [jmeter] Tidying up ...    @ Sun Jun 17 11:44:32 UTC 2018
>> (1529235872693)
>>    [jmeter] ... end of run
>>      [echo] Bug60607 output files compared OK
>>
>> batchtest:
>>      [echo] Starting SlowCharsFeature_HttpClient4 with file
>> SlowCharsFeature.jmx using -X -Jdummy=dummy
>>    [jmeter] SLF4J: Class path contains multiple SLF4J bindings.
>>    [jmeter] SLF4J: Found binding in [jar:file:/F:/jenkins/jenkins-
>> slave/workspace/JMeter%20Windows/trunk/lib/log4j-
>> slf4j-impl-2.10.0.jar!/org/slf4j/impl/StaticLoggerBinder.class]
>>    [jmeter] SLF4J: Found binding in [jar:file:/F:/jenkins/jenkins-
>> slave/workspace/JMeter%20Windows/trunk/lib/opt/
>> activemq-all-5.15.2.jar!/org/slf4j/impl/StaticLoggerBinder.class]
>>    [jmeter] SLF4J: See
>http://www.slf4j.org/codes.html#multiple_bindings
>> for an explanation.
>>    [jmeter] SLF4J: Actual binding is of type
>[org.apache.logging.slf4j.
>> Log4jLoggerFactory]
>>    [jmeter] Creating summariser <summary>
>>    [jmeter] Created the tree successfully using
>> testfiles/SlowCharsFeature.jmx
>>    [jmeter] Starting the test @ Sun Jun 17 11:44:34 UTC 2018
>> (1529235874464)
>>    [jmeter] Waiting for possible Shutdown/StopTestNow/Heapdump
>message on
>> port 4445
>>    [jmeter] Jun 17, 2018 11:44:34 AM
>java.util.prefs.WindowsPreferences
>> <init>
>>    [jmeter] WARNING: Could not open/create prefs root node
>> Software\JavaSoft\Prefs at root 0x80000002. Windows
>RegCreateKeyEx(...)
>> returned error code 5.
>>    [jmeter] summary +      1 in 00:00:00 =    3.4/s Avg:   283 Min:  
>283
>> Max:   283 Err:     0 (0.00%) Active: 1 Started: 1 Finished: 0
>>    [jmeter] summary +      4 in 00:00:28 =    0.1/s Avg:  6821 Min: 
>5577
>> Max: 10513 Err:     0 (0.00%) Active: 1 Started: 1 Finished: 0
>>    [jmeter] summary =      5 in 00:00:28 =    0.2/s Avg:  5513 Min:  
>283
>> Max: 10513 Err:     0 (0.00%)
>>    [jmeter] summary =      5 in 00:00:28 =    0.2/s Avg:  5513 Min:  
>283
>> Max: 10513 Err:     0 (0.00%)
>>    [jmeter] Tidying up ...    @ Sun Jun 17 11:45:02 UTC 2018
>> (1529235902620)
>>    [jmeter] ... end of run
>>      [echo] SlowCharsFeature_HttpClient4 output files compared OK
>>
>> batchtest:
>>      [echo] Starting SlowCharsFeature_Java with file
>SlowCharsFeature.jmx
>> using -X -Jjmeter.httpsampler=Java
>>    [jmeter] SLF4J: Class path contains multiple SLF4J bindings.
>>    [jmeter] SLF4J: Found binding in [jar:file:/F:/jenkins/jenkins-
>> slave/workspace/JMeter%20Windows/trunk/lib/log4j-
>> slf4j-impl-2.10.0.jar!/org/slf4j/impl/StaticLoggerBinder.class]
>>    [jmeter] SLF4J: Found binding in [jar:file:/F:/jenkins/jenkins-
>> slave/workspace/JMeter%20Windows/trunk/lib/opt/
>> activemq-all-5.15.2.jar!/org/slf4j/impl/StaticLoggerBinder.class]
>>    [jmeter] SLF4J: See
>http://www.slf4j.org/codes.html#multiple_bindings
>> for an explanation.
>>    [jmeter] SLF4J: Actual binding is of type
>[org.apache.logging.slf4j.
>> Log4jLoggerFactory]
>>    [jmeter] Jun 17, 2018 11:45:04 AM
>java.util.prefs.WindowsPreferences
>> <init>
>>    [jmeter] WARNING: Could not open/create prefs root node
>> Software\JavaSoft\Prefs at root 0x80000002. Windows
>RegCreateKeyEx(...)
>> returned error code 5.
>>    [jmeter] Creating summariser <summary>
>>    [jmeter] Created the tree successfully using
>> testfiles/SlowCharsFeature.jmx
>>    [jmeter] Starting the test @ Sun Jun 17 11:45:04 UTC 2018
>> (1529235904407)
>>    [jmeter] Waiting for possible Shutdown/StopTestNow/Heapdump
>message on
>> port 4445
>>    [jmeter] summary +      1 in 00:00:00 =    3.4/s Avg:   282 Min:  
>282
>> Max:   282 Err:     0 (0.00%) Active: 1 Started: 1 Finished: 0
>>    [jmeter] summary +      3 in 00:00:26 =    0.1/s Avg:  8566 Min: 
>5606
>> Max: 11189 Err:     1 (33.33%) Active: 1 Started: 1 Finished: 0
>>    [jmeter] summary =      4 in 00:00:26 =    0.2/s Avg:  6495 Min:  
>282
>> Max: 11189 Err:     1 (25.00%)
>>    [jmeter] summary =      4 in 00:00:26 =    0.2/s Avg:  6495 Min:  
>282
>> Max: 11189 Err:     1 (25.00%)
>>    [jmeter] Tidying up ...    @ Sun Jun 17 11:45:30 UTC 2018
>> (1529235930979)
>>    [jmeter] ... end of run
>> Target 'batchtest' failed with message 'CSV Files are not identical.
>>         <https://builds.apache.org/job/JMeter%20Windows/ws/trunk\
>> bin\testfiles\SlowCharsFeature_Java.csv>
>>        
>label,responseCode,responseMessage,threadName,dataType,success
>> JSS_setCPS,200,OK,setUp Thread Group 1-1,text,true
>> ApacheJMeter-HP-Secure,206,Partial Content,Thread Group 1-1,text,true
>> HTTPS-SNI-without-timeout,206,Partial Content,Thread Group
>1-1,text,true
>> HTTPS-SNI-with-timeout,206,Partial Content,Thread Group 1-1,text,true
>>
>>         <https://builds.apache.org/job/JMeter%20Windows/ws/trunk\
>> bin\SlowCharsFeature_Java.csv>
>>        
>label,responseCode,responseMessage,threadName,dataType,success
>> JSS_setCPS,200,OK,setUp Thread Group 1-1,text,true
>> ApacheJMeter-HP-Secure,206,Partial Content,Thread Group 1-1,text,true
>> HTTPS-SNI-without-timeout,206,Partial Content,Thread Group
>1-1,text,true
>> HTTPS-SNI-with-timeout,206,Partial Content,Thread Group
>1-1,text,false'.
>> Target 'batch_scripts' failed with message 'The following error
>occurred
>> while executing this line:
>>
><https://builds.apache.org/job/JMeter%20Windows/ws/trunk\build.xml>:2775:
>> CSV Files are not identical.
>>         <https://builds.apache.org/job/JMeter%20Windows/ws/trunk\
>> bin\testfiles\SlowCharsFeature_Java.csv>
>>        
>label,responseCode,responseMessage,threadName,dataType,success
>> JSS_setCPS,200,OK,setUp Thread Group 1-1,text,true
>> ApacheJMeter-HP-Secure,206,Partial Content,Thread Group 1-1,text,true
>> HTTPS-SNI-without-timeout,206,Partial Content,Thread Group
>1-1,text,true
>> HTTPS-SNI-with-timeout,206,Partial Content,Thread Group 1-1,text,true
>>
>>         <https://builds.apache.org/job/JMeter%20Windows/ws/trunk\
>> bin\SlowCharsFeature_Java.csv>
>>        
>label,responseCode,responseMessage,threadName,dataType,success
>> JSS_setCPS,200,OK,setUp Thread Group 1-1,text,true
>> ApacheJMeter-HP-Secure,206,Partial Content,Thread Group 1-1,text,true
>> HTTPS-SNI-without-timeout,206,Partial Content,Thread Group
>1-1,text,true
>> HTTPS-SNI-with-timeout,206,Partial Content,Thread Group
>1-1,text,false'.
>> Cannot execute '_allbatchtests' - 'batch_scripts' failed or was not
>> executed.
>> Cannot execute 'test' - '_allbatchtests' failed or was not executed.
>>
>> download_checkstyle:
>>
>> _process_checkstyle_jars:
>>
>> _check_exists:
>>
>> _check_jarfile:
>>      [echo] Checking checkstyle-8.8-all.jar
>>      [echo] Deleting checkstyle-8.8-all.jar (excluding
>> checkstyle-8.8-all.jar)
>>
>> setproxy:
>>
>> _get_jarfile:
>>
>> setproxy:
>>
>> _get_zipfile:
>>
>> checkstyle:
>>
>> _process_checkstyle_jars:
>>
>> _check_exists:
>>
>> _check_jarfile:
>> [checkstyle] Running Checkstyle 8.8 on 1693 files
>>
>> BUILD FAILED
>>
><https://builds.apache.org/job/JMeter%20Windows/ws/trunk\build.xml>:2953:
>> The following error occurred while executing this line:
>>
><https://builds.apache.org/job/JMeter%20Windows/ws/trunk\build.xml>:2775:
>> CSV Files are not identical.
>>         <https://builds.apache.org/job/JMeter%20Windows/ws/trunk\
>> bin\testfiles\SlowCharsFeature_Java.csv>
>>        
>label,responseCode,responseMessage,threadName,dataType,success
>> JSS_setCPS,200,OK,setUp Thread Group 1-1,text,true
>> ApacheJMeter-HP-Secure,206,Partial Content,Thread Group 1-1,text,true
>> HTTPS-SNI-without-timeout,206,Partial Content,Thread Group
>1-1,text,true
>> HTTPS-SNI-with-timeout,206,Partial Content,Thread Group 1-1,text,true
>>
>>         <https://builds.apache.org/job/JMeter%20Windows/ws/trunk\
>> bin\SlowCharsFeature_Java.csv>
>>        
>label,responseCode,responseMessage,threadName,dataType,success
>> JSS_setCPS,200,OK,setUp Thread Group 1-1,text,true
>> ApacheJMeter-HP-Secure,206,Partial Content,Thread Group 1-1,text,true
>> HTTPS-SNI-without-timeout,206,Partial Content,Thread Group
>1-1,text,true
>> HTTPS-SNI-with-timeout,206,Partial Content,Thread Group
>1-1,text,false
>>
>> Total time: 7 minutes 25 seconds
>> Build step 'Invoke Ant' marked build as failure
>>

Mime
View raw message