jmeter-dev mailing list archives

Site index · List index
Message view « Date » · « Thread »
Top « Date » · « Thread »
From Apache Jenkins Server <jenk...@builds.apache.org>
Subject Build failed in Jenkins: JMeter Windows #1090
Date Tue, 12 Jun 2018 11:26:01 GMT
See <https://builds.apache.org/job/JMeter%20Windows/1090/display/redirect?page=changes>

Changes:

[pmouawad] Fix travis compilation error.
Try running tests with JDK10, JDK11

[pmouawad] Fix test failure on Brotli by switching to another hopefully more stable site

[pmouawad] Bug 60991 - XPath Extractor : Implement XPath 2.0
Update XPath2 Tester so that it's possible to use namespace aliases
Bugzilla Id: 60991

[pmouawad] Reset gridwidth to avoid side effects in case of evolution

[fschumacher] Correct wording in docs.

[pmouawad] Bug 60991 - XPath Extractor : Implement XPath 2.0

Make test fail on exception
Bugzilla Id: 60991

[pmouawad] Bug 60991 - XPath Extractor : Implement XPath 2.0

Use isNotEmpty instead of isNoneEmpty
Bugzilla Id: 60991

[pmouawad] Bug 60991 - XPath Extractor : Implement XPath 2.0

Fix some SONAR warnings
Bugzilla Id: 60991

------------------------------------------
[...truncated 188.92 KB...]
   [concat] java.net.ConnectException: Connection refused: connect
   [concat] 	at java.net.DualStackPlainSocketImpl.waitForConnect(Native Method) ~[?:1.8.0_152]
   [concat] 	at java.net.DualStackPlainSocketImpl.socketConnect(DualStackPlainSocketImpl.java:85)
~[?:1.8.0_152]
   [concat] 	at java.net.AbstractPlainSocketImpl.doConnect(AbstractPlainSocketImpl.java:350)
~[?:1.8.0_152]
   [concat] 	at java.net.AbstractPlainSocketImpl.connectToAddress(AbstractPlainSocketImpl.java:206)
~[?:1.8.0_152]
   [concat] 	at java.net.AbstractPlainSocketImpl.connect(AbstractPlainSocketImpl.java:188)
~[?:1.8.0_152]
   [concat] 	at java.net.PlainSocketImpl.connect(PlainSocketImpl.java:172) ~[?:1.8.0_152]
   [concat] 	at java.net.SocksSocketImpl.connect(SocksSocketImpl.java:392) ~[?:1.8.0_152]
   [concat] 	at java.net.Socket.connect(Socket.java:589) ~[?:1.8.0_152]
   [concat] 	at org.apache.jmeter.protocol.tcp.sampler.TCPSampler.getSocket(TCPSampler.java:168)
[ApacheJMeter_tcp.jar:r1833390]
   [concat] 	at org.apache.jmeter.protocol.tcp.sampler.TCPSampler.sample(TCPSampler.java:384)
[ApacheJMeter_tcp.jar:r1833390]
   [concat] 	at org.apache.jmeter.threads.JMeterThread.doSampling(JMeterThread.java:622) [ApacheJMeter_core.jar:r1833390]
   [concat] 	at org.apache.jmeter.threads.JMeterThread.executeSamplePackage(JMeterThread.java:546)
[ApacheJMeter_core.jar:r1833390]
   [concat] 	at org.apache.jmeter.threads.JMeterThread.processSampler(JMeterThread.java:486)
[ApacheJMeter_core.jar:r1833390]
   [concat] 	at org.apache.jmeter.threads.JMeterThread.run(JMeterThread.java:253) [ApacheJMeter_core.jar:r1833390]
   [concat] 	at java.lang.Thread.run(Thread.java:748) [?:1.8.0_152]
   [concat] 2018-06-12 11:23:47,073 WARN o.a.j.p.t.s.TCPSampler: Unknown host for tcp://localhostXXXX:2223
   [concat] java.net.UnknownHostException: localhostXXXX
   [concat] 	at java.net.AbstractPlainSocketImpl.connect(AbstractPlainSocketImpl.java:184)
~[?:1.8.0_152]
   [concat] 	at java.net.PlainSocketImpl.connect(PlainSocketImpl.java:172) ~[?:1.8.0_152]
   [concat] 	at java.net.SocksSocketImpl.connect(SocksSocketImpl.java:392) ~[?:1.8.0_152]
   [concat] 	at java.net.Socket.connect(Socket.java:589) ~[?:1.8.0_152]
   [concat] 	at org.apache.jmeter.protocol.tcp.sampler.TCPSampler.getSocket(TCPSampler.java:168)
[ApacheJMeter_tcp.jar:r1833390]
   [concat] 	at org.apache.jmeter.protocol.tcp.sampler.TCPSampler.sample(TCPSampler.java:384)
[ApacheJMeter_tcp.jar:r1833390]
   [concat] 	at org.apache.jmeter.threads.JMeterThread.doSampling(JMeterThread.java:622) [ApacheJMeter_core.jar:r1833390]
   [concat] 	at org.apache.jmeter.threads.JMeterThread.executeSamplePackage(JMeterThread.java:546)
[ApacheJMeter_core.jar:r1833390]
   [concat] 	at org.apache.jmeter.threads.JMeterThread.processSampler(JMeterThread.java:486)
[ApacheJMeter_core.jar:r1833390]
   [concat] 	at org.apache.jmeter.threads.JMeterThread.run(JMeterThread.java:253) [ApacheJMeter_core.jar:r1833390]
   [concat] 	at java.lang.Thread.run(Thread.java:748) [?:1.8.0_152]
   [concat] 2018-06-12 11:23:47,075 ERROR o.a.j.p.t.s.TCPSampler: Could not find protocol
class 'org.foo.xxx'
     [echo] TCP_TESTS output files compared OK

batchtest:
     [echo] Starting JDBC_TESTS with file JDBC_TESTS.jmx using -X -Jdummy=dummy
   [jmeter] SLF4J: Class path contains multiple SLF4J bindings.
   [jmeter] SLF4J: Found binding in [jar:file:/F:/jenkins/jenkins-slave/workspace/JMeter%20Windows/trunk/lib/log4j-slf4j-impl-2.10.0.jar!/org/slf4j/impl/StaticLoggerBinder.class]
   [jmeter] SLF4J: Found binding in [jar:file:/F:/jenkins/jenkins-slave/workspace/JMeter%20Windows/trunk/lib/opt/activemq-all-5.15.2.jar!/org/slf4j/impl/StaticLoggerBinder.class]
   [jmeter] SLF4J: See http://www.slf4j.org/codes.html#multiple_bindings for an explanation.
   [jmeter] SLF4J: Actual binding is of type [org.apache.logging.slf4j.Log4jLoggerFactory]
   [jmeter] Creating summariser <summary>
   [jmeter] Created the tree successfully using testfiles/JDBC_TESTS.jmx
   [jmeter] Starting the test @ Tue Jun 12 11:23:48 UTC 2018 (1528802628849)
   [jmeter] Jun 12, 2018 11:23:48 AM java.util.prefs.WindowsPreferences <init>
   [jmeter] WARNING: Could not open/create prefs root node Software\JavaSoft\Prefs at root
0x80000002. Windows RegCreateKeyEx(...) returned error code 5.
   [jmeter] Waiting for possible Shutdown/StopTestNow/Heapdump message on port 4445
   [jmeter] summary =     21 in 00:00:01 =   21.1/s Avg:    18 Min:     0 Max:   360 Err:
    0 (0.00%)
   [jmeter] Tidying up ...    @ Tue Jun 12 11:23:50 UTC 2018 (1528802630475)
   [jmeter] ... end of run
   [concat] 2018-06-12 11:23:50,445 ERROR o.a.j.t.JMeterThread: Error while processing sampler:
'JDBC_With_Failing_PreProcessor'.
   [concat] java.lang.IllegalArgumentException: Variable Name must not be null in JDBC PreProcessor
   [concat] 	at org.apache.jmeter.protocol.jdbc.processor.AbstractJDBCProcessor.process(AbstractJDBCProcessor.java:45)
~[ApacheJMeter_jdbc.jar:r1833390]
   [concat] 	at org.apache.jmeter.protocol.jdbc.processor.JDBCPreProcessor.process(JDBCPreProcessor.java:33)
~[ApacheJMeter_jdbc.jar:r1833390]
   [concat] 	at org.apache.jmeter.threads.JMeterThread.runPreProcessors(JMeterThread.java:935)
~[ApacheJMeter_core.jar:r1833390]
   [concat] 	at org.apache.jmeter.threads.JMeterThread.executeSamplePackage(JMeterThread.java:537)
~[ApacheJMeter_core.jar:r1833390]
   [concat] 	at org.apache.jmeter.threads.JMeterThread.processSampler(JMeterThread.java:486)
[ApacheJMeter_core.jar:r1833390]
   [concat] 	at org.apache.jmeter.threads.JMeterThread.run(JMeterThread.java:253) [ApacheJMeter_core.jar:r1833390]
   [concat] 	at java.lang.Thread.run(Thread.java:748) [?:1.8.0_152]
   [concat] 2018-06-12 11:23:50,450 ERROR o.a.j.t.JMeterThread: Error while processing sampler:
'JDBC_With_Failing_PostProcessor'.
   [concat] java.lang.IllegalArgumentException: Variable Name must not be null in JDBC PostProcessor
   [concat] 	at org.apache.jmeter.protocol.jdbc.processor.AbstractJDBCProcessor.process(AbstractJDBCProcessor.java:45)
~[ApacheJMeter_jdbc.jar:r1833390]
   [concat] 	at org.apache.jmeter.protocol.jdbc.processor.JDBCPostProcessor.process(JDBCPostProcessor.java:33)
~[ApacheJMeter_jdbc.jar:r1833390]
   [concat] 	at org.apache.jmeter.threads.JMeterThread.runPostProcessors(JMeterThread.java:925)
~[ApacheJMeter_core.jar:r1833390]
   [concat] 	at org.apache.jmeter.threads.JMeterThread.executeSamplePackage(JMeterThread.java:564)
~[ApacheJMeter_core.jar:r1833390]
   [concat] 	at org.apache.jmeter.threads.JMeterThread.processSampler(JMeterThread.java:486)
[ApacheJMeter_core.jar:r1833390]
   [concat] 	at org.apache.jmeter.threads.JMeterThread.run(JMeterThread.java:253) [ApacheJMeter_core.jar:r1833390]
   [concat] 	at java.lang.Thread.run(Thread.java:748) [?:1.8.0_152]
   [concat] 2018-06-12 11:23:50,451 WARN o.a.j.p.j.p.AbstractJDBCProcessor: SQL Problem in
JDBC PreProcessor: java.sql.SQLSyntaxErrorException: unexpected token: USERS
   [concat] 2018-06-12 11:23:50,456 WARN o.a.j.p.j.p.AbstractJDBCProcessor: SQL Problem in
JDBC PostProcessor: java.sql.SQLSyntaxErrorException: unexpected token: USERS
     [echo] JDBC_TESTS output files compared OK

batchtest:
     [echo] Starting JMS_TESTS with file JMS_TESTS.jmx using -X -Jdummy=dummy
   [jmeter] SLF4J: Class path contains multiple SLF4J bindings.
   [jmeter] SLF4J: Found binding in [jar:file:/F:/jenkins/jenkins-slave/workspace/JMeter%20Windows/trunk/lib/log4j-slf4j-impl-2.10.0.jar!/org/slf4j/impl/StaticLoggerBinder.class]
   [jmeter] SLF4J: Found binding in [jar:file:/F:/jenkins/jenkins-slave/workspace/JMeter%20Windows/trunk/lib/opt/activemq-all-5.15.2.jar!/org/slf4j/impl/StaticLoggerBinder.class]
   [jmeter] SLF4J: See http://www.slf4j.org/codes.html#multiple_bindings for an explanation.
   [jmeter] SLF4J: Actual binding is of type [org.apache.logging.slf4j.Log4jLoggerFactory]
   [jmeter] Creating summariser <summary>
   [jmeter] Created the tree successfully using testfiles/JMS_TESTS.jmx
   [jmeter] Starting the test @ Tue Jun 12 11:23:52 UTC 2018 (1528802632161)
   [jmeter] Waiting for possible Shutdown/StopTestNow/Heapdump message on port 4445
   [jmeter] Jun 12, 2018 11:23:52 AM java.util.prefs.WindowsPreferences <init>
   [jmeter] WARNING: Could not open/create prefs root node Software\JavaSoft\Prefs at root
0x80000002. Windows RegCreateKeyEx(...) returned error code 5.
   [jmeter] summary +     11 in 00:00:08 =    1.4/s Avg:   377 Min:     1 Max:  2002 Err:
    0 (0.00%) Active: 1 Started: 1 Finished: 0
   [jmeter] summary +     16 in 00:00:27 =    0.6/s Avg:   698 Min:     0 Max:  3004 Err:
    0 (0.00%) Active: 0 Started: 1 Finished: 1
   [jmeter] summary =     27 in 00:00:35 =    0.8/s Avg:   568 Min:     0 Max:  3004 Err:
    0 (0.00%)
   [jmeter] Tidying up ...    @ Tue Jun 12 11:24:27 UTC 2018 (1528802667257)
   [jmeter] ... end of run
     [echo] JMS_TESTS output files compared OK

batchtest:
     [echo] Starting OS_TESTS with file OS_TESTS.jmx using -X -Jdummy=dummy
   [jmeter] SLF4J: Class path contains multiple SLF4J bindings.
   [jmeter] SLF4J: Found binding in [jar:file:/F:/jenkins/jenkins-slave/workspace/JMeter%20Windows/trunk/lib/log4j-slf4j-impl-2.10.0.jar!/org/slf4j/impl/StaticLoggerBinder.class]
   [jmeter] SLF4J: Found binding in [jar:file:/F:/jenkins/jenkins-slave/workspace/JMeter%20Windows/trunk/lib/opt/activemq-all-5.15.2.jar!/org/slf4j/impl/StaticLoggerBinder.class]
   [jmeter] SLF4J: See http://www.slf4j.org/codes.html#multiple_bindings for an explanation.
   [jmeter] SLF4J: Actual binding is of type [org.apache.logging.slf4j.Log4jLoggerFactory]
   [jmeter] Creating summariser <summary>
   [jmeter] Created the tree successfully using testfiles/OS_TESTS.jmx
   [jmeter] Starting the test @ Tue Jun 12 11:24:29 UTC 2018 (1528802669225)
   [jmeter] Waiting for possible Shutdown/StopTestNow/Heapdump message on port 4445
   [jmeter] Jun 12, 2018 11:24:29 AM java.util.prefs.WindowsPreferences <init>
   [jmeter] WARNING: Could not open/create prefs root node Software\JavaSoft\Prefs at root
0x80000002. Windows RegCreateKeyEx(...) returned error code 5.
   [jmeter] summary +      3 in 00:00:02 =    1.9/s Avg:   347 Min:    16 Max:  1008 Err:
    0 (0.00%) Active: 1 Started: 1 Finished: 0
   [jmeter] summary =      3 in 00:00:02 =    1.9/s Avg:   347 Min:    16 Max:  1008 Err:
    0 (0.00%)
   [jmeter] Tidying up ...    @ Tue Jun 12 11:24:30 UTC 2018 (1528802670991)
   [jmeter] ... end of run
     [echo] OS_TESTS output files compared OK

batchtest:
     [echo] Starting FTP_TESTS with file FTP_TESTS.jmx using -X -Jdummy=dummy
   [jmeter] SLF4J: Class path contains multiple SLF4J bindings.
   [jmeter] SLF4J: Found binding in [jar:file:/F:/jenkins/jenkins-slave/workspace/JMeter%20Windows/trunk/lib/log4j-slf4j-impl-2.10.0.jar!/org/slf4j/impl/StaticLoggerBinder.class]
   [jmeter] SLF4J: Found binding in [jar:file:/F:/jenkins/jenkins-slave/workspace/JMeter%20Windows/trunk/lib/opt/activemq-all-5.15.2.jar!/org/slf4j/impl/StaticLoggerBinder.class]
   [jmeter] SLF4J: See http://www.slf4j.org/codes.html#multiple_bindings for an explanation.
   [jmeter] SLF4J: Actual binding is of type [org.apache.logging.slf4j.Log4jLoggerFactory]
   [jmeter] Creating summariser <summary>
   [jmeter] Created the tree successfully using testfiles/FTP_TESTS.jmx
   [jmeter] Starting the test @ Tue Jun 12 11:24:32 UTC 2018 (1528802672683)
   [jmeter] Waiting for possible Shutdown/StopTestNow/Heapdump message on port 4445
   [jmeter] Jun 12, 2018 11:24:32 AM java.util.prefs.WindowsPreferences <init>
   [jmeter] WARNING: Could not open/create prefs root node Software\JavaSoft\Prefs at root
0x80000002. Windows RegCreateKeyEx(...) returned error code 5.
   [jmeter] summary +      1 in 00:00:01 =    1.4/s Avg:   713 Min:   713 Max:   713 Err:
    0 (0.00%) Active: 1 Started: 1 Finished: 0
   [jmeter] summary +      5 in 00:00:01 =    3.8/s Avg:    32 Min:    12 Max:    60 Err:
    0 (0.00%) Active: 0 Started: 1 Finished: 1
   [jmeter] summary =      6 in 00:00:02 =    2.9/s Avg:   146 Min:    12 Max:   713 Err:
    0 (0.00%)
   [jmeter] Tidying up ...    @ Tue Jun 12 11:24:35 UTC 2018 (1528802675309)
   [jmeter] ... end of run
     [echo] FTP_TESTS output files compared OK

batchtest:
     [echo] Starting Bug60607 with file Bug60607.jmx using -X -Jdummy=dummy
   [jmeter] SLF4J: Class path contains multiple SLF4J bindings.
   [jmeter] SLF4J: Found binding in [jar:file:/F:/jenkins/jenkins-slave/workspace/JMeter%20Windows/trunk/lib/log4j-slf4j-impl-2.10.0.jar!/org/slf4j/impl/StaticLoggerBinder.class]
   [jmeter] SLF4J: Found binding in [jar:file:/F:/jenkins/jenkins-slave/workspace/JMeter%20Windows/trunk/lib/opt/activemq-all-5.15.2.jar!/org/slf4j/impl/StaticLoggerBinder.class]
   [jmeter] SLF4J: See http://www.slf4j.org/codes.html#multiple_bindings for an explanation.
   [jmeter] SLF4J: Actual binding is of type [org.apache.logging.slf4j.Log4jLoggerFactory]
   [jmeter] Creating summariser <summary>
   [jmeter] Created the tree successfully using testfiles/Bug60607.jmx
   [jmeter] Starting the test @ Tue Jun 12 11:24:37 UTC 2018 (1528802677016)
   [jmeter] Jun 12, 2018 11:24:37 AM java.util.prefs.WindowsPreferences <init>
   [jmeter] WARNING: Could not open/create prefs root node Software\JavaSoft\Prefs at root
0x80000002. Windows RegCreateKeyEx(...) returned error code 5.
   [jmeter] Waiting for possible Shutdown/StopTestNow/Heapdump message on port 4445
   [jmeter] summary =      2 in 00:00:45 =    0.0/s Avg: 22547 Min:    47 Max: 45047 Err:
    0 (0.00%)
   [jmeter] Tidying up ...    @ Tue Jun 12 11:25:22 UTC 2018 (1528802722657)
   [jmeter] ... end of run
     [echo] Bug60607 output files compared OK

batchtest:
     [echo] Starting SlowCharsFeature_HttpClient4 with file SlowCharsFeature.jmx using -X
-Jdummy=dummy
   [jmeter] SLF4J: Class path contains multiple SLF4J bindings.
   [jmeter] SLF4J: Found binding in [jar:file:/F:/jenkins/jenkins-slave/workspace/JMeter%20Windows/trunk/lib/log4j-slf4j-impl-2.10.0.jar!/org/slf4j/impl/StaticLoggerBinder.class]
   [jmeter] SLF4J: Found binding in [jar:file:/F:/jenkins/jenkins-slave/workspace/JMeter%20Windows/trunk/lib/opt/activemq-all-5.15.2.jar!/org/slf4j/impl/StaticLoggerBinder.class]
   [jmeter] SLF4J: See http://www.slf4j.org/codes.html#multiple_bindings for an explanation.
   [jmeter] SLF4J: Actual binding is of type [org.apache.logging.slf4j.Log4jLoggerFactory]
   [jmeter] Creating summariser <summary>
   [jmeter] Jun 12, 2018 11:25:24 AM java.util.prefs.WindowsPreferences <init>Created
the tree successfully using testfiles/SlowCharsFeature.jmx
   [jmeter] 
   [jmeter] Starting the test @ Tue Jun 12 11:25:24 UTC 2018 (1528802724449)
   [jmeter] Waiting for possible Shutdown/StopTestNow/Heapdump message on port 4445
   [jmeter] WARNING: Could not open/create prefs root node Software\JavaSoft\Prefs at root
0x80000002. Windows RegCreateKeyEx(...) returned error code 5.
   [jmeter] summary +      2 in 00:00:06 =    0.3/s Avg:  2944 Min:   292 Max:  5597 Err:
    0 (0.00%) Active: 1 Started: 1 Finished: 0
   [jmeter] summary +      3 in 00:00:18 =    0.2/s Avg:  5836 Min:  5577 Max:  6008 Err:
    1 (33.33%) Active: 0 Started: 1 Finished: 1
   [jmeter] summary =      5 in 00:00:24 =    0.2/s Avg:  4679 Min:   292 Max:  6008 Err:
    1 (20.00%)
   [jmeter] Tidying up ...    @ Tue Jun 12 11:25:48 UTC 2018 (1528802748443)
   [jmeter] ... end of run
Target 'batchtest' failed with message 'CSV Files are not identical.
        <https://builds.apache.org/job/JMeter%20Windows/ws/trunk\bin\testfiles\SlowCharsFeature_HttpClient4.csv>
        label,responseCode,responseMessage,threadName,dataType,success
JSS_setCPS,200,OK,setUp Thread Group 1-1,text,true
ApacheJMeter-HP-NonSecure,206,Partial Content,Thread Group 1-1,text,true
ApacheJMeter-HP-Secure,206,Partial Content,Thread Group 1-1,text,true
HTTPS-SNI-without-timeout,206,Partial Content,Thread Group 1-1,text,true
HTTPS-SNI-with-timeout,206,Partial Content,Thread Group 1-1,text,true

        <https://builds.apache.org/job/JMeter%20Windows/ws/trunk\bin\SlowCharsFeature_HttpClient4.csv>
        label,responseCode,responseMessage,threadName,dataType,success
JSS_setCPS,200,OK,setUp Thread Group 1-1,text,true
ApacheJMeter-HP-NonSecure,206,Partial Content,Thread Group 1-1,text,true
ApacheJMeter-HP-Secure,Non HTTP response code: org.apache.http.conn.ConnectTimeoutException,"Non
HTTP response message: Connect to jmeter.apache.org:443 [jmeter.apache.org/40.79.78.1, jmeter.apache.org/95.216.24.32]
failed: connect timed out",Thread Group 1-1,text,false
HTTPS-SNI-without-timeout,206,Partial Content,Thread Group 1-1,text,true
HTTPS-SNI-with-timeout,206,Partial Content,Thread Group 1-1,text,true'.
Target 'batch_scripts' failed with message 'The following error occurred while executing this
line:
<https://builds.apache.org/job/JMeter%20Windows/ws/trunk\build.xml>:2775: CSV Files
are not identical.
        <https://builds.apache.org/job/JMeter%20Windows/ws/trunk\bin\testfiles\SlowCharsFeature_HttpClient4.csv>
        label,responseCode,responseMessage,threadName,dataType,success
JSS_setCPS,200,OK,setUp Thread Group 1-1,text,true
ApacheJMeter-HP-NonSecure,206,Partial Content,Thread Group 1-1,text,true
ApacheJMeter-HP-Secure,206,Partial Content,Thread Group 1-1,text,true
HTTPS-SNI-without-timeout,206,Partial Content,Thread Group 1-1,text,true
HTTPS-SNI-with-timeout,206,Partial Content,Thread Group 1-1,text,true

        <https://builds.apache.org/job/JMeter%20Windows/ws/trunk\bin\SlowCharsFeature_HttpClient4.csv>
        label,responseCode,responseMessage,threadName,dataType,success
JSS_setCPS,200,OK,setUp Thread Group 1-1,text,true
ApacheJMeter-HP-NonSecure,206,Partial Content,Thread Group 1-1,text,true
ApacheJMeter-HP-Secure,Non HTTP response code: org.apache.http.conn.ConnectTimeoutException,"Non
HTTP response message: Connect to jmeter.apache.org:443 [jmeter.apache.org/40.79.78.1, jmeter.apache.org/95.216.24.32]
failed: connect timed out",Thread Group 1-1,text,false
HTTPS-SNI-without-timeout,206,Partial Content,Thread Group 1-1,text,true
HTTPS-SNI-with-timeout,206,Partial Content,Thread Group 1-1,text,true'.
Cannot execute '_allbatchtests' - 'batch_scripts' failed or was not executed.
Cannot execute 'test' - '_allbatchtests' failed or was not executed.

download_checkstyle:

_process_checkstyle_jars:

_check_exists:

_check_jarfile:
     [echo] Checking checkstyle-8.8-all.jar
     [echo] Deleting checkstyle-8.8-all.jar (excluding checkstyle-8.8-all.jar)

setproxy:

_get_jarfile:

setproxy:

_get_zipfile:

checkstyle:

_process_checkstyle_jars:

_check_exists:

_check_jarfile:
[checkstyle] Running Checkstyle 8.8 on 1690 files

BUILD FAILED
<https://builds.apache.org/job/JMeter%20Windows/ws/trunk\build.xml>:2947: The following
error occurred while executing this line:
<https://builds.apache.org/job/JMeter%20Windows/ws/trunk\build.xml>:2775: CSV Files
are not identical.
        <https://builds.apache.org/job/JMeter%20Windows/ws/trunk\bin\testfiles\SlowCharsFeature_HttpClient4.csv>
        label,responseCode,responseMessage,threadName,dataType,success
JSS_setCPS,200,OK,setUp Thread Group 1-1,text,true
ApacheJMeter-HP-NonSecure,206,Partial Content,Thread Group 1-1,text,true
ApacheJMeter-HP-Secure,206,Partial Content,Thread Group 1-1,text,true
HTTPS-SNI-without-timeout,206,Partial Content,Thread Group 1-1,text,true
HTTPS-SNI-with-timeout,206,Partial Content,Thread Group 1-1,text,true

        <https://builds.apache.org/job/JMeter%20Windows/ws/trunk\bin\SlowCharsFeature_HttpClient4.csv>
        label,responseCode,responseMessage,threadName,dataType,success
JSS_setCPS,200,OK,setUp Thread Group 1-1,text,true
ApacheJMeter-HP-NonSecure,206,Partial Content,Thread Group 1-1,text,true
ApacheJMeter-HP-Secure,Non HTTP response code: org.apache.http.conn.ConnectTimeoutException,"Non
HTTP response message: Connect to jmeter.apache.org:443 [jmeter.apache.org/40.79.78.1, jmeter.apache.org/95.216.24.32]
failed: connect timed out",Thread Group 1-1,text,false
HTTPS-SNI-without-timeout,206,Partial Content,Thread Group 1-1,text,true
HTTPS-SNI-with-timeout,206,Partial Content,Thread Group 1-1,text,true

Total time: 7 minutes 15 seconds
Build step 'Invoke Ant' marked build as failure

Mime
View raw message