jmeter-dev mailing list archives

Site index · List index
Message view « Date » · « Thread »
Top « Date » · « Thread »
From Apache Jenkins Server <jenk...@builds.apache.org>
Subject Build failed in Jenkins: JMeter-trunk #6795
Date Sun, 03 Jun 2018 19:53:49 GMT
See <https://builds.apache.org/job/JMeter-trunk/6795/display/redirect?page=changes>

Changes:

[pmouawad] Bug 60991 - XPath Extractor : Implement XPath 2.0

Fix failures on jars versions testing
Bugzilla Id: 60991

[pmouawad] Bug 60991 - XPath Extractor : Implement XPath 2.0

Fix failures on SaveService
Bugzilla Id: 60991

[pmouawad] Bug 60991 - XPath Extractor : Implement XPath 2.0

Contributed by UbikLoadPack
Bugzilla Id: 60991

------------------------------------------
[...truncated 543.16 KB...]
    [junit] Running org.apache.jmeter.functions.TestJexl2Function
    [junit] Tests run: 5, Failures: 0, Errors: 0, Skipped: 0, Time elapsed: 0.212 sec
    [junit] Running org.apache.jmeter.functions.TestJexl3Function
    [junit] Tests run: 5, Failures: 0, Errors: 0, Skipped: 0, Time elapsed: 0.306 sec
    [junit] Running org.apache.jmeter.functions.TestMachineIPName
    [junit] Tests run: 5, Failures: 0, Errors: 0, Skipped: 0, Time elapsed: 0.006 sec
    [junit] Running org.apache.jmeter.functions.TestRandomFromMultipleVars
    [junit] Tests run: 4, Failures: 0, Errors: 0, Skipped: 0, Time elapsed: 0.006 sec
    [junit] Running org.apache.jmeter.functions.TestRegexFunction
    [junit] Tests run: 22, Failures: 0, Errors: 0, Skipped: 0, Time elapsed: 0.025 sec
    [junit] Running org.apache.jmeter.functions.TestSamplerNameFunction
    [junit] Tests run: 2, Failures: 0, Errors: 0, Skipped: 0, Time elapsed: 0.015 sec
    [junit] Running org.apache.jmeter.functions.TestSetProperty
    [junit] Tests run: 3, Failures: 0, Errors: 0, Skipped: 0, Time elapsed: 0.022 sec
    [junit] Running org.apache.jmeter.functions.TestSimpleFunctions
    [junit] Tests run: 17, Failures: 0, Errors: 0, Skipped: 0, Time elapsed: 0.148 sec
    [junit] Running org.apache.jmeter.functions.TestTimeFunction
    [junit] Tests run: 15, Failures: 0, Errors: 0, Skipped: 0, Time elapsed: 0.024 sec
    [junit] Running org.apache.jmeter.functions.TestTimeRandomDateFunction
    [junit] Tests run: 14, Failures: 0, Errors: 0, Skipped: 0, Time elapsed: 0.087 sec
    [junit] Running org.apache.jmeter.functions.TestTimeShiftFunction
    [junit] Tests run: 11, Failures: 0, Errors: 0, Skipped: 0, Time elapsed: 0.145 sec
    [junit] Running org.apache.jmeter.functions.TestUrlEncodeDecode
    [junit] Tests run: 3, Failures: 0, Errors: 0, Skipped: 0, Time elapsed: 0.065 sec
    [junit] Running org.apache.jmeter.functions.VariableTest
    [junit] Tests run: 1, Failures: 0, Errors: 0, Skipped: 0, Time elapsed: 0.004 sec
    [junit] Running org.apache.jmeter.gui.action.TestLoad
    [junit] Tests run: 83, Failures: 0, Errors: 0, Skipped: 0, Time elapsed: 2.957 sec
    [junit] Running org.apache.jmeter.gui.action.TestSave
    [junit] Tests run: 1, Failures: 0, Errors: 0, Skipped: 0, Time elapsed: 0.011 sec
    [junit] Running org.apache.jmeter.gui.logging.TestGuiLogEventAppender
    [junit] Tests run: 1, Failures: 0, Errors: 0, Skipped: 0, Time elapsed: 0.055 sec
    [junit] Running org.apache.jmeter.gui.util.JSyntaxTextAreaTest
    [junit] Tests run: 2, Failures: 0, Errors: 0, Skipped: 0, Time elapsed: 0.021 sec
    [junit] Running org.apache.jmeter.junit.JMeterTest
    [junit] Tests run: 715, Failures: 0, Errors: 0, Skipped: 0, Time elapsed: 2.164 sec
    [junit] Running org.apache.jmeter.listeners.TestResultAction
    [junit] Tests run: 5, Failures: 0, Errors: 0, Skipped: 0, Time elapsed: 0.006 sec
    [junit] Running org.apache.jmeter.protocol.http.config.MultipartUrlConfigTest
    [junit] Tests run: 3, Failures: 0, Errors: 0, Skipped: 0, Time elapsed: 0.006 sec
    [junit] Running org.apache.jmeter.protocol.http.config.UrlConfigTest
    [junit] Tests run: 2, Failures: 0, Errors: 0, Skipped: 0, Time elapsed: 0.005 sec
    [junit] Running org.apache.jmeter.protocol.http.control.TestAuthManager
    [junit] Tests run: 6, Failures: 0, Errors: 0, Skipped: 0, Time elapsed: 0.01 sec
    [junit] Running org.apache.jmeter.protocol.http.control.TestAuthorization
    [junit] Tests run: 1, Failures: 0, Errors: 0, Skipped: 0, Time elapsed: 0.005 sec
    [junit] Running org.apache.jmeter.protocol.http.control.TestCacheManagerHC4
    [junit] Tests run: 24, Failures: 0, Errors: 0, Skipped: 0, Time elapsed: 12.802 sec
    [junit] Running org.apache.jmeter.protocol.http.control.TestCacheManagerUrlConnection
    [junit] Tests run: 23, Failures: 0, Errors: 0, Skipped: 0, Time elapsed: 12.838 sec
    [junit] Running org.apache.jmeter.protocol.http.control.TestDNSCacheManager
    [junit] Tests run: 12, Failures: 0, Errors: 0, Skipped: 0, Time elapsed: 0.308 sec
    [junit] Running org.apache.jmeter.protocol.http.control.TestHC4CookieManager
    [junit] Tests run: 33, Failures: 0, Errors: 0, Skipped: 0, Time elapsed: 0.1 sec
    [junit] Running org.apache.jmeter.protocol.http.control.TestHTTPMirrorThread
    [junit] Tests run: 9, Failures: 0, Errors: 0, Skipped: 0, Time elapsed: 1.007 sec
    [junit] Running org.apache.jmeter.protocol.http.control.gui.TestHttpTestSampleGui
    [junit] Tests run: 1, Failures: 0, Errors: 0, Skipped: 0, Time elapsed: 0.031 sec
    [junit] Running org.apache.jmeter.protocol.http.modifier.TestAnchorModifier
    [junit] Tests run: 18, Failures: 0, Errors: 0, Skipped: 0, Time elapsed: 0.435 sec
    [junit] Running org.apache.jmeter.protocol.http.modifier.TestURLRewritingModifier
    [junit] Tests run: 17, Failures: 0, Errors: 0, Skipped: 0, Time elapsed: 0.355 sec
    [junit] Running org.apache.jmeter.protocol.http.parser.TestBaseParser
    [junit] Tests run: 2, Failures: 0, Errors: 0, Skipped: 0, Time elapsed: 0.034 sec
    [junit] Running org.apache.jmeter.protocol.http.parser.TestBug60842HtmlParser
    [junit] Tests run: 42, Failures: 0, Errors: 0, Skipped: 0, Time elapsed: 0.17 sec
    [junit] Running org.apache.jmeter.protocol.http.parser.TestCssParser
    [junit] Tests run: 4, Failures: 0, Errors: 0, Skipped: 0, Time elapsed: 0.721 sec
    [junit] Running org.apache.jmeter.protocol.http.parser.TestHTMLParser
    [junit] Tests run: 103, Failures: 0, Errors: 0, Skipped: 0, Time elapsed: 0.595 sec
    [junit] Running org.apache.jmeter.protocol.http.parser.TestHtmlParsingUtils
    [junit] Tests run: 6, Failures: 0, Errors: 0, Skipped: 0, Time elapsed: 0.011 sec
    [junit] Running org.apache.jmeter.protocol.http.proxy.TestHttpRequestHdr
    [junit] Tests run: 10, Failures: 0, Errors: 0, Skipped: 0, Time elapsed: 0.375 sec
    [junit] Running org.apache.jmeter.protocol.http.proxy.TestProxyControl
    [junit] Tests run: 7, Failures: 0, Errors: 0, Skipped: 0, Time elapsed: 0.069 sec
    [junit] Running org.apache.jmeter.protocol.http.sampler.PackageTest
    [junit] Tests run: 1, Failures: 0, Errors: 0, Skipped: 0, Time elapsed: 0.039 sec
    [junit] Running org.apache.jmeter.protocol.http.sampler.PostWriterTest
    [junit] Tests run: 8, Failures: 0, Errors: 0, Skipped: 0, Time elapsed: 0.02 sec
    [junit] Running org.apache.jmeter.protocol.http.sampler.PutWriterTest
    [junit] Tests run: 2, Failures: 0, Errors: 0, Skipped: 0, Time elapsed: 0.004 sec
    [junit] Running org.apache.jmeter.protocol.http.sampler.TestHTTPSamplers
    [junit] Tests run: 18, Failures: 0, Errors: 0, Skipped: 0, Time elapsed: 0.012 sec
    [junit] Running org.apache.jmeter.protocol.http.sampler.TestHTTPSamplersAgainstHttpMirrorServer
    [junit] Tests run: 53, Failures: 0, Errors: 0, Skipped: 0, Time elapsed: 0.648 sec
    [junit] Running org.apache.jmeter.protocol.http.sampler.TestHttpWebdav
    [junit] Tests run: 2, Failures: 0, Errors: 0, Skipped: 0, Time elapsed: 0.004 sec
    [junit] Running org.apache.jmeter.protocol.http.util.TestHTTPArgument
    [junit] Tests run: 3, Failures: 0, Errors: 0, Skipped: 0, Time elapsed: 0.004 sec
    [junit] Running org.apache.jmeter.protocol.http.util.TestHTTPFileArg
    [junit] Tests run: 3, Failures: 0, Errors: 0, Skipped: 0, Time elapsed: 0.003 sec
    [junit] Running org.apache.jmeter.protocol.http.util.TestHTTPFileArgs
    [junit] Tests run: 5, Failures: 0, Errors: 0, Skipped: 0, Time elapsed: 0.004 sec
    [junit] Running org.apache.jmeter.protocol.http.util.accesslog.TestLogFilter
    [junit] Tests run: 6, Failures: 0, Errors: 0, Skipped: 0, Time elapsed: 0.004 sec
    [junit] Running org.apache.jmeter.protocol.http.util.accesslog.TestSessionFilter
    [junit] Tests run: 3, Failures: 0, Errors: 0, Skipped: 0, Time elapsed: 0.005 sec
    [junit] Running org.apache.jmeter.protocol.http.util.accesslog.TestTCLogParser
    [junit] Tests run: 4, Failures: 0, Errors: 0, Skipped: 0, Time elapsed: 0.004 sec
    [junit] Running org.apache.jmeter.protocol.http.visualizers.RequestViewHTTPTest
    [junit] Tests run: 7, Failures: 0, Errors: 0, Skipped: 0, Time elapsed: 0.005 sec
    [junit] Running org.apache.jmeter.protocol.jms.sampler.PublisherSamplerTest
    [junit] Tests run: 1, Failures: 0, Errors: 0, Skipped: 0, Time elapsed: 0.022 sec
    [junit] Running org.apache.jmeter.protocol.jms.sampler.render.BinaryMessageRendererTest
    [junit] Tests run: 8, Failures: 0, Errors: 0, Skipped: 0, Time elapsed: 0.052 sec
    [junit] Running org.apache.jmeter.protocol.jms.sampler.render.ObjectMessageRendererTest
    [junit] Tests run: 5, Failures: 0, Errors: 0, Skipped: 0, Time elapsed: 0.054 sec
    [junit] Running org.apache.jmeter.protocol.jms.sampler.render.TextMessageRendererTest
    [junit] Tests run: 7, Failures: 0, Errors: 0, Skipped: 0, Time elapsed: 0.006 sec
    [junit] Running org.apache.jmeter.protocol.ldap.config.gui.PackageTest
    [junit] Tests run: 1, Failures: 0, Errors: 0, Skipped: 0, Time elapsed: 0.005 sec
    [junit] Running org.apache.jmeter.protocol.tcp.sampler.BinaryTCPClientImplTest
    [junit] Tests run: 3, Failures: 0, Errors: 0, Skipped: 0, Time elapsed: 0.04 sec
    [junit] Running org.apache.jmeter.protocol.tcp.sampler.LengthPrefixedBinaryTCPClientImplTest
    [junit] Tests run: 2, Failures: 0, Errors: 0, Skipped: 0, Time elapsed: 0.024 sec
    [junit] Running org.apache.jmeter.protocol.tcp.sampler.TCPClientDecoratorTest
    [junit] Tests run: 3, Failures: 0, Errors: 0, Skipped: 0, Time elapsed: 0.02 sec
    [junit] Running org.apache.jmeter.report.core.CsvSampleReaderTest
    [junit] Tests run: 6, Failures: 0, Errors: 0, Skipped: 0, Time elapsed: 0.043 sec
    [junit] Running org.apache.jmeter.report.core.SampleMetadataTest
    [junit] Tests run: 1, Failures: 0, Errors: 0, Skipped: 0, Time elapsed: 0.003 sec
    [junit] Running org.apache.jmeter.report.core.TestCsvSampleWriter
    [junit] Tests run: 5, Failures: 0, Errors: 0, Skipped: 0, Time elapsed: 0.007 sec
    [junit] Running org.apache.jmeter.report.dashboard.ApdexPerTransactionTest
    [junit] Tests run: 7, Failures: 0, Errors: 0, Skipped: 0, Time elapsed: 0.025 sec
    [junit] Running org.apache.jmeter.report.processor.ErrorsSummaryConsumerTest
    [junit] Tests run: 2, Failures: 0, Errors: 0, Skipped: 0, Time elapsed: 0.013 sec
    [junit] Running org.apache.jmeter.report.processor.FieldSampleComparatorTest
    [junit] Tests run: 1, Failures: 0, Errors: 0, Skipped: 0, Time elapsed: 0.003 sec
    [junit] Running org.apache.jmeter.reporters.TestResultSaver
    [junit] Tests run: 5, Failures: 0, Errors: 0, Skipped: 0, Time elapsed: 0.006 sec
    [junit] Running org.apache.jmeter.resources.PackageTest
    [junit] Tests run: 365, Failures: 0, Errors: 0, Skipped: 0, Time elapsed: 1.27 sec
    [junit] Running org.apache.jmeter.resources.TestPropertiesFiles
    [junit] Tests run: 2, Failures: 0, Errors: 0, Skipped: 0, Time elapsed: 0.034 sec
    [junit] Running org.apache.jmeter.samplers.TestSampleResult
    [junit] Tests run: 16, Failures: 0, Errors: 0, Skipped: 0, Time elapsed: 3.889 sec
    [junit] Running org.apache.jmeter.samplers.TestSampleSaveConfiguration
    [junit] Tests run: 7, Failures: 0, Errors: 0, Skipped: 0, Time elapsed: 0.082 sec
    [junit] Running org.apache.jmeter.save.TestCSVSaveService
    [junit] Tests run: 11, Failures: 0, Errors: 0, Skipped: 0, Time elapsed: 0.165 sec
    [junit] Running org.apache.jmeter.save.TestSaveService
    [junit] Tests run: 5, Failures: 0, Errors: 0, Skipped: 0, Time elapsed: 1.052 sec
    [junit] Running org.apache.jmeter.testbeans.gui.PackageTest
    [junit] Tests run: 384, Failures: 0, Errors: 0, Skipped: 0, Time elapsed: 1.862 sec
    [junit] Running org.apache.jmeter.testbeans.gui.TestBooleanPropertyEditor
    [junit] Tests run: 2, Failures: 0, Errors: 0, Skipped: 0, Time elapsed: 0.003 sec
    [junit] Running org.apache.jmeter.testbeans.gui.TestComboStringEditor
    [junit] Tests run: 2, Failures: 0, Errors: 0, Skipped: 0, Time elapsed: 0.009 sec
    [junit] Running org.apache.jmeter.testbeans.gui.TestFieldStringEditor
    [junit] Tests run: 2, Failures: 0, Errors: 0, Skipped: 0, Time elapsed: 0.008 sec
    [junit] Running org.apache.jmeter.testelement.PackageTest
    [junit] Tests run: 2, Failures: 0, Errors: 0, Skipped: 0, Time elapsed: 0.004 sec
    [junit] Running org.apache.jmeter.testelement.TestElementTest
    [junit] Tests run: 135, Failures: 0, Errors: 0, Skipped: 0, Time elapsed: 0.133 sec
    [junit] Running org.apache.jmeter.testelement.TestHeaderManager
    [junit] Tests run: 2, Failures: 0, Errors: 0, Skipped: 0, Time elapsed: 0.005 sec
    [junit] Running org.apache.jmeter.testelement.TestNumberProperty
    [junit] Tests run: 5, Failures: 0, Errors: 0, Skipped: 0, Time elapsed: 0.006 sec
    [junit] Running org.apache.jmeter.testelement.property.AbstractPropertyTest
    [junit] Tests run: 6, Failures: 0, Errors: 0, Skipped: 0, Time elapsed: 0.017 sec
    [junit] Running org.apache.jmeter.testelement.property.MapPropertyTest
    [junit] Tests run: 2, Failures: 0, Errors: 0, Skipped: 0, Time elapsed: 0.005 sec
    [junit] Running org.apache.jmeter.testelement.property.PackageTest
    [junit] Tests run: 11, Failures: 0, Errors: 0, Skipped: 0, Time elapsed: 0.005 sec
    [junit] Running org.apache.jmeter.threads.TestJMeterContextService
    [junit] Tests run: 1, Failures: 0, Errors: 0, Skipped: 0, Time elapsed: 0.002 sec
    [junit] Running org.apache.jmeter.threads.TestJMeterThread
    [junit] Tests run: 2, Failures: 0, Errors: 0, Skipped: 0, Time elapsed: 0.004 sec
    [junit] Running org.apache.jmeter.threads.TestTestCompiler
    [junit] Tests run: 1, Failures: 0, Errors: 0, Skipped: 0, Time elapsed: 0.01 sec
    [junit] Running org.apache.jmeter.threads.TestUnmodifiableJMeterVariables
    [junit] Tests run: 17, Failures: 0, Errors: 0, Skipped: 0, Time elapsed: 0.01 sec
    [junit] Running org.apache.jmeter.timers.ConstantThroughputTimerTest
    [junit] Tests run: 9, Failures: 0, Errors: 0, Skipped: 0, Time elapsed: 0.563 sec
    [junit] Running org.apache.jmeter.timers.poissonarrivals.PreciseThroughputTimerTest
    [junit] Tests run: 2, Failures: 0, Errors: 0, Skipped: 0, Time elapsed: 0.06 sec
    [junit] Running org.apache.jmeter.util.JSR223TestElementTest
    [junit] Tests run: 2, Failures: 0, Errors: 0, Skipped: 0, Time elapsed: 0.052 sec
    [junit] Running org.apache.jmeter.util.PackageTest
    [junit] Tests run: 1, Failures: 0, Errors: 0, Skipped: 0, Time elapsed: 0.003 sec
    [junit] Running org.apache.jmeter.util.StringUtilitiesTest
    [junit] Tests run: 5, Failures: 0, Errors: 0, Skipped: 0, Time elapsed: 0.055 sec
    [junit] Running org.apache.jmeter.util.TestJMeterUtils
    [junit] Tests run: 3, Failures: 0, Errors: 0, Skipped: 0, Time elapsed: 0.013 sec
    [junit] Running org.apache.jmeter.util.XPathUtilTest
    [junit] Tests run: 5, Failures: 0, Errors: 0, Skipped: 0, Time elapsed: 0.906 sec
    [junit] Running org.apache.jmeter.visualizers.TestRenderAsJson
    [junit] Tests run: 7, Failures: 0, Errors: 0, Skipped: 0, Time elapsed: 0.005 sec
    [junit] Running org.apache.jmeter.visualizers.TestSampleCompareTo
    [junit] Tests run: 9, Failures: 0, Errors: 0, Skipped: 0, Time elapsed: 0.004 sec
    [junit] Running org.apache.jmeter.visualizers.TestSamplingStatCalculator
    [junit] Tests run: 2, Failures: 0, Errors: 0, Skipped: 0, Time elapsed: 0.006 sec
    [junit] Running org.apache.jmeter.visualizers.backend.SamplerMetricFixedModeTest
    [junit] Tests run: 3, Failures: 0, Errors: 0, Skipped: 0, Time elapsed: 0.019 sec
    [junit] Running org.apache.jmeter.visualizers.backend.SamplerMetricTimedModeTest
    [junit] Tests run: 2, Failures: 0, Errors: 0, Skipped: 0, Time elapsed: 0.003 sec
    [junit] Running org.apache.jorphan.TestFunctorUsers
    [junit] Tests run: 7, Failures: 0, Errors: 0, Skipped: 0, Time elapsed: 0.048 sec
    [junit] Running org.apache.jorphan.TestXMLBuffer
    [junit] Tests run: 4, Failures: 0, Errors: 0, Skipped: 0, Time elapsed: 0.004 sec
    [junit] Running org.apache.jorphan.collections.PackageTest
    [junit] Tests run: 5, Failures: 0, Errors: 0, Skipped: 0, Time elapsed: 0.009 sec
    [junit] Running org.apache.jorphan.exec.TestKeyToolUtils
    [junit] Tests run: 1, Failures: 0, Errors: 0, Skipped: 0, Time elapsed: 0.004 sec
    [junit] Running org.apache.jorphan.gui.ObjectTableModelTest
    [junit] Tests run: 6, Failures: 0, Errors: 0, Skipped: 0, Time elapsed: 0.027 sec
    [junit] Running org.apache.jorphan.gui.ObjectTableSorterTest
    [junit] Tests run: 26, Failures: 0, Errors: 0, Skipped: 0, Time elapsed: 0.104 sec
    [junit] Running org.apache.jorphan.math.TestStatCalculator
    [junit] Tests run: 10, Failures: 0, Errors: 0, Skipped: 2, Time elapsed: 0.05 sec
    [junit] Running org.apache.jorphan.reflect.TestClassFinder
    [junit] Tests run: 10, Failures: 0, Errors: 0, Skipped: 0, Time elapsed: 25.415 sec
    [junit] Running org.apache.jorphan.reflect.TestClassTools
    [junit] Tests run: 4, Failures: 0, Errors: 0, Skipped: 0, Time elapsed: 0.068 sec
    [junit] Running org.apache.jorphan.reflect.TestFunctor
    [junit] Tests run: 6, Failures: 0, Errors: 0, Skipped: 0, Time elapsed: 0.088 sec
    [junit] Running org.apache.jorphan.util.TestConverter
    [junit] Tests run: 8, Failures: 0, Errors: 0, Skipped: 0, Time elapsed: 0.131 sec
    [junit] Running org.apache.jorphan.util.TestJorphanUtils
    [junit] Tests run: 40, Failures: 0, Errors: 0, Skipped: 0, Time elapsed: 0.519 sec

nightlysonar:

checkstyle:

_process_checkstyle_jars:

_check_exists:

_check_jarfile:
[checkstyle] Running Checkstyle 8.8 on 1690 files
[checkstyle] [ERROR] <https://builds.apache.org/job/JMeter-trunk/ws/trunk/src/components/org/apache/jmeter/visualizers/RenderAsXPath2.java>:132:
Line is longer than 160 characters (found 180). [LineLength]
[checkstyle] [ERROR] <https://builds.apache.org/job/JMeter-trunk/ws/trunk/src/core/org/apache/jmeter/util/XPathQueryCacheLoader.java>:29:
Wrong order for 'net.sf.saxon.s9api.Processor' import. [ImportOrder]
[checkstyle] [ERROR] <https://builds.apache.org/job/JMeter-trunk/ws/trunk/src/core/org/apache/jmeter/util/XPathUtil.java>:71:
Wrong order for 'net.sf.saxon.s9api.Processor' import. [ImportOrder]
[checkstyle] [ERROR] <https://builds.apache.org/job/JMeter-trunk/ws/trunk/src/core/org/apache/jmeter/util/XPathUtil.java>:367:
Unnecessary consecutive lines [RegexpMultiline]
[checkstyle] [ERROR] <https://builds.apache.org/job/JMeter-trunk/ws/trunk/src/core/org/apache/jmeter/util/XPathUtil.java>:554:
Unnecessary consecutive lines [RegexpMultiline]

BUILD FAILED
<https://builds.apache.org/job/JMeter-trunk/ws/trunk/build.xml>:3592: Got 5 errors and
0 warnings.

Total time: 17 minutes 11 seconds
Build step 'Invoke Ant' marked build as failure
[locks-and-latches] Releasing all the locks
[locks-and-latches] All the locks released
Archiving artifacts
[Fast Archiver] Compressed 135.84 MB of artifacts by 26.4% relative to #6794
Recording test results

Mime
View raw message