jmeter-dev mailing list archives

Site index · List index
Message view « Date » · « Thread »
Top « Date » · « Thread »
From Apache Jenkins Server <jenk...@builds.apache.org>
Subject Build failed in Jenkins: JMeter Ubuntu #496
Date Sun, 15 Jul 2018 11:23:43 GMT
See <https://builds.apache.org/job/JMeter%20Ubuntu/496/display/redirect?page=changes>

Changes:

[fschumacher] Updated to httpcore[-nio]-4.4.10 (from httpcore[-nio]-4.4.9)

[fschumacher] Updated to commons-pool2-2.6.0 (from commons-pool2-2.5.0)

[fschumacher] Updated to commons-dbcp2-2.4.0 (from commons-dbcp2-2.2.0)

[fschumacher] Updated to cglib-nodep-3.2.7 (from cglib-nodep-3.2.6)

[fschumacher] Updated to caffeine-2.6.2 (from caffeine-2.6.1)

[fschumacher] Updated to httpmime-4.5.6 (from httpmime 4.5.5)

[fschumacher] Updated to httpclient-4.5.6 (from httpclient 4.5.5) and updated to freemarker-2.3.28
(from freemarker-2.3.23).

Based on patch by orimarko (orimarko at gmail.com)
Bugzilla Id: 62529

[fschumacher] Some tests for jorphans Converter

[fschumacher] Use Boolean#FALSE as the log statement auto-boxes the boolean value anyway.

[fschumacher] Sync documentation to the implementation of the ForEachController. 

Based on contribution by orimarko (orimarko at gmail.com)
Bugzilla Id: 62482

[milamber] Allow use epoch time as Date String value in function __dateTimeConvert
Bugzilla Id: 62533

------------------------------------------
[...truncated 181.03 KB...]
   [jmeter] Starting the test @ Sun Jul 15 11:21:19 UTC 2018 (1531653679041)
   [jmeter] Waiting for possible Shutdown/StopTestNow/Heapdump message on port 4445
   [jmeter] summary =      2 in 00:00:02 =    1.3/s Avg:   615 Min:   485 Max:   746 Err:
    0 (0.00%)
   [jmeter] Tidying up ...    @ Sun Jul 15 11:21:21 UTC 2018 (1531653681335)
   [jmeter] ... end of run
     [echo] TEST_HTTPS output files compared OK

batchtest:
     [echo] Starting TestCookieManager with file TestCookieManager.jmx using -X -Jdummy=dummy
   [jmeter] SLF4J: Class path contains multiple SLF4J bindings.
   [jmeter] SLF4J: Found binding in [jar:<https://builds.apache.org/job/JMeter%20Ubuntu/ws/trunk/lib/log4j-slf4j-impl-2.10.0.jar!/org/slf4j/impl/StaticLoggerBinder.class]>
   [jmeter] SLF4J: Found binding in [jar:<https://builds.apache.org/job/JMeter%20Ubuntu/ws/trunk/lib/opt/activemq-all-5.15.2.jar!/org/slf4j/impl/StaticLoggerBinder.class]>
   [jmeter] SLF4J: See http://www.slf4j.org/codes.html#multiple_bindings for an explanation.
   [jmeter] SLF4J: Actual binding is of type [org.apache.logging.slf4j.Log4jLoggerFactory]
   [jmeter] Creating summariser <summary>
   [jmeter] Created the tree successfully using testfiles/TestCookieManager.jmx
   [jmeter] Starting the test @ Sun Jul 15 11:21:23 UTC 2018 (1531653683749)
   [jmeter] Waiting for possible Shutdown/StopTestNow/Heapdump message on port 4445
   [jmeter] summary =     10 in 00:00:01 =    7.5/s Avg:    91 Min:     1 Max:   454 Err:
    0 (0.00%)
   [jmeter] Tidying up ...    @ Sun Jul 15 11:21:26 UTC 2018 (1531653686203)
   [jmeter] ... end of run
     [echo] TestCookieManager output files compared OK

batchtest:
     [echo] Starting TCP_TESTS with file TCP_TESTS.jmx using -X -Jdummy=dummy
   [jmeter] SLF4J: Class path contains multiple SLF4J bindings.
   [jmeter] SLF4J: Found binding in [jar:<https://builds.apache.org/job/JMeter%20Ubuntu/ws/trunk/lib/log4j-slf4j-impl-2.10.0.jar!/org/slf4j/impl/StaticLoggerBinder.class]>
   [jmeter] SLF4J: Found binding in [jar:<https://builds.apache.org/job/JMeter%20Ubuntu/ws/trunk/lib/opt/activemq-all-5.15.2.jar!/org/slf4j/impl/StaticLoggerBinder.class]>
   [jmeter] SLF4J: See http://www.slf4j.org/codes.html#multiple_bindings for an explanation.
   [jmeter] SLF4J: Actual binding is of type [org.apache.logging.slf4j.Log4jLoggerFactory]
   [jmeter] Creating summariser <summary>
   [jmeter] Created the tree successfully using testfiles/TCP_TESTS.jmx
   [jmeter] Starting the test @ Sun Jul 15 11:21:29 UTC 2018 (1531653689619)
   [jmeter] Waiting for possible Shutdown/StopTestNow/Heapdump message on port 4445
   [jmeter] summary +      1 in 00:00:01 =    1.1/s Avg:   896 Min:   896 Max:   896 Err:
    0 (0.00%) Active: 1 Started: 1 Finished: 0
   [jmeter] 15/07/2018 11:21:34
   [jmeter] 
   [jmeter] 
   [jmeter] summary +     10 in 00:00:04 =    2.3/s Avg:   305 Min:     0 Max:  1020 Err:
    0 (0.00%) Active: 0 Started: 1 Finished: 1
   [jmeter] summary =     11 in 00:00:05 =    2.1/s Avg:   359 Min:     0 Max:  1020 Err:
    0 (0.00%)
   [jmeter] Tidying up ...    @ Sun Jul 15 11:21:36 UTC 2018 (1531653696072)
   [jmeter] ... end of run
   [concat] 2018-07-15 11:21:33,980 ERROR o.a.j.p.t.s.TCPSampler: 
   [concat] org.apache.jmeter.protocol.tcp.sampler.ReadException: Error reading from server,
bytes read: 0
   [concat] 	at org.apache.jmeter.protocol.tcp.sampler.TCPClientImpl.read(TCPClientImpl.java:131)
~[ApacheJMeter_tcp.jar:4.1-SNAPSHOT r1835966]
   [concat] 	at org.apache.jmeter.protocol.tcp.sampler.TCPSampler.sample(TCPSampler.java:402)
[ApacheJMeter_tcp.jar:4.1-SNAPSHOT r1835966]
   [concat] 	at org.apache.jmeter.threads.JMeterThread.doSampling(JMeterThread.java:622) [ApacheJMeter_core.jar:4.1-SNAPSHOT
r1835966]
   [concat] 	at org.apache.jmeter.threads.JMeterThread.executeSamplePackage(JMeterThread.java:546)
[ApacheJMeter_core.jar:4.1-SNAPSHOT r1835966]
   [concat] 	at org.apache.jmeter.threads.JMeterThread.processSampler(JMeterThread.java:486)
[ApacheJMeter_core.jar:4.1-SNAPSHOT r1835966]
   [concat] 	at org.apache.jmeter.threads.JMeterThread.run(JMeterThread.java:253) [ApacheJMeter_core.jar:4.1-SNAPSHOT
r1835966]
   [concat] 	at java.lang.Thread.run(Thread.java:748) [?:1.8.0_172]
   [concat] Caused by: java.net.SocketTimeoutException: Read timed out
   [concat] 	at java.net.SocketInputStream.socketRead0(Native Method) ~[?:1.8.0_172]
   [concat] 	at java.net.SocketInputStream.socketRead(SocketInputStream.java:116) ~[?:1.8.0_172]
   [concat] 	at java.net.SocketInputStream.read(SocketInputStream.java:171) ~[?:1.8.0_172]
   [concat] 	at java.net.SocketInputStream.read(SocketInputStream.java:141) ~[?:1.8.0_172]
   [concat] 	at java.net.SocketInputStream.read(SocketInputStream.java:127) ~[?:1.8.0_172]
   [concat] 	at org.apache.jmeter.protocol.tcp.sampler.TCPClientImpl.read(TCPClientImpl.java:114)
~[ApacheJMeter_tcp.jar:4.1-SNAPSHOT r1835966]
   [concat] 	... 6 more
   [concat] 2018-07-15 11:21:35,066 ERROR o.a.j.p.t.s.TCPSampler: 
   [concat] org.apache.jmeter.protocol.tcp.sampler.ReadException: 
   [concat] 	at org.apache.jmeter.protocol.tcp.sampler.BinaryTCPClientImpl.read(BinaryTCPClientImpl.java:152)
~[ApacheJMeter_tcp.jar:4.1-SNAPSHOT r1835966]
   [concat] 	at org.apache.jmeter.protocol.tcp.sampler.TCPSampler.sample(TCPSampler.java:402)
[ApacheJMeter_tcp.jar:4.1-SNAPSHOT r1835966]
   [concat] 	at org.apache.jmeter.threads.JMeterThread.doSampling(JMeterThread.java:622) [ApacheJMeter_core.jar:4.1-SNAPSHOT
r1835966]
   [concat] 	at org.apache.jmeter.threads.JMeterThread.executeSamplePackage(JMeterThread.java:546)
[ApacheJMeter_core.jar:4.1-SNAPSHOT r1835966]
   [concat] 	at org.apache.jmeter.threads.JMeterThread.processSampler(JMeterThread.java:486)
[ApacheJMeter_core.jar:4.1-SNAPSHOT r1835966]
   [concat] 	at org.apache.jmeter.threads.JMeterThread.run(JMeterThread.java:253) [ApacheJMeter_core.jar:4.1-SNAPSHOT
r1835966]
   [concat] 	at java.lang.Thread.run(Thread.java:748) [?:1.8.0_172]
   [concat] Caused by: java.net.SocketTimeoutException: Read timed out
   [concat] 	at java.net.SocketInputStream.socketRead0(Native Method) ~[?:1.8.0_172]
   [concat] 	at java.net.SocketInputStream.socketRead(SocketInputStream.java:116) ~[?:1.8.0_172]
   [concat] 	at java.net.SocketInputStream.read(SocketInputStream.java:171) ~[?:1.8.0_172]
   [concat] 	at java.net.SocketInputStream.read(SocketInputStream.java:141) ~[?:1.8.0_172]
   [concat] 	at java.net.SocketInputStream.read(SocketInputStream.java:127) ~[?:1.8.0_172]
   [concat] 	at org.apache.jmeter.protocol.tcp.sampler.BinaryTCPClientImpl.read(BinaryTCPClientImpl.java:134)
~[ApacheJMeter_tcp.jar:4.1-SNAPSHOT r1835966]
   [concat] 	... 6 more
   [concat] 2018-07-15 11:21:35,084 WARN o.a.j.p.t.s.TCPSampler: Could not create socket for
tcp://localhost:2223
   [concat] java.net.ConnectException: Connection refused (Connection refused)
   [concat] 	at java.net.PlainSocketImpl.socketConnect(Native Method) ~[?:1.8.0_172]
   [concat] 	at java.net.AbstractPlainSocketImpl.doConnect(AbstractPlainSocketImpl.java:350)
~[?:1.8.0_172]
   [concat] 	at java.net.AbstractPlainSocketImpl.connectToAddress(AbstractPlainSocketImpl.java:206)
~[?:1.8.0_172]
   [concat] 	at java.net.AbstractPlainSocketImpl.connect(AbstractPlainSocketImpl.java:188)
~[?:1.8.0_172]
   [concat] 	at java.net.SocksSocketImpl.connect(SocksSocketImpl.java:392) ~[?:1.8.0_172]
   [concat] 	at java.net.Socket.connect(Socket.java:589) ~[?:1.8.0_172]
   [concat] 	at org.apache.jmeter.protocol.tcp.sampler.TCPSampler.getSocket(TCPSampler.java:168)
[ApacheJMeter_tcp.jar:4.1-SNAPSHOT r1835966]
   [concat] 	at org.apache.jmeter.protocol.tcp.sampler.TCPSampler.sample(TCPSampler.java:384)
[ApacheJMeter_tcp.jar:4.1-SNAPSHOT r1835966]
   [concat] 	at org.apache.jmeter.threads.JMeterThread.doSampling(JMeterThread.java:622) [ApacheJMeter_core.jar:4.1-SNAPSHOT
r1835966]
   [concat] 	at org.apache.jmeter.threads.JMeterThread.executeSamplePackage(JMeterThread.java:546)
[ApacheJMeter_core.jar:4.1-SNAPSHOT r1835966]
   [concat] 	at org.apache.jmeter.threads.JMeterThread.processSampler(JMeterThread.java:486)
[ApacheJMeter_core.jar:4.1-SNAPSHOT r1835966]
   [concat] 	at org.apache.jmeter.threads.JMeterThread.run(JMeterThread.java:253) [ApacheJMeter_core.jar:4.1-SNAPSHOT
r1835966]
   [concat] 	at java.lang.Thread.run(Thread.java:748) [?:1.8.0_172]
   [concat] 2018-07-15 11:21:35,160 WARN o.a.j.p.t.s.TCPSampler: Unknown host for tcp://localhostXXXX:2223
   [concat] java.net.UnknownHostException: localhostXXXX
   [concat] 	at java.net.AbstractPlainSocketImpl.connect(AbstractPlainSocketImpl.java:184)
~[?:1.8.0_172]
   [concat] 	at java.net.SocksSocketImpl.connect(SocksSocketImpl.java:392) ~[?:1.8.0_172]
   [concat] 	at java.net.Socket.connect(Socket.java:589) ~[?:1.8.0_172]
   [concat] 	at org.apache.jmeter.protocol.tcp.sampler.TCPSampler.getSocket(TCPSampler.java:168)
[ApacheJMeter_tcp.jar:4.1-SNAPSHOT r1835966]
   [concat] 	at org.apache.jmeter.protocol.tcp.sampler.TCPSampler.sample(TCPSampler.java:384)
[ApacheJMeter_tcp.jar:4.1-SNAPSHOT r1835966]
   [concat] 	at org.apache.jmeter.threads.JMeterThread.doSampling(JMeterThread.java:622) [ApacheJMeter_core.jar:4.1-SNAPSHOT
r1835966]
   [concat] 	at org.apache.jmeter.threads.JMeterThread.executeSamplePackage(JMeterThread.java:546)
[ApacheJMeter_core.jar:4.1-SNAPSHOT r1835966]
   [concat] 	at org.apache.jmeter.threads.JMeterThread.processSampler(JMeterThread.java:486)
[ApacheJMeter_core.jar:4.1-SNAPSHOT r1835966]
   [concat] 	at org.apache.jmeter.threads.JMeterThread.run(JMeterThread.java:253) [ApacheJMeter_core.jar:4.1-SNAPSHOT
r1835966]
   [concat] 	at java.lang.Thread.run(Thread.java:748) [?:1.8.0_172]
   [concat] 2018-07-15 11:21:35,164 ERROR o.a.j.p.t.s.TCPSampler: Could not find protocol
class 'org.foo.xxx'
     [echo] TCP_TESTS output files compared OK

batchtest:
     [echo] Starting JDBC_TESTS with file JDBC_TESTS.jmx using -X -Jdummy=dummy
   [jmeter] SLF4J: Class path contains multiple SLF4J bindings.
   [jmeter] SLF4J: Found binding in [jar:<https://builds.apache.org/job/JMeter%20Ubuntu/ws/trunk/lib/log4j-slf4j-impl-2.10.0.jar!/org/slf4j/impl/StaticLoggerBinder.class]>
   [jmeter] SLF4J: Found binding in [jar:<https://builds.apache.org/job/JMeter%20Ubuntu/ws/trunk/lib/opt/activemq-all-5.15.2.jar!/org/slf4j/impl/StaticLoggerBinder.class]>
   [jmeter] SLF4J: See http://www.slf4j.org/codes.html#multiple_bindings for an explanation.
   [jmeter] SLF4J: Actual binding is of type [org.apache.logging.slf4j.Log4jLoggerFactory]
   [jmeter] Creating summariser <summary>
   [jmeter] Created the tree successfully using testfiles/JDBC_TESTS.jmx
   [jmeter] Starting the test @ Sun Jul 15 11:21:38 UTC 2018 (1531653698657)
   [jmeter] Waiting for possible Shutdown/StopTestNow/Heapdump message on port 4445
   [jmeter] summary =     21 in 00:00:02 =   13.3/s Avg:    27 Min:     0 Max:   502 Err:
    0 (0.00%)
   [jmeter] Tidying up ...    @ Sun Jul 15 11:21:41 UTC 2018 (1531653701494)
   [jmeter] ... end of run
   [concat] 2018-07-15 11:21:41,464 ERROR o.a.j.t.JMeterThread: Error while processing sampler:
'JDBC_With_Failing_PreProcessor'.
   [concat] java.lang.IllegalArgumentException: Variable Name must not be null in JDBC PreProcessor
   [concat] 	at org.apache.jmeter.protocol.jdbc.processor.AbstractJDBCProcessor.process(AbstractJDBCProcessor.java:45)
~[ApacheJMeter_jdbc.jar:4.1-SNAPSHOT r1835966]
   [concat] 	at org.apache.jmeter.protocol.jdbc.processor.JDBCPreProcessor.process(JDBCPreProcessor.java:33)
~[ApacheJMeter_jdbc.jar:4.1-SNAPSHOT r1835966]
   [concat] 	at org.apache.jmeter.threads.JMeterThread.runPreProcessors(JMeterThread.java:935)
~[ApacheJMeter_core.jar:4.1-SNAPSHOT r1835966]
   [concat] 	at org.apache.jmeter.threads.JMeterThread.executeSamplePackage(JMeterThread.java:537)
~[ApacheJMeter_core.jar:4.1-SNAPSHOT r1835966]
   [concat] 	at org.apache.jmeter.threads.JMeterThread.processSampler(JMeterThread.java:486)
[ApacheJMeter_core.jar:4.1-SNAPSHOT r1835966]
   [concat] 	at org.apache.jmeter.threads.JMeterThread.run(JMeterThread.java:253) [ApacheJMeter_core.jar:4.1-SNAPSHOT
r1835966]
   [concat] 	at java.lang.Thread.run(Thread.java:748) [?:1.8.0_172]
   [concat] 2018-07-15 11:21:41,475 ERROR o.a.j.t.JMeterThread: Error while processing sampler:
'JDBC_With_Failing_PostProcessor'.
   [concat] java.lang.IllegalArgumentException: Variable Name must not be null in JDBC PostProcessor
   [concat] 	at org.apache.jmeter.protocol.jdbc.processor.AbstractJDBCProcessor.process(AbstractJDBCProcessor.java:45)
~[ApacheJMeter_jdbc.jar:4.1-SNAPSHOT r1835966]
   [concat] 	at org.apache.jmeter.protocol.jdbc.processor.JDBCPostProcessor.process(JDBCPostProcessor.java:33)
~[ApacheJMeter_jdbc.jar:4.1-SNAPSHOT r1835966]
   [concat] 	at org.apache.jmeter.threads.JMeterThread.runPostProcessors(JMeterThread.java:925)
~[ApacheJMeter_core.jar:4.1-SNAPSHOT r1835966]
   [concat] 	at org.apache.jmeter.threads.JMeterThread.executeSamplePackage(JMeterThread.java:564)
~[ApacheJMeter_core.jar:4.1-SNAPSHOT r1835966]
   [concat] 	at org.apache.jmeter.threads.JMeterThread.processSampler(JMeterThread.java:486)
[ApacheJMeter_core.jar:4.1-SNAPSHOT r1835966]
   [concat] 	at org.apache.jmeter.threads.JMeterThread.run(JMeterThread.java:253) [ApacheJMeter_core.jar:4.1-SNAPSHOT
r1835966]
   [concat] 	at java.lang.Thread.run(Thread.java:748) [?:1.8.0_172]
   [concat] 2018-07-15 11:21:41,476 WARN o.a.j.p.j.p.AbstractJDBCProcessor: SQL Problem in
JDBC PreProcessor: java.sql.SQLSyntaxErrorException: unexpected token: USERS
   [concat] 2018-07-15 11:21:41,488 WARN o.a.j.p.j.p.AbstractJDBCProcessor: SQL Problem in
JDBC PostProcessor: java.sql.SQLSyntaxErrorException: unexpected token: USERS
     [echo] JDBC_TESTS output files compared OK

batchtest:
     [echo] Starting JMS_TESTS with file JMS_TESTS.jmx using -X -Jdummy=dummy
   [jmeter] SLF4J: Class path contains multiple SLF4J bindings.
   [jmeter] SLF4J: Found binding in [jar:<https://builds.apache.org/job/JMeter%20Ubuntu/ws/trunk/lib/log4j-slf4j-impl-2.10.0.jar!/org/slf4j/impl/StaticLoggerBinder.class]>
   [jmeter] SLF4J: Found binding in [jar:<https://builds.apache.org/job/JMeter%20Ubuntu/ws/trunk/lib/opt/activemq-all-5.15.2.jar!/org/slf4j/impl/StaticLoggerBinder.class]>
   [jmeter] SLF4J: See http://www.slf4j.org/codes.html#multiple_bindings for an explanation.
   [jmeter] SLF4J: Actual binding is of type [org.apache.logging.slf4j.Log4jLoggerFactory]
   [jmeter] Creating summariser <summary>
   [jmeter] Created the tree successfully using testfiles/JMS_TESTS.jmx
   [jmeter] Starting the test @ Sun Jul 15 11:21:44 UTC 2018 (1531653704215)
   [jmeter] Waiting for possible Shutdown/StopTestNow/Heapdump message on port 4445
   [jmeter] summary +     19 in 00:00:17 =    1.1/s Avg:   562 Min:     1 Max:  3024 Err:
    0 (0.00%) Active: 1 Started: 3 Finished: 2
   [jmeter] summary +      8 in 00:00:20 =    0.4/s Avg:   762 Min:     0 Max:  3000 Err:
    0 (0.00%) Active: 0 Started: 1 Finished: 1
   [jmeter] summary =     27 in 00:00:37 =    0.7/s Avg:   621 Min:     0 Max:  3024 Err:
    0 (0.00%)
   [jmeter] Tidying up ...    @ Sun Jul 15 11:22:21 UTC 2018 (1531653741969)
   [jmeter] ... end of run
     [echo] JMS_TESTS output files compared OK

batchtest:
     [echo] Starting OS_TESTS with file OS_TESTS.jmx using -X -Jdummy=dummy
   [jmeter] SLF4J: Class path contains multiple SLF4J bindings.
   [jmeter] SLF4J: Found binding in [jar:<https://builds.apache.org/job/JMeter%20Ubuntu/ws/trunk/lib/log4j-slf4j-impl-2.10.0.jar!/org/slf4j/impl/StaticLoggerBinder.class]>
   [jmeter] SLF4J: Found binding in [jar:<https://builds.apache.org/job/JMeter%20Ubuntu/ws/trunk/lib/opt/activemq-all-5.15.2.jar!/org/slf4j/impl/StaticLoggerBinder.class]>
   [jmeter] SLF4J: See http://www.slf4j.org/codes.html#multiple_bindings for an explanation.
   [jmeter] SLF4J: Actual binding is of type [org.apache.logging.slf4j.Log4jLoggerFactory]
   [jmeter] Creating summariser <summary>
   [jmeter] Created the tree successfully using testfiles/OS_TESTS.jmx
   [jmeter] Starting the test @ Sun Jul 15 11:22:24 UTC 2018 (1531653744959)
   [jmeter] Waiting for possible Shutdown/StopTestNow/Heapdump message on port 4445
   [jmeter] summary =      3 in 00:00:02 =    1.5/s Avg:   338 Min:     2 Max:  1003 Err:
    0 (0.00%)
   [jmeter] Tidying up ...    @ Sun Jul 15 11:22:27 UTC 2018 (1531653747221)
   [jmeter] ... end of run
     [echo] OS_TESTS output files compared OK

batchtest:
     [echo] Starting FTP_TESTS with file FTP_TESTS.jmx using -X -Jdummy=dummy
   [jmeter] SLF4J: Class path contains multiple SLF4J bindings.
   [jmeter] SLF4J: Found binding in [jar:<https://builds.apache.org/job/JMeter%20Ubuntu/ws/trunk/lib/log4j-slf4j-impl-2.10.0.jar!/org/slf4j/impl/StaticLoggerBinder.class]>
   [jmeter] SLF4J: Found binding in [jar:<https://builds.apache.org/job/JMeter%20Ubuntu/ws/trunk/lib/opt/activemq-all-5.15.2.jar!/org/slf4j/impl/StaticLoggerBinder.class]>
   [jmeter] SLF4J: See http://www.slf4j.org/codes.html#multiple_bindings for an explanation.
   [jmeter] SLF4J: Actual binding is of type [org.apache.logging.slf4j.Log4jLoggerFactory]
   [jmeter] Creating summariser <summary>
   [jmeter] Created the tree successfully using testfiles/FTP_TESTS.jmx
   [jmeter] Starting the test @ Sun Jul 15 11:22:29 UTC 2018 (1531653749769)
   [jmeter] Waiting for possible Shutdown/StopTestNow/Heapdump message on port 4445
   [jmeter] summary +      1 in 00:00:01 =    1.0/s Avg:   978 Min:   978 Max:   978 Err:
    0 (0.00%) Active: 1 Started: 1 Finished: 0
   [jmeter] summary +      5 in 00:00:02 =    3.3/s Avg:    49 Min:    13 Max:   100 Err:
    0 (0.00%) Active: 0 Started: 1 Finished: 1
   [jmeter] summary =      6 in 00:00:03 =    2.4/s Avg:   203 Min:    13 Max:   978 Err:
    0 (0.00%)
   [jmeter] Tidying up ...    @ Sun Jul 15 11:22:33 UTC 2018 (1531653753419)
   [jmeter] ... end of run
     [echo] FTP_TESTS output files compared OK

batchtest:
     [echo] Starting Bug60607 with file Bug60607.jmx using -X -Jdummy=dummy
   [jmeter] SLF4J: Class path contains multiple SLF4J bindings.
   [jmeter] SLF4J: Found binding in [jar:<https://builds.apache.org/job/JMeter%20Ubuntu/ws/trunk/lib/log4j-slf4j-impl-2.10.0.jar!/org/slf4j/impl/StaticLoggerBinder.class]>
   [jmeter] SLF4J: Found binding in [jar:<https://builds.apache.org/job/JMeter%20Ubuntu/ws/trunk/lib/opt/activemq-all-5.15.2.jar!/org/slf4j/impl/StaticLoggerBinder.class]>
   [jmeter] SLF4J: See http://www.slf4j.org/codes.html#multiple_bindings for an explanation.
   [jmeter] SLF4J: Actual binding is of type [org.apache.logging.slf4j.Log4jLoggerFactory]
   [jmeter] Creating summariser <summary>
   [jmeter] Created the tree successfully using testfiles/Bug60607.jmx
   [jmeter] Starting the test @ Sun Jul 15 11:22:35 UTC 2018 (1531653755829)
   [jmeter] Waiting for possible Shutdown/StopTestNow/Heapdump message on port 4445
   [jmeter] summary =      2 in 00:00:31 =    0.1/s Avg: 15257 Min:   409 Max: 30106 Err:
    0 (0.00%)
   [jmeter] Tidying up ...    @ Sun Jul 15 11:23:07 UTC 2018 (1531653787349)
   [jmeter] ... end of run
     [echo] Bug60607 output files compared OK

batchtest:
     [echo] Starting SlowCharsFeature_HttpClient4 with file SlowCharsFeature.jmx using -X
-Jdummy=dummy
   [jmeter] SLF4J: Class path contains multiple SLF4J bindings.
   [jmeter] SLF4J: Found binding in [jar:<https://builds.apache.org/job/JMeter%20Ubuntu/ws/trunk/lib/log4j-slf4j-impl-2.10.0.jar!/org/slf4j/impl/StaticLoggerBinder.class]>
   [jmeter] SLF4J: Found binding in [jar:<https://builds.apache.org/job/JMeter%20Ubuntu/ws/trunk/lib/opt/activemq-all-5.15.2.jar!/org/slf4j/impl/StaticLoggerBinder.class]>
   [jmeter] SLF4J: See http://www.slf4j.org/codes.html#multiple_bindings for an explanation.
   [jmeter] SLF4J: Actual binding is of type [org.apache.logging.slf4j.Log4jLoggerFactory]
   [jmeter] Creating summariser <summary>
   [jmeter] Created the tree successfully using testfiles/SlowCharsFeature.jmx
   [jmeter] Starting the test @ Sun Jul 15 11:23:10 UTC 2018 (1531653790379)
   [jmeter] Waiting for possible Shutdown/StopTestNow/Heapdump message on port 4445
   [jmeter] summary =      5 in 00:00:31 =    0.2/s Avg:  6152 Min:   535 Max: 10980 Err:
    1 (20.00%)
   [jmeter] Tidying up ...    @ Sun Jul 15 11:23:42 UTC 2018 (1531653822325)
   [jmeter] ... end of run

BUILD FAILED
<https://builds.apache.org/job/JMeter%20Ubuntu/ws/trunk/build.xml>:2956: The following
error occurred while executing this line:
<https://builds.apache.org/job/JMeter%20Ubuntu/ws/trunk/build.xml>:2779: CSV Files are
not identical.
        <https://builds.apache.org/job/JMeter%20Ubuntu/ws/trunk/bin/testfiles/SlowCharsFeature_HttpClient4.csv>
        label,responseCode,responseMessage,threadName,dataType,success
JSS_setCPS,200,OK,setUp Thread Group 1-1,text,true
ApacheJMeter-HP-NonSecure,206,Partial Content,Thread Group 1-1,text,true
ApacheJMeter-HP-Secure,206,Partial Content,Thread Group 1-1,text,true
HTTPS-SNI-without-timeout,206,Partial Content,Thread Group 1-1,text,true
HTTPS-SNI-with-timeout,206,Partial Content,Thread Group 1-1,text,true

        <https://builds.apache.org/job/JMeter%20Ubuntu/ws/trunk/bin/SlowCharsFeature_HttpClient4.csv>
        label,responseCode,responseMessage,threadName,dataType,success
JSS_setCPS,200,OK,setUp Thread Group 1-1,text,true
ApacheJMeter-HP-NonSecure,206,Partial Content,Thread Group 1-1,text,true
ApacheJMeter-HP-Secure,206,Partial Content,Thread Group 1-1,text,true
HTTPS-SNI-without-timeout,206,Partial Content,Thread Group 1-1,text,false
HTTPS-SNI-with-timeout,206,Partial Content,Thread Group 1-1,text,true

Total time: 7 minutes 19 seconds
Build step 'Invoke Ant' marked build as failure
WARN: Unable to locate 'report-task.txt' in the workspace. Did the SonarScanner succedeed?
[locks-and-latches] Releasing all the locks
[locks-and-latches] All the locks released

Mime
View raw message